{"text_format":"1","workbook":"xlsx","n_sheets":10,"sheets":["Home","Dashboard","Project Details","Project Plans","Risks & Issues","Settings","Sorting","Calculations","Gantt View","Help"],"not_rendered":{"charts":9,"images":18,"macros":1,"external_links":0,"defined_names":36,"comments":1,"pivot_tables":0},"unopened":[],"bounds":{"document_bytes":16777216,"sheet_cells":100000,"rows_first":2000,"rows_last":500,"rows_between":2000,"halvings":0,"cell_chars":16384,"cell_head_chars":4096},"cells_cut":0,"cells_raw":0,"read":"whole","date_system":"1900"}

{"sheet":"Home","index":0,"n_rows":14,"n_cols":9,"rows_kept":14,"cut":false,"hidden":false,"merged":[]}
[]
[]
[]
[]
[null,"Welcome to Project Portfolio Dashboard. Follow these instructions to use the dashboard."]
[]
[null,1,"Enter high level project details in Project Details tab",null,null,null,null,null,{"$f":"Calculations!C4&\" projects specified\"","v":"8 projects specified"}]
[null,2,"Enter Individual project plan details in Project Plans page",null,null,null,null,null,{"$f":"COUNTA('Project Plans'!2:2)&\" plans specified\"","v":"10 plans specified"}]
{"$rows_left_out":7}
{"sheet":"Dashboard","index":1,"n_rows":32,"n_cols":21,"rows_kept":32,"cut":false,"hidden":false,"merged":[[5,6,8,6],[10,6,13,6],[15,6,18,6],[20,6,23,6],[25,6,28,6]]}
[]
[]
[]
[]
[]
[null,null,{"$f":"Calculations!C9","v":"Riggs-A-lot decomissioning"}]
[null,null,{"$f":"Calculations!G9","v":0.5},{"$f":"C7","v":0.5},{"$f":"Calculations!I9","v":"$ 377k"},{"$f":"Calculations!H9","v":"3 months"}]
[]
{"$rows_left_out":25}
{"sheet":"Project Details","index":2,"n_rows":52,"n_cols":12,"rows_kept":52,"cut":false,"hidden":false,"merged":[]}
[]
[]
[null,"Project Names & Contact details",null,null,"Team Details"]
[]
[null,"ID","Project Name","Project Owner","Email","Phone","Budget ($)","Spent ($)","Deadline","% Done","Team Size","Comments"]
[null,1,"ABC Integration","Adam Albert","alberta@project.com","758-072-8357",484000,392910,"2014-04-12",0.84,20,"We need to focus on this project. It is going to be superb failure."]
[null,2,"Morlott Highway","Benny Brown","brownb@project.com","663-179-7666",382000,304893,"2014-07-13",0.91,15,"We need to be clam on this project. It is going to be massive story."]
[null,3,"Riggs-A-lot decomissioning","Cathernie Crown","crownc@project.com","396-233-5326",377000,222122,"2013-03-14",0.5,35,"We need to be clam on this project. It is going to be superb success."]
{"$rows_left_out":45}
{"sheet":"Project Plans","index":3,"n_rows":45,"n_cols":79,"rows_kept":45,"cut":false,"hidden":false,"merged":[]}
[]
[null,"Project 1",null,null,null,null,null,null,null,"Project 2",null,null,null,null,null,null,null,"Project 3",null,null,null,null,null,null,null,"Project 4",null,null,null,null,null,null,null,"Project 5",null,null,null,null,null,null,null,"Project 6",null,null,null,null,null,null,null,"Project 7",null,null,null,null,null,null,null,"Project 8",null,null,null,null,null,null,null,"Project 9",null,null,null,null,null,null,null,"Project 10"]
[null,{"$f":"INDEX(lstProjects,1)","v":"ABC Integration"},null,null,null,null,null,null,null,{"$f":"INDEX(lstProjects,2)","v":"Morlott Highway"},null,null,null,null,null,null,null,{"$f":"INDEX(lstProjects,3)","v":"Riggs-A-lot decomissioning"},null,null,null,null,null,null,null,{"$f":"INDEX(lstProjects,4)","v":"12th Annual Customer Convention"},null,null,null,null,null,null,null,{"$f":"INDEX(lstProjects,5)","v":"Six Sigma Assessment"},null,null,null,null,null,null,null,{"$f":"INDEX(lstProjects,6)","v":"CBM Development"},null,null,null,null,null,null,null,{"$f":"INDEX(lstProjects,7)","v":"ASSOC Maintenance"},null,null,null,null,null,null,null,{"$f":"INDEX(lstProjects,8)","v":"HRM Rollout"},null,null,null,null,null,null,null,{"$f":"INDEX(lstProjects,9)","v":{"$error":"#REF!"}},null,null,null,null,null,null,null,{"$f":"INDEX(lstProjects,10)","v":{"$error":"#REF!"}}]
[]
[null,"Activity","Start Date","Duration","% done","Budget ($)","Actual ($)",null,null,"Activity","Start Date","Duration","% done","Budget ($)","Actual ($)",null,null,"Activity","Start Date","Duration","% done","Budget ($)","Actual ($)",null,null,"Activity","Start Date","Duration","% done","Budget ($)","Actual ($)",null,null,"Activity","Start Date","Duration","% done","Budget ($)","Actual ($)",null,null,"Activity","Start Date","Duration","% done","Budget ($)","Actual ($)",null,null,"Activity","Start Date","Duration","% done","Budget ($)","Actual ($)",null,null,"Activity","Start Date","Duration","% done","Budget ($)","Actual ($)",null,null,"Activity","Start Date","Duration","% done","Budget ($)","Actual ($)",null,null,"Activity","Start Date","Duration","% done","Budget ($)","Actual ($)"]
[null,"Activity 1","2011-08-27",14,0.77,5000,3176,null,null,"Activity 1","2011-09-26",14,0.89,4000,3234,null,null,"Activity 1","2011-08-27",14,0.89,5000,4298,null,null,"Activity 1","2011-08-27",21,0.83,5000,2210,null,null,"Activity 1","2011-08-27",14,0.83,3000,2338,null,null,"Activity 1","2011-08-27",21,0.8,3000,159,null,null,"Activity 1","2011-08-27",14,0.77,2000,1243,null,null,"Activity 1","2011-08-27",21,0.83,1000,291,null,null,"Activity 1","2011-09-26",14,0.89,1000,343,null,null,"Activity 1","2011-08-27",21,0.76,5000,1965]
[null,"Activity 2","2011-09-15",21,0.17,1000,119,null,null,"Activity 2","2011-10-13",7,0.14000000000000001,4000,227,null,null,"Activity 2","2011-09-12",7,0,1000,0,null,null,"Activity 2","2011-09-09",21,0,1000,0,null,null,"Activity 2","2011-09-07",14,0.19,1000,139,null,null,"Activity 2","2011-09-07",7,0.38,2000,46,null,null,"Activity 2","2011-09-14",21,0.3,4000,521,null,null,"Activity 2","2011-09-14",7,0,1000,0,null,null,"Activity 2","2011-10-12",14,0.47,3000,458,null,null,"Activity 2","2011-09-06",7,0.26,5000,96]
[null,"Activity 3","2011-10-04",14,0.51,4000,262,null,null,"Activity 3","2011-10-31",14,0.3,4000,914,null,null,"Activity 3","2011-09-26",7,0,5000,0,null,null,"Activity 3","2011-09-20",14,0,2000,0,null,null,"Activity 3","2011-09-26",7,0,2000,0,null,null,"Activity 3","2011-09-26",7,0.56000000000000005,1000,293,null,null,"Activity 3","2011-09-27",14,0,1000,0,null,null,"Activity 3","2011-09-23",14,0,5000,0,null,null,"Activity 3","2011-11-01",7,0.14000000000000001,3000,43,null,null,"Activity 3","2011-09-21",14,0.37,1000,227]
{"$rows_left_out":38}
{"sheet":"Risks & Issues","index":4,"n_rows":28,"n_cols":15,"rows_kept":28,"cut":false,"hidden":false,"merged":[]}
[]
[null,"Risks",null,null,null,"(1 to 5)",null,null,"Issues",null,null,null,"(1 to 5)"]
[null,"ID","In Project","Risk Description","Mitigation Plan","Severity",null,null,"ID","In Project","Description","Assigned to","Criticality","Due date","Closed?"]
[null,1,"CBM Development","Some complicated risk","",1,null,null,1,"Riggs-A-lot decomissioning","Some very simple issue","Person Name13",2,"",""]
[null,2,"Riggs-A-lot decomissioning","Some very complicated risk","",1,null,null,2,"ABC Integration","Some very simple issue","Person Name13",3,"2012-12-05",""]
[null,3,"ASSOC Maintenance","Some very unforeseen risk","Our plan",4,null,null,3,"12th Annual Customer Convention","Some simple issue","Person Name3",3,"2012-11-30",""]
[null,4,"HRM Rollout","Some very simple risk","",5,null,null,4,"Riggs-A-lot decomissioning","Some very unforeseen issue","Person Name12",2,"2012-12-04",""]
[null,5,"12th Annual Customer Convention","Some very simple risk","",5,null,null,5,"12th Annual Customer Convention","Some very simple issue","Person Name3",5,"2012-12-06",""]
{"$rows_left_out":21}
{"sheet":"Settings","index":5,"n_rows":11,"n_cols":9,"rows_kept":11,"cut":false,"hidden":false,"merged":[[3,4,3,5],[3,7,3,8]]}
[]
[]
[]
[null,"List of Holidays",null,null,"Project Progress Traffic Light thresholds",null,null,"Prepared by"]
[null,"Date","Reason",null,"Green",0.75,null,"Name","John Doe"]
[null,"2012-01-01","New years eve",null,"Amber",0.4,null,"Email","john.doe@mail.com"]
[null,"2012-12-25","Christmas",null,null,null,null,"Date",{"$f":"TODAY()","v":"2012-11-19"}]
[null,"2013-01-01","New years eve"]
{"$rows_left_out":4}
{"sheet":"Sorting","index":6,"n_rows":64,"n_cols":15,"rows_kept":64,"cut":false,"hidden":true,"merged":[]}
[null,"Sorting Projects by Sort order Please do not edit this sheet"]
[null,null,null,null,null,null,null,null,null,20]
[null,"Sort Types",null,null,null,null,null,null,"Value","Disp"]
[null,"% Done (0 -> 100%)",1,null,null,null,null,"Max Risks",{"$f":"INDEX($C$15:$C$64,MATCH(MAX(H15:H64),H15:H64,0))","v":"CBM Development"},{"$f":"\"Most: \"&LEFT(I4,$J$2)&REPT(\"…\",LEN(I4)>$J$2)","v":"Most: CBM Development"}]
[null,"Due Date (Now -> Later)",1,null,null,null,null,"Max Open Issues",{"$f":"INDEX($C$15:$C$64,MATCH(MAX(G15:G64),G15:G64,0))","v":"ABC Integration"},{"$f":"\"Most: \"&LEFT(I5,$J$2)&REPT(\"…\",LEN(I5)>$J$2)","v":"Most: ABC Integration"}]
[null,"% Budget Spent (100 -> 0)",0]
[null,"Open Issues (a lot -> a few)",0,null,null,null,null,{"$f":"\"Showing top \"&IF(Calculations!$C$5=0,\"5\",(Calculations!$C$5+1)&\" to \"&(Calculations!$C$5+5))&\" projects \"&IF(valSortType=6,\"in \",\"by \")&LOWER(INDEX(lstSortTypes,valSortType))","v":"Showing top 5 projects by due date (now -> later)"}]
[null,"Risks (a lot -> a few)",0]
{"$rows_left_out":57}
{"sheet":"Calculations","index":7,"n_rows":164,"n_cols":36,"rows_kept":164,"cut":false,"hidden":true,"merged":[[1,34,4,34],[1,35,4,35]]}
[null,"Calculations Plese do not edit",null,null,null,"Program level calculations >>",null,null,null,null,null,null,null,null,null,"Totals",null,null,null,null,null,"Percents"]
[null,null,null,null,null,null,null,null,null,null,null,null,null,null,null,5,4,3,2,1,null,{"$f":"P2","v":5},{"$f":"Q2","v":4},3,2,1,null,null,null,null,20,"In next 6 months",{"$f":"COUNTIFS(F9:F13,\"<=\"&EDATE(TODAY(),6),F9:F13,\">\"&TODAY())","v":2},{"$f":"IF(AG2=1,\" project ends\",\" projects end\")","v":" projects end"},{"$f":"AG2&CHAR(10)&AG3&CHAR(10)&AG4&CHAR(10)&AG5","v":"2\n35\n41\n7"},{"$f":"AH2&CHAR(10)&AH3&CHAR(10)&AH4&CHAR(10)&AH5","v":" projects end\n activities start\n activities end\n issues due"}]
[null,"Selected Project",{"$f":"D3","v":3},3,null,"Total Projects",{"$f":"C4&\" Projects\"","v":"8 Projects"},null,"Total Budgets",{"$f":"SUM(tblProjects[Budget ($)])","v":3207000},{"$f":"TEXT(J3,\"$##,,.0\")&\" mn\"","v":"$3.2 mn"},"Total members",{"$f":"SUM(tblProjects[Team Size])&\" members\"","v":"225 members"},null,"Risks",{"$f":"COUNTIF(tblRisks[Severity],P$2)","v":6},{"$f":"COUNTIF(tblRisks[Severity],Q$2)","v":1},{"$f":"COUNTIF(tblRisks[Severity],R$2)","v":7},{"$f":"COUNTIF(tblRisks[Severity],S$2)","v":5},{"$f":"COUNTIF(tblRisks[Severity],T$2)","v":6},{"$f":"SUM(P3:T3)&\" Risks\"","v":"25 Risks"},{"$f":"P3/SUM($P3:$T3)","v":0.24},{"$f":"Q3/SUM($P3:$T3)","v":0.04},{"$f":"R3/SUM($P3:$T3)","v":0.28000000000000003},{"$f":"S3/SUM($P3:$T3)","v":0.2},{"$f":"T3/SUM($P3:$T3)","v":0.24},null,null,null,"Last project due by",{"$f":"MAX(F9:F13)","v":41567},"Starts",{"$f":"SUM(AF9:AF13)","v":35},{"$f":"IF(AG3=1,\" activity starts\", \" activities start\")","v":" activities start"}]
[null,"Count of Projects",{"$f":"COUNTA(lstProjects)","v":8},null,null,"Progress",{"$f":"SUMPRODUCT(tblProjects[% Done],tblProjects[Budget ($)])/J3","v":0.82439975054568138},null,"Total Spent",{"$f":"SUM(tblProjects[Spent ($)])","v":2409613},{"$f":"TEXT(J4,\"$##,,.0\")&\" mn spent\"","v":"$2.4 mn spent"},null,null,null,"Issues",{"$f":"COUNTIFS(tblIssues[Criticality],P$2,tblIssues[Closed?],\"<>Yes\")","v":3},{"$f":"COUNTIFS(tblIssues[Criticality],Q$2,tblIssues[Closed?],\"<>Yes\")","v":6},{"$f":"COUNTIFS(tblIssues[Criticality],R$2,tblIssues[Closed?],\"<>Yes\")","v":7},{"$f":"COUNTIFS(tblIssues[Criticality],S$2,tblIssues[Closed?],\"<>Yes\")","v":4},{"$f":"COUNTIFS(tblIssues[Criticality],T$2,tblIssues[Closed?],\"<>Yes\")","v":3},{"$f":"SUM(P4:T4)&\" Open\"","v":"23 Open"},{"$f":"P4/SUM($P4:$T4)","v":0.13043478260869565},0.2608695652173913,0.30434782608695654,0.17391304347826086,0.13043478260869565,null,null,null,"Last Project",{"$f":"INDEX($C$9:$C$13,MATCH(AE3,F9:F13,0))","v":"12th Annual Customer Convention"},"Ends",{"$f":"SUM(AG9:AG13)","v":41},{"$f":"IF(AG4=1,\" activity ends\", \" activities end\")","v":" activities end"}]
[null,"Offset ",0,null,null,null,null,null,"%",{"$f":"J4/J3","v":0.75136046149048952},null,null,null,null,null,null,null,null,null,null,null,null,null,null,null,null,null,null,null,"Display",{"$f":"\"Last: \"&LEFT(AE4,$AE$2)&REPT(\"…\",LEN(AE4)>$AE$2)&\" in \"&TEXT(AE3,\"mmm,yyyy\")","v":"Last: 12th Annual Customer… in Oct,2013"},"Issues",{"$f":"SUM(AH9:AH13)","v":7},{"$f":"IF(AG5=1,\" issue due\", \" issues due\")","v":" issues due"}]
[null,null,null,null,null,null,null,null,null,null,null,null,null,null,null,"\u0080",null,null,"a",null,null,"i",null,null,"~",null,"\u0080ia\u0091~"]
[null,null,null,null,null,null,null,null,null,null,null,null,null,">=3",null,"Display"]
["#","ID","Project","Budget","Spent","Due Date","% done","Due in","Budget Disp","Team Size","Table name","# of Tasks","# of issues","# of Risks",null,null,null,null,null,null,null,null,null,null,null,null,null,null,"Budget","Spent",null,"Activity Starts","Activity Completion","Issues Due"]
{"$rows_left_out":157}
{"sheet":"Gantt View","index":8,"n_rows":29,"n_cols":178,"rows_kept":29,"cut":false,"hidden":true,"merged":[[8,57,8,61],[9,72,9,76],[9,37,9,41],[8,92,8,96],[8,62,8,66],[8,67,8,71],[8,72,8,76],[8,77,8,81],[8,82,8,86],[8,87,8,91],[9,92,9,96],[8,32,8,36],[8,37,8,41],[8,42,8,46],[8,47,8,51],[8,52,8,56],[9,7,9,11],[9,77,9,81],[9,82,9,86],[9,12,9,16],[9,87,9,91],[9,17,9,21],[9,22,9,26],[9,27,9,31],[9,32,9,36],[9,42,9,46],[9,47,9,51],[9,52,9,56],[9,57,9,61],[9,62,9,66],[9,67,9,71],[8,7,8,11],[8,12,8,16],[8,17,8,21],[8,22,8,26],[8,27,8,31]]}
[null,"Gantt Views Please do not edit"]
[null,"Project Name",{"$f":"Calculations!C23","v":"HRM Rollout"}]
[null,"Project ID",{"$f":"Calculations!C22","v":8}]
[null,"Project Table Name",{"$f":"Calculations!C24","v":"plan8"}]
[null,null,null,null,null,null,"Dates ->",{"$f":"valGanttStart","v":40777},{"$f":"WORKDAY(H5,1)","v":40778},{"$f":"WORKDAY(I5,1)","v":40779},40780,40781,40784,40785,40786,40787,40788,40791,40792,40793,40794,40795,40798,40799,40800,40801,40802,40805,40806,40807,40808,40809,40812,40813,40814,40815,40816,40819,40820,40821,40822,40823,40826,40827,40828,40829,40830,40833,40834,40835,40836,40837,40840,40841,40842,40843,40844,40847,40848,40849,40850,40851,40854,40855,40856,40857,40858,40861,40862,40863,40864,40865,40868,{"$f":"WORKDAY(BU5,1)","v":40869},40870,40871,40872,40875,40876,40877,40878,40879,40882,40883,40884,40885,40886,40889,40890,40891,40892,40893,40896,40897,40898,40899,{"$f":"WORKDAY(CR5,1)","v":40900},{"$f":"WORKDAY(CS5,1)","v":40903},null,null,null,null,null,null,null,null,null,{"$f":"valGanttStart","v":"2011-08-22"},{"$f":"DD5+7","v":"2011-08-29"},{"$f":"DE5+7","v":"2011-09-05"},"2011-09-12","2011-09-19","2011-09-26","2011-10-03","2011-10-10","2011-10-17","2011-10-24","2011-10-31","2011-11-07","2011-11-14","2011-11-21","2011-11-28","2011-12-05","2011-12-12","2011-12-19","2011-12-26","2012-01-02","2012-01-09","2012-01-16","2012-01-23","2012-01-30","2012-02-06","2012-02-13","2012-02-20","2012-02-27","2012-03-05","2012-03-12","2012-03-19",null,null,null,null,null,null,null,null,null,null,{"$f":"DATE(YEAR(valGanttStart),MONTH(valGanttStart),1)","v":"2011-08-01"},{"$f":"EDATE(ES5,1)","v":40787},{"$f":"EDATE(ET5,1)","v":40817},40848,40878,40909,40940,40969,41000,41030,41061,41091,41122,41153,41183,41214,41244,41275,41306,41334,41365,41395,41426,41456,41487,41518,41548,41579,41609,41640]
[null,"View in",1,"Days",{"$f":"INDEX(lstGanttViews,valGanttType)&\" view\"","v":"Daily view"},null,{"$f":"C6","v":1}]
[null,"Daily View"]
[]
{"$rows_left_out":22}
{"sheet":"Help","index":9,"n_rows":46,"n_cols":4,"rows_kept":46,"cut":false,"hidden":false,"merged":[[33,3,43,3],[1,1,1,3],[5,3,14,3],[19,3,28,3]]}
[]
[null,"Watch these help videos to get started. You need internet connection to watch them."]
[]
[null,"1. Setting up Project Portfolio Dashboard"]
[]
[null,null,null,"Learn how to set up the project portfolio dashboard. Understand how to use it, how to add data, settings, holidays and more.\n\nVideo - 16 mins"]
[]
[]
{"$rows_left_out":38}