{"text_format":"1","workbook":"xlsx","n_sheets":4,"sheets":["Dashboard","data dump1","Sheet2","Sheet3"],"not_rendered":{"charts":8,"images":33,"macros":1,"external_links":0,"defined_names":30,"comments":0,"pivot_tables":0},"unopened":[],"bounds":{"document_bytes":16777216,"sheet_cells":100000,"rows_first":2000,"rows_last":500,"rows_between":2000,"halvings":0,"cell_chars":16384,"cell_head_chars":4096},"cells_cut":0,"cells_raw":0,"read":"whole","date_system":"1900"}

{"sheet":"Dashboard","index":0,"n_rows":121,"n_cols":44,"rows_kept":121,"cut":false,"hidden":false,"merged":[[3,1,3,2]]}
[]
[null,null,null,null,null,null,null,null,null,null,null,null,null,null,null,null,null,null,null,null,null,null,null,null,null,null,null,null,null,null,null,null,null,null,null,null,null,null,null,"Select teams to compare"]
[]
[null,null,null,null,"Scoring","Attack","Defense","Passing",null,"Selecet parameter"]
[null,{"$f":"IFERROR(Flag,\"Select country\")","v":"GER"}]
[]
[]
[null,null,null,null,null,null,null,null,null,"Select parameter:"]
[]
[]
[]
[null,null,null,null,null,null,null,null,null,"Select parameter:",{"$f":"Sheet2!AV14","v":" "},{"$f":"Sheet2!AW14","v":" "}]
[]
[]
[]
[]
[null,null,null,null,null,null,{"$f":"Sheet2!AV8","v":"Germany"},{"$f":"Sheet2!AW8","v":"Average"}]
[null,null,null,null,{"$f":"Sheet2!AU9","v":"Total Goals Scored"},null,{"$f":"Sheet2!AV9","v":18},{"$f":"Sheet2!AW9","v":5.1875}]
[null,null,null,null,{"$f":"Sheet2!AU10","v":"Open Play Goals"},null,{"$f":"Sheet2!AV10","v":15},{"$f":"Sheet2!AW10","v":4.40625}]
[null,null,null,null,{"$f":"Sheet2!AU11","v":"Set Piece Goals"},null,{"$f":"Sheet2!AV11","v":3},{"$f":"Sheet2!AW11","v":0.90625}]
[" ",null,null,null,{"$f":"Sheet2!AU12","v":"Penalty Goal"},null,{"$f":"Sheet2!AV12","v":1},{"$f":"Sheet2!AW12","v":0.375}]
[null,null,null,null,{"$f":"Sheet2!AU13","v":"Goal/min"},null,{"$f":"Sheet2!AV13","v":38},{"$f":"Sheet2!AW13","v":99.375},null,null,null,null,null,null,null,null,null,null,null,null,null,null,null,null,null,null,null,null,null,null,null,null,null,null,null,null,null,null,null,null,null,null,null,"Tournament average"]
[null,null,null,null,null,null,null,null,null,null,null,null,null,null,null,null,null,null,null,null,null,null,null,null,null,null,null,null,null,null,null,null,null,null,null,null,null,"Click here for match details"]
[null,null,null,null,null,null,null,null,null,null,null,null,null,null,null,null,null,null,null,null,null,null,null,null,null,null,null,null,null,null,null,null,null,null,null,null,null,"Click here for individual teams"]
[null,null,null,null,null,null,null,null,null,null,null,null,null,null,null,null,null,null,null,null,null,null,null,null,null,null,null,null,null,null,null,null,null,null,null,null,null,"Click here for top performances"]
[]
[]
[]
[]
[]
[]
[]
[]
[]
[]
[]
[]
[]
[]
[]
[]
[]
[]
[]
[]
[]
[]
[]
[]
[]
[]
[]
[]
[null,null,null,null,null,null,null,null,null,null,null,null,null,null,null,null,null,null,null,null,null,null,null,null,null,null,null,null,null,null,null,"vs."]
[]
[null,null,null,null,null,null,null,null,null,null,null,null,null,null,null,null,null,null,null,null,null,null,null,null,null,null,null,null,null,null,null,{"$f":"\"For \"&AI60&\" match\"","v":"For FRA-GER match"}]
[null,null,null,null,null,null,null,null,null,null,null,null,null,null,null,null,null,null,null,null,null,null,null,null,null,null,null,null,null,null,"Final Socre:",{"$f":"IFERROR(INDEX(Sheet3!$C$2:$E$65,MATCH(SelMatch,Sheet3!$E$2:$E$65,0),1),\"\")","v":"0-1"},null,null,{"$f":"\"Man of the Match: \" &INDEX(Sheet3!$D$3:$E$65,MATCH(SelMatch,Sheet3!$E$3:$E$65,0),1)","v":"Man of the Match: Mats Hummels"}]
[null,null,null,null,null,null,null,null,null,null,null,null,null,null,null,null,null,null,null,null,null,null,null,null,null,null,null,null,null,null,null,{"$f":"IFERROR(INDEX(Sheet3!A2:$E$65,MATCH(SelMatch,Sheet3!$E$2:$E$65,0),1),\"\")","v":"2014-07-04"}]
[null,null,null,null,null,null,null,null,null,null,null,null,null,null,null,null,null,null,null,null,null,null,null,null,null,null,null,null,null,null,null,{"$f":"\"Stadium: \"&IFERROR(INDEX(Sheet3!$A$3:$E$65,MATCH(SelMatch,Sheet3!$E$2:$E$65,0),2),\"\")","v":"Stadium: Arena de São Paulo, São Paulo"}]
[null,null,null,null,null,null,null,null,null,null,null,null,null,null,null,null,null,null,null,null,null,null,null,null,null,null,null,null,null,null,null,"Match Stats",null,null,{"$f":"INDEX(Sheet3!$E$2:$F$65,MATCH(SelMatch,Sheet3!$E$2:$E$65,0),2)","v":"FRA-GER"},null,"Tournament Avg."]
[null,null,null,null,null,null,null,null,null,null,null,null,null,null,null,null,null,null,null,null,null,null,null,null,null,null,null,null,null,null,null,"Shots",null,{"$f":"(INDEX(Sheet3!$E$2:$AI$69,67-2,MATCH(Dashboard!AF61,Sheet3!$E$2:$AI$2,0)))","v":0},{"$f":"IFERROR(INDEX(Sheet3!$E$2:$AI$65,MATCH(SelMatch,Sheet3!$E$2:$E$65,0),MATCH(Dashboard!AF61,Sheet3!$E$2:$AI$2,0)),\"\")","v":21},{"$f":"(INDEX(Sheet3!$E$2:$AI$69,67-1,MATCH(Dashboard!AF61,Sheet3!$E$2:$AI$2,0)))","v":26.571428571428573},{"$f":"INDEX(Sheet3!$E$3:$AI$67,65-2,MATCH(Dashboard!AF61,Sheet3!$E$2:$AI$2,0))","v":12}]
[null,null,null,null,null,null,null,null,null,null,null,null,null,null,null,null,null,null,null,null,null,null,null,null,null,null,null,null,null,null,null,"Shots on target (%)",null,{"$f":"(INDEX(Sheet3!$E$2:$AI$69,67-2,MATCH(Dashboard!AF62,Sheet3!$E$2:$AI$2,0)))","v":0},{"$f":"IFERROR(INDEX(Sheet3!$E$2:$AI$65,MATCH(SelMatch,Sheet3!$E$2:$E$65,0),MATCH(Dashboard!AF62,Sheet3!$E$2:$AI$2,0)),\"\")","v":0.71},{"$f":"(INDEX(Sheet3!$E$2:$AI$69,67-1,MATCH(Dashboard!AF62,Sheet3!$E$2:$AI$2,0)))","v":0.59301587301587289},{"$f":"INDEX(Sheet3!$E$3:$AI$67,65-2,MATCH(Dashboard!AF62,Sheet3!$E$2:$AI$2,0))","v":0.5}]
[null,null,null,null,null,null,null,null,null,null,null,null,null,null,null,null,null,null,null,null,null,null,null,null,null,null,null,null,null,null,null,"Attempts on-target from inside the area",null,{"$f":"(INDEX(Sheet3!$E$2:$AI$69,67-2,MATCH(Dashboard!AF63,Sheet3!$E$2:$AI$2,0)))","v":0},{"$f":"IFERROR(INDEX(Sheet3!$E$2:$AI$65,MATCH(SelMatch,Sheet3!$E$2:$E$65,0),MATCH(Dashboard!AF63,Sheet3!$E$2:$AI$2,0)),\"\")","v":14},{"$f":"(INDEX(Sheet3!$E$2:$AI$69,67-1,MATCH(Dashboard!AF63,Sheet3!$E$2:$AI$2,0)))","v":8.3492063492063497},{"$f":"INDEX(Sheet3!$E$3:$AI$67,65-2,MATCH(Dashboard!AF63,Sheet3!$E$2:$AI$2,0))","v":1}]
[null,null,null,null,null,null,null,null,null,null,null,null,null,null,null,null,null,null,null,null,null,null,null,null,null,null,null,null,null,null,null,"Attempts on-target from outside the area",null,{"$f":"(INDEX(Sheet3!$E$2:$AI$69,67-2,MATCH(Dashboard!AF64,Sheet3!$E$2:$AI$2,0)))","v":0},{"$f":"IFERROR(INDEX(Sheet3!$E$2:$AI$65,MATCH(SelMatch,Sheet3!$E$2:$E$65,0),MATCH(Dashboard!AF64,Sheet3!$E$2:$AI$2,0)),\"\")","v":1},{"$f":"(INDEX(Sheet3!$E$2:$AI$69,67-1,MATCH(Dashboard!AF64,Sheet3!$E$2:$AI$2,0)))","v":7.5555555555555554},{"$f":"INDEX(Sheet3!$E$3:$AI$67,65-2,MATCH(Dashboard!AF64,Sheet3!$E$2:$AI$2,0))","v":5}]
[null,null,null,null,null,null,null,null,null,null,null,null,null,null,null,null,null,null,null,null,null,null,null,null,null,null,null,null,null,null,null,"Attempts off-target from inside the area",null,{"$f":"(INDEX(Sheet3!$E$2:$AI$69,67-2,MATCH(Dashboard!AF65,Sheet3!$E$2:$AI$2,0)))","v":0},{"$f":"IFERROR(INDEX(Sheet3!$E$2:$AI$65,MATCH(SelMatch,Sheet3!$E$2:$E$65,0),MATCH(Dashboard!AF65,Sheet3!$E$2:$AI$2,0)),\"\")","v":4},{"$f":"(INDEX(Sheet3!$E$2:$AI$69,67-1,MATCH(Dashboard!AF65,Sheet3!$E$2:$AI$2,0)))","v":4.9206349206349209},{"$f":"INDEX(Sheet3!$E$3:$AI$67,65-2,MATCH(Dashboard!AF65,Sheet3!$E$2:$AI$2,0))","v":3}]
[null,null,null,null,null,null,null,null,null,null,null,null,null,null,null,null,null,null,null,null,null,null,null,null,null,null,null,null,null,null,null,"Attempts off-target from outside the area",null,{"$f":"(INDEX(Sheet3!$E$2:$AI$69,67-2,MATCH(Dashboard!AF66,Sheet3!$E$2:$AI$2,0)))","v":0},{"$f":"IFERROR(INDEX(Sheet3!$E$2:$AI$65,MATCH(SelMatch,Sheet3!$E$2:$E$65,0),MATCH(Dashboard!AF66,Sheet3!$E$2:$AI$2,0)),\"\")","v":2},{"$f":"(INDEX(Sheet3!$E$2:$AI$69,67-1,MATCH(Dashboard!AF66,Sheet3!$E$2:$AI$2,0)))","v":5.746031746031746},{"$f":"INDEX(Sheet3!$E$3:$AI$67,65-2,MATCH(Dashboard!AF66,Sheet3!$E$2:$AI$2,0))","v":3}]
[null,null,null,null,null,null,null,null,null,null,null,null,null,null,null,null,null,null,null,null,null,null,null,null,null,null,null,null,null,null,null,"Goals for",null,{"$f":"(INDEX(Sheet3!$E$2:$AI$69,67-2,MATCH(Dashboard!AF67,Sheet3!$E$2:$AI$2,0)))","v":0},{"$f":"IFERROR(INDEX(Sheet3!$E$2:$AI$65,MATCH(SelMatch,Sheet3!$E$2:$E$65,0),MATCH(Dashboard!AF67,Sheet3!$E$2:$AI$2,0)),\"\")","v":1},{"$f":"(INDEX(Sheet3!$E$2:$AI$69,67-1,MATCH(Dashboard!AF67,Sheet3!$E$2:$AI$2,0)))","v":2.7142857142857144},{"$f":"INDEX(Sheet3!$E$3:$AI$67,65-2,MATCH(Dashboard!AF67,Sheet3!$E$2:$AI$2,0))","v":0}]
[null,null,null,null,null,null,null,null,null,null,null,null,null,null,null,null,null,null,null,null,null,null,null,null,null,null,null,null,null,null,null,"Goals from inside the area",null,{"$f":"(INDEX(Sheet3!$E$2:$AI$69,67-2,MATCH(Dashboard!AF68,Sheet3!$E$2:$AI$2,0)))","v":0},{"$f":"IFERROR(INDEX(Sheet3!$E$2:$AI$65,MATCH(SelMatch,Sheet3!$E$2:$E$65,0),MATCH(Dashboard!AF68,Sheet3!$E$2:$AI$2,0)),\"\")","v":1},{"$f":"(INDEX(Sheet3!$E$2:$AI$69,67-1,MATCH(Dashboard!AF68,Sheet3!$E$2:$AI$2,0)))","v":2.2857142857142856},{"$f":"INDEX(Sheet3!$E$3:$AI$67,65-2,MATCH(Dashboard!AF68,Sheet3!$E$2:$AI$2,0))","v":0}]
[null,null,null,null,null,null,null,null,null,null,null,null,null,null,null,null,null,null,null,null,null,null,null,null,null,null,null,null,null,null,null,"Goals from outside the area",null,{"$f":"(INDEX(Sheet3!$E$2:$AI$69,67-2,MATCH(Dashboard!AF69,Sheet3!$E$2:$AI$2,0)))","v":0},{"$f":"IFERROR(INDEX(Sheet3!$E$2:$AI$65,MATCH(SelMatch,Sheet3!$E$2:$E$65,0),MATCH(Dashboard!AF69,Sheet3!$E$2:$AI$2,0)),\"\")","v":0},{"$f":"(INDEX(Sheet3!$E$2:$AI$69,67-1,MATCH(Dashboard!AF69,Sheet3!$E$2:$AI$2,0)))","v":0.34920634920634919},{"$f":"INDEX(Sheet3!$E$3:$AI$67,65-2,MATCH(Dashboard!AF69,Sheet3!$E$2:$AI$2,0))","v":0}]
[null,null,null,null,null,null,null,null,null,null,null,null,null,null,null,null,null,null,null,null,null,null,null,null,null,null,null,null,null,null,null,"Own goals For",null,{"$f":"(INDEX(Sheet3!$E$2:$AI$69,67-2,MATCH(Dashboard!AF70,Sheet3!$E$2:$AI$2,0)))","v":0},{"$f":"IFERROR(INDEX(Sheet3!$E$2:$AI$65,MATCH(SelMatch,Sheet3!$E$2:$E$65,0),MATCH(Dashboard!AF70,Sheet3!$E$2:$AI$2,0)),\"\")","v":0},{"$f":"(INDEX(Sheet3!$E$2:$AI$69,67-1,MATCH(Dashboard!AF70,Sheet3!$E$2:$AI$2,0)))","v":7.9365079365079361E-2},{"$f":"INDEX(Sheet3!$E$3:$AI$67,65-2,MATCH(Dashboard!AF70,Sheet3!$E$2:$AI$2,0))","v":0}]
[null,null,null,null,null,null,null,null,null,null,null,null,null,null,null,null,null,null,null,null,null,null,null,null,null,null,null,null,null,null,null,"Open Play Goals",null,{"$f":"(INDEX(Sheet3!$E$2:$AI$69,67-2,MATCH(Dashboard!AF71,Sheet3!$E$2:$AI$2,0)))","v":0},{"$f":"IFERROR(INDEX(Sheet3!$E$2:$AI$65,MATCH(SelMatch,Sheet3!$E$2:$E$65,0),MATCH(Dashboard!AF71,Sheet3!$E$2:$AI$2,0)),\"\")","v":1},{"$f":"(INDEX(Sheet3!$E$2:$AI$69,67-1,MATCH(Dashboard!AF71,Sheet3!$E$2:$AI$2,0)))","v":2.2380952380952381},{"$f":"INDEX(Sheet3!$E$3:$AI$67,65-2,MATCH(Dashboard!AF71,Sheet3!$E$2:$AI$2,0))","v":0}]
[null,null,null,null,null,null,null,null,null,null,null,null,null,null,null,null,null,null,null,null,null,null,null,null,null,null,null,null,null,null,null,"Set Piece Goals",null,{"$f":"(INDEX(Sheet3!$E$2:$AI$69,67-2,MATCH(Dashboard!AF72,Sheet3!$E$2:$AI$2,0)))","v":0},{"$f":"IFERROR(INDEX(Sheet3!$E$2:$AI$65,MATCH(SelMatch,Sheet3!$E$2:$E$65,0),MATCH(Dashboard!AF72,Sheet3!$E$2:$AI$2,0)),\"\")","v":0},{"$f":"(INDEX(Sheet3!$E$2:$AI$69,67-1,MATCH(Dashboard!AF72,Sheet3!$E$2:$AI$2,0)))","v":0.47619047619047616},{"$f":"INDEX(Sheet3!$E$3:$AI$67,65-2,MATCH(Dashboard!AF72,Sheet3!$E$2:$AI$2,0))","v":0}]
[null,null,null,null,null,null,null,null,null,null,null,null,null,null,null,null,null,null,null,null,null,null,null,null,null,null,null,null,null,null,null,"Penalty goal",null,{"$f":"(INDEX(Sheet3!$E$2:$AI$69,67-2,MATCH(Dashboard!AF73,Sheet3!$E$2:$AI$2,0)))","v":0},{"$f":"IFERROR(INDEX(Sheet3!$E$2:$AI$65,MATCH(SelMatch,Sheet3!$E$2:$E$65,0),MATCH(Dashboard!AF73,Sheet3!$E$2:$AI$2,0)),\"\")","v":0},{"$f":"(INDEX(Sheet3!$E$2:$AI$69,67-1,MATCH(Dashboard!AF73,Sheet3!$E$2:$AI$2,0)))","v":0.19047619047619047},{"$f":"INDEX(Sheet3!$E$3:$AI$67,65-2,MATCH(Dashboard!AF73,Sheet3!$E$2:$AI$2,0))","v":0}]
[null,null,null,null,null,null,null,null,null,null,null,null,null,null,null,null,null,null,null,null,null,null,null,null,null,null,null,null,null,null,null,"Yellow Card",null,{"$f":"(INDEX(Sheet3!$E$2:$AI$69,67-2,MATCH(Dashboard!AF74,Sheet3!$E$2:$AI$2,0)))","v":0},{"$f":"IFERROR(INDEX(Sheet3!$E$2:$AI$65,MATCH(SelMatch,Sheet3!$E$2:$E$65,0),MATCH(Dashboard!AF74,Sheet3!$E$2:$AI$2,0)),\"\")","v":2},{"$f":"(INDEX(Sheet3!$E$2:$AI$69,67-1,MATCH(Dashboard!AF74,Sheet3!$E$2:$AI$2,0)))","v":2.8253968253968256},{"$f":"INDEX(Sheet3!$E$3:$AI$67,65-2,MATCH(Dashboard!AF74,Sheet3!$E$2:$AI$2,0))","v":3}]
[null,null,null,null,null,null,null,null,null,null,null,null,null,null,null,null,null,null,null,null,null,null,null,null,null,null,null,null,null,null,null,"Second yellow card and red card",null,{"$f":"(INDEX(Sheet3!$E$2:$AI$69,67-2,MATCH(Dashboard!AF75,Sheet3!$E$2:$AI$2,0)))","v":0},{"$f":"IFERROR(INDEX(Sheet3!$E$2:$AI$65,MATCH(SelMatch,Sheet3!$E$2:$E$65,0),MATCH(Dashboard!AF75,Sheet3!$E$2:$AI$2,0)),\"\")","v":0},{"$f":"(INDEX(Sheet3!$E$2:$AI$69,67-1,MATCH(Dashboard!AF75,Sheet3!$E$2:$AI$2,0)))","v":4.7619047619047616E-2},{"$f":"INDEX(Sheet3!$E$3:$AI$67,65-2,MATCH(Dashboard!AF75,Sheet3!$E$2:$AI$2,0))","v":0}]
[null,null,null,null,null,null,null,null,null,null,null,null,null,null,null,null,null,null,null,null,null,null,null,null,null,null,null,null,null,null,null,"Red Cards",null,{"$f":"(INDEX(Sheet3!$E$2:$AI$69,67-2,MATCH(Dashboard!AF76,Sheet3!$E$2:$AI$2,0)))","v":0},{"$f":"IFERROR(INDEX(Sheet3!$E$2:$AI$65,MATCH(SelMatch,Sheet3!$E$2:$E$65,0),MATCH(Dashboard!AF76,Sheet3!$E$2:$AI$2,0)),\"\")","v":0},{"$f":"(INDEX(Sheet3!$E$2:$AI$69,67-1,MATCH(Dashboard!AF76,Sheet3!$E$2:$AI$2,0)))","v":0.1111111111111111},{"$f":"INDEX(Sheet3!$E$3:$AI$67,65-2,MATCH(Dashboard!AF76,Sheet3!$E$2:$AI$2,0))","v":0}]
[null,null,null,null,null,null,null,null,null,null,null,null,null,null,null,null,null,null,null,null,null,null,null,null,null,null,null,null,null,null,null,"Fouls Committed",null,{"$f":"(INDEX(Sheet3!$E$2:$AI$69,67-2,MATCH(Dashboard!AF77,Sheet3!$E$2:$AI$2,0)))","v":0},{"$f":"IFERROR(INDEX(Sheet3!$E$2:$AI$65,MATCH(SelMatch,Sheet3!$E$2:$E$65,0),MATCH(Dashboard!AF77,Sheet3!$E$2:$AI$2,0)),\"\")","v":33},{"$f":"(INDEX(Sheet3!$E$2:$AI$69,67-1,MATCH(Dashboard!AF77,Sheet3!$E$2:$AI$2,0)))","v":30.206349206349206},{"$f":"INDEX(Sheet3!$E$3:$AI$67,65-2,MATCH(Dashboard!AF77,Sheet3!$E$2:$AI$2,0))","v":34}]
[null,null,null,null,null,null,null,null,null,null,null,null,null,null,null,null,null,null,null,null,null,null,null,null,null,null,null,null,null,null,null,"Attacks",null,{"$f":"(INDEX(Sheet3!$E$2:$AI$69,67-2,MATCH(Dashboard!AF78,Sheet3!$E$2:$AI$2,0)))","v":0},{"$f":"IFERROR(INDEX(Sheet3!$E$2:$AI$65,MATCH(SelMatch,Sheet3!$E$2:$E$65,0),MATCH(Dashboard!AF78,Sheet3!$E$2:$AI$2,0)),\"\")","v":57},{"$f":"(INDEX(Sheet3!$E$2:$AI$69,67-1,MATCH(Dashboard!AF78,Sheet3!$E$2:$AI$2,0)))","v":78.761904761904759},{"$f":"INDEX(Sheet3!$E$3:$AI$67,65-2,MATCH(Dashboard!AF78,Sheet3!$E$2:$AI$2,0))","v":47}]
[null,null,null,null,null,null,null,null,null,null,null,null,null,null,null,null,null,null,null,null,null,null,null,null,null,null,null,null,null,null,null,"Solo runs into area",null,{"$f":"(INDEX(Sheet3!$E$2:$AI$69,67-2,MATCH(Dashboard!AF79,Sheet3!$E$2:$AI$2,0)))","v":0},{"$f":"IFERROR(INDEX(Sheet3!$E$2:$AI$65,MATCH(SelMatch,Sheet3!$E$2:$E$65,0),MATCH(Dashboard!AF79,Sheet3!$E$2:$AI$2,0)),\"\")","v":9},{"$f":"(INDEX(Sheet3!$E$2:$AI$69,67-1,MATCH(Dashboard!AF79,Sheet3!$E$2:$AI$2,0)))","v":5.9206349206349209},{"$f":"INDEX(Sheet3!$E$3:$AI$67,65-2,MATCH(Dashboard!AF79,Sheet3!$E$2:$AI$2,0))","v":2}]
[null,null,null,null,null,null,null,null,null,null,null,null,null,null,null,null,null,null,null,null,null,null,null,null,null,null,null,null,null,null,null,"Assists",null,{"$f":"(INDEX(Sheet3!$E$2:$AI$69,67-2,MATCH(Dashboard!AF80,Sheet3!$E$2:$AI$2,0)))","v":0},{"$f":"IFERROR(INDEX(Sheet3!$E$2:$AI$65,MATCH(SelMatch,Sheet3!$E$2:$E$65,0),MATCH(Dashboard!AF80,Sheet3!$E$2:$AI$2,0)),\"\")","v":1},{"$f":"(INDEX(Sheet3!$E$2:$AI$69,67-1,MATCH(Dashboard!AF80,Sheet3!$E$2:$AI$2,0)))","v":1.9047619047619047},{"$f":"INDEX(Sheet3!$E$3:$AI$67,65-2,MATCH(Dashboard!AF80,Sheet3!$E$2:$AI$2,0))","v":0}]
[null,null,null,null,null,null,null,null,null,null,null,null,null,null,null,null,null,null,null,null,null,null,null,null,null,null,null,null,null,null,null,"Offsides",null,{"$f":"(INDEX(Sheet3!$E$2:$AI$69,67-2,MATCH(Dashboard!AF81,Sheet3!$E$2:$AI$2,0)))","v":0},{"$f":"IFERROR(INDEX(Sheet3!$E$2:$AI$65,MATCH(SelMatch,Sheet3!$E$2:$E$65,0),MATCH(Dashboard!AF81,Sheet3!$E$2:$AI$2,0)),\"\")","v":3},{"$f":"(INDEX(Sheet3!$E$2:$AI$69,67-1,MATCH(Dashboard!AF81,Sheet3!$E$2:$AI$2,0)))","v":4.4603174603174605},{"$f":"INDEX(Sheet3!$E$3:$AI$67,65-2,MATCH(Dashboard!AF81,Sheet3!$E$2:$AI$2,0))","v":4}]
[null,null,null,null,null,null,null,null,null,null,null,null,null,null,null,null,null,null,null,null,null,null,null,null,null,null,null,null,null,null,null,"Total Passes",null,{"$f":"(INDEX(Sheet3!$E$2:$AI$69,67-2,MATCH(Dashboard!AF82,Sheet3!$E$2:$AI$2,0)))","v":0},{"$f":"IFERROR(INDEX(Sheet3!$E$2:$AI$65,MATCH(SelMatch,Sheet3!$E$2:$E$65,0),MATCH(Dashboard!AF82,Sheet3!$E$2:$AI$2,0)),\"\")","v":1028},{"$f":"(INDEX(Sheet3!$E$2:$AI$69,67-1,MATCH(Dashboard!AF82,Sheet3!$E$2:$AI$2,0)))","v":1032.031746031746},{"$f":"INDEX(Sheet3!$E$3:$AI$67,65-2,MATCH(Dashboard!AF82,Sheet3!$E$2:$AI$2,0))","v":1020}]
[null,null,null,null,null,null,null,null,null,null,null,null,null,null,null,null,null,null,null,null,null,null,null,null,null,null,null,null,null,null,null,"Passes Completed",null,{"$f":"(INDEX(Sheet3!$E$2:$AI$69,67-2,MATCH(Dashboard!AF83,Sheet3!$E$2:$AI$2,0)))","v":0},{"$f":"IFERROR(INDEX(Sheet3!$E$2:$AI$65,MATCH(SelMatch,Sheet3!$E$2:$E$65,0),MATCH(Dashboard!AF83,Sheet3!$E$2:$AI$2,0)),\"\")","v":754},{"$f":"(INDEX(Sheet3!$E$2:$AI$69,67-1,MATCH(Dashboard!AF83,Sheet3!$E$2:$AI$2,0)))","v":785.79365079365084},{"$f":"INDEX(Sheet3!$E$3:$AI$67,65-2,MATCH(Dashboard!AF83,Sheet3!$E$2:$AI$2,0))","v":737}]
[null,null,null,null,null,null,null,null,null,null,null,null,null,null,null,null,null,null,null,null,null,null,null,null,null,null,null,null,null,null,null,"Passes Completed%",null,{"$f":"(INDEX(Sheet3!$E$2:$AI$69,67-2,MATCH(Dashboard!AF84,Sheet3!$E$2:$AI$2,0)))","v":0},{"$f":"IFERROR(INDEX(Sheet3!$E$2:$AI$65,MATCH(SelMatch,Sheet3!$E$2:$E$65,0),MATCH(Dashboard!AF84,Sheet3!$E$2:$AI$2,0)),\"\")","v":0.74},{"$f":"(INDEX(Sheet3!$E$2:$AI$69,67-1,MATCH(Dashboard!AF84,Sheet3!$E$2:$AI$2,0)))","v":0.76338709677419347},{"$f":"INDEX(Sheet3!$E$3:$AI$67,65-2,MATCH(Dashboard!AF84,Sheet3!$E$2:$AI$2,0))","v":0.73}]
[null,null,null,null,null,null,null,null,null,null,null,null,null,null,null,null,null,null,null,null,null,null,null,null,null,null,null,null,null,null,null,"Crosses",null,{"$f":"(INDEX(Sheet3!$E$2:$AI$69,67-2,MATCH(Dashboard!AF85,Sheet3!$E$2:$AI$2,0)))","v":0},{"$f":"IFERROR(INDEX(Sheet3!$E$2:$AI$65,MATCH(SelMatch,Sheet3!$E$2:$E$65,0),MATCH(Dashboard!AF85,Sheet3!$E$2:$AI$2,0)),\"\")","v":38},{"$f":"(INDEX(Sheet3!$E$2:$AI$69,67-1,MATCH(Dashboard!AF85,Sheet3!$E$2:$AI$2,0)))","v":39.095238095238095},{"$f":"INDEX(Sheet3!$E$3:$AI$67,65-2,MATCH(Dashboard!AF85,Sheet3!$E$2:$AI$2,0))","v":24}]
[null,null,null,null,null,null,null,null,null,null,null,null,null,null,null,null,null,null,null,null,null,null,null,null,null,null,null,null,null,null,null,"Crosses Completed",null,{"$f":"(INDEX(Sheet3!$E$2:$AI$69,67-2,MATCH(Dashboard!AF86,Sheet3!$E$2:$AI$2,0)))","v":0},{"$f":"IFERROR(INDEX(Sheet3!$E$2:$AI$65,MATCH(SelMatch,Sheet3!$E$2:$E$65,0),MATCH(Dashboard!AF86,Sheet3!$E$2:$AI$2,0)),\"\")","v":12},{"$f":"(INDEX(Sheet3!$E$2:$AI$69,67-1,MATCH(Dashboard!AF86,Sheet3!$E$2:$AI$2,0)))","v":9.1269841269841265},{"$f":"INDEX(Sheet3!$E$3:$AI$67,65-2,MATCH(Dashboard!AF86,Sheet3!$E$2:$AI$2,0))","v":4}]
[null,null,null,null,null,null,null,null,null,null,null,null,null,null,null,null,null,null,null,null,null,null,null,null,null,null,null,null,null,null,null,"Crosses Completed%",null,{"$f":"(INDEX(Sheet3!$E$2:$AI$69,67-2,MATCH(Dashboard!AF87,Sheet3!$E$2:$AI$2,0)))","v":0},{"$f":"IFERROR(INDEX(Sheet3!$E$2:$AI$65,MATCH(SelMatch,Sheet3!$E$2:$E$65,0),MATCH(Dashboard!AF87,Sheet3!$E$2:$AI$2,0)),\"\")","v":0.32},{"$f":"(INDEX(Sheet3!$E$2:$AI$69,67-1,MATCH(Dashboard!AF87,Sheet3!$E$2:$AI$2,0)))","v":0.24365079365079362},{"$f":"INDEX(Sheet3!$E$3:$AI$67,65-2,MATCH(Dashboard!AF87,Sheet3!$E$2:$AI$2,0))","v":0.17}]
[null,null,null,null,null,null,null,null,null,null,null,null,null,null,null,null,null,null,null,null,null,null,null,null,null,null,null,null,null,null,null,"Corners",null,{"$f":"(INDEX(Sheet3!$E$2:$AI$69,67-2,MATCH(Dashboard!AF88,Sheet3!$E$2:$AI$2,0)))","v":0},{"$f":"IFERROR(INDEX(Sheet3!$E$2:$AI$65,MATCH(SelMatch,Sheet3!$E$2:$E$65,0),MATCH(Dashboard!AF88,Sheet3!$E$2:$AI$2,0)),\"\")","v":8},{"$f":"(INDEX(Sheet3!$E$2:$AI$69,67-1,MATCH(Dashboard!AF88,Sheet3!$E$2:$AI$2,0)))","v":10.476190476190476},{"$f":"INDEX(Sheet3!$E$3:$AI$67,65-2,MATCH(Dashboard!AF88,Sheet3!$E$2:$AI$2,0))","v":10}]
[null,null,null,null,null,null,null,null,null,null,null,null,null,null,null,null,null,null,null,null,null,null,null,null,null,null,null,null,null,null,null,"Throw-ins",null,{"$f":"(INDEX(Sheet3!$E$2:$AI$69,67-2,MATCH(Dashboard!AF89,Sheet3!$E$2:$AI$2,0)))","v":0},{"$f":"IFERROR(INDEX(Sheet3!$E$2:$AI$65,MATCH(SelMatch,Sheet3!$E$2:$E$65,0),MATCH(Dashboard!AF89,Sheet3!$E$2:$AI$2,0)),\"\")","v":78},{"$f":"(INDEX(Sheet3!$E$2:$AI$69,67-1,MATCH(Dashboard!AF89,Sheet3!$E$2:$AI$2,0)))","v":65.015873015873012},{"$f":"INDEX(Sheet3!$E$3:$AI$67,65-2,MATCH(Dashboard!AF89,Sheet3!$E$2:$AI$2,0))","v":59}]
[]
[]
[null,null,null,null,null,null,null,null,null,null,null,null,null,null,null,null,null,null,null,null,null,null,null,null,null,null,null,null,null,null,null,"For back to country analysis, click here"]
[null,null,null,null,null,null,null,null,null,null,null,null,null,null,null,null,null,null,null,null,null,null,null,null,null,null,null,null,null,null,null,"Click here for top performance"]
[null,null,null,null,null,null,null,null,null,null,null,null,null,null,null,null,null,null,null,null,null,null,null,null,null,null,null,null,null,null,null,"Click here for team compariosn"]
[null,null,"Click here for individual team"]
[null,null,"Click here for team comparison"]
[null,null,"Click here for match details"]
[]
[]
[null,"Top Goals",null,null,null,null,null,null,null,null,null,null,"Best attack"]
[null,{"$f":"\"Team: \" &INDEX(Sheet2!$E$3:$N$34,MATCH(MAX(Sheet2!$H$3:$H$34),Sheet2!$H$3:$H$34,0),1)","v":"Team: Germany"},null,null,null,null,null,null,null,null,null,null,{"$f":"\"Team: \" &INDEX(Sheet2!$E$3:$N$34,MATCH(MAX(Sheet2!$R$3:$R$34),Sheet2!$R$3:$R$34,0),1)","v":"Team: Brazil"}]
[null,{"$f":"\"Goals by \" &INDEX(Sheet2!$E$3:$N$34,MATCH(MAX(Sheet2!$H$3:$H$34),Sheet2!$H$3:$H$34,0),1)","v":"Goals by Germany"},null,null,null,null,null,null,null,null,null,null,{"$f":"\"Statistics of \" &RIGHT(M101,LEN(M101)-6)","v":"Statistics of Brazil"}]
[null,"Toal goals:",{"$f":"MAX(Sheet2!$H$3:$H$34)","v":18},null,null,null,null,null,null,null,null,null,"Total Attempts",{"$f":"SUM(N104:N107)","v":111}]
[null,"Open play",{"$f":"INDEX(Sheet2!$E$3:$N$34,MATCH(MAX(Sheet2!$H$3:$H$34),Sheet2!$I$3:$I$34,0),9)","v":15},null,null,null,null,null,null,null,null,null,"Goals scored",{"$f":"Sheet2!BR10","v":11}]
[null,"Set piece",{"$f":"INDEX(Sheet2!$E$3:$N$34,MATCH(MAX(Sheet2!$H$3:$H$34),Sheet2!$I$3:$I$34,0),10)","v":3},null,null,null,null,null,null,null,null,null,"Shots bolcked",{"$f":"Sheet2!BS10","v":28}]
[null,"Penalty",{"$f":"INDEX(Sheet2!$E$3:$N$34,MATCH(MAX(Sheet2!$H$3:$H$34),Sheet2!$I$3:$I$34,0),7)","v":1},null,null,null,null,null,null,null,null,null,"Shots saved",{"$f":"Sheet2!BT10","v":39}]
[null,null,null,null,null,null,null,null,null,null,null,null,"Attempts off target",{"$f":"Sheet2!BU10","v":33}]
[]
[]
[]
[]
[]
[]
[]
[null,"Best Defense",null,null,null,null,null,null,null,null,null,null,"Best passing"]
[null,{"$f":"\"Team: \"&Sheet2!BQ17","v":"Team: Brazil"},null,null,null,null,null,null,null,null,null,null,{"$f":"\"Team: \"&Sheet2!BQ24","v":"Team: Germany"}]
[null,{"$f":"\"Attempts by \" &Sheet2!BQ17","v":"Attempts by Brazil"},null,null,null,null,null,null,null,null,null,null,{"$f":"\"Passing statistics \" &Sheet2!BQ24","v":"Passing statistics Germany"}]
[null,"Total attempts",{"$f":"SUM(C119:C121)","v":168},null,null,null,null,null,null,null,null,null,"Total passes",{"$f":"SUM(N119:N121)","v":4157}]
[null,"Tackles",{"$f":"Sheet2!BR17","v":141},null,null,null,null,null,null,null,null,null,"Short passes",{"$f":"Sheet2!BR24","v":1017}]
[null,"Saves",{"$f":"Sheet2!BS17","v":17},null,null,null,null,null,null,null,null,null,"Medium passes",{"$f":"Sheet2!BS24","v":2763}]
[null,"Blocks",{"$f":"Sheet2!BT17","v":10},null,null,null,null,null,null,null,null,null,"Long passes",{"$f":"Sheet2!BT24","v":377}]

{"sheet":"data dump1","index":1,"n_rows":63,"n_cols":32,"rows_kept":63,"cut":false,"hidden":true,"merged":[]}
["Column1","Column2","Column3","Column4","Column5","Column6","Column7","Column8"]
["12 June 2014","Brazil","3–1","Croatia","Arena de São Paulo, São Paulo",{"$f":"INDEX(Sheet2!$A$36:$B$67,MATCH(Group_A[[#This Row],[Column2]],CountryFlag,0),1)","v":"BRA"},{"$f":"INDEX(Sheet2!$A$36:$B$67,MATCH(Group_A[[#This Row],[Column4]],CountryFlag,0),1)","v":"CRO"},{"$f":"CONCATENATE(Group_A[[#This Row],[Column6]],\"-\",Group_A[[#This Row],[Column7]])","v":"BRA-CRO"},"BEL-USA","2-1","2014-07-01","Salvador",null,null,null,null,"Brazil","Colombia","France","Germany","Netherlands","Costa Rica","Argentina","Belgium","Chile","Uruguay","Nigeria","Algeria","Mexico","Greece","Switzerland","United States"]
["13 June 2014","Mexico","1–0","Cameroon","Arena das Dunas, Natal",{"$f":"INDEX(Sheet2!$A$36:$B$67,MATCH(Group_A[[#This Row],[Column2]],CountryFlag,0),1)","v":"MEX"},{"$f":"INDEX(Sheet2!$A$36:$B$67,MATCH(Group_A[[#This Row],[Column4]],CountryFlag,0),1)","v":"CMR"},{"$f":"CONCATENATE(Group_A[[#This Row],[Column6]],\"-\",Group_A[[#This Row],[Column7]])","v":"MEX-CMR"},"ARG-SUI","1-0","2014-07-01","São Paulo",null,null,null,"Brazil",null,null,null,null,null,null,null,null,"Chile"]
["17 June 2014","Brazil","0–0","Mexico","Estádio Castelão, Fortaleza",{"$f":"INDEX(Sheet2!$A$36:$B$67,MATCH(Group_A[[#This Row],[Column2]],CountryFlag,0),1)","v":"BRA"},{"$f":"INDEX(Sheet2!$A$36:$B$67,MATCH(Group_A[[#This Row],[Column4]],CountryFlag,0),1)","v":"MEX"},{"$f":"CONCATENATE(Group_A[[#This Row],[Column6]],\"-\",Group_A[[#This Row],[Column7]])","v":"BRA-MEX"},"GER-ALG","2-1","2014-06-30","Porto Alegre",null,null,null,"Colombia",null,null,null,null,null,null,null,null,null,"Uruguay"]
["18 June 2014","Cameroon","0–4","Croatia","Arena da Amazônia, Manaus",{"$f":"INDEX(Sheet2!$A$36:$B$67,MATCH(Group_A[[#This Row],[Column2]],CountryFlag,0),1)","v":"CMR"},{"$f":"INDEX(Sheet2!$A$36:$B$67,MATCH(Group_A[[#This Row],[Column4]],CountryFlag,0),1)","v":"CRO"},{"$f":"CONCATENATE(Group_A[[#This Row],[Column6]],\"-\",Group_A[[#This Row],[Column7]])","v":"CMR-CRO"},"CMR-CRO","0–4","18 June 2014","Arena da Amazônia, Manaus",null,null,null,"France",null,null,null,null,null,null,null,null,null,null,"Nigeria"]
["23 June 2014","Cameroon","1–4","Brazil","Estádio Nacional Mané Garrincha, Brasília",{"$f":"INDEX(Sheet2!$A$36:$B$67,MATCH(Group_A[[#This Row],[Column2]],CountryFlag,0),1)","v":"CMR"},{"$f":"INDEX(Sheet2!$A$36:$B$67,MATCH(Group_A[[#This Row],[Column4]],CountryFlag,0),1)","v":"BRA"},{"$f":"CONCATENATE(Group_A[[#This Row],[Column6]],\"-\",Group_A[[#This Row],[Column7]])","v":"CMR-BRA"},"SUI-FRA","2–5","20 June 2014","Arena Fonte Nova, Salvador",null,null,null,"Germany",null,null,null,null,null,null,null,null,null,null,null,"Algeria"]
["23 June 2014","Croatia","1–3","Mexico","Arena Pernambuco, Recife",{"$f":"INDEX(Sheet2!$A$36:$B$67,MATCH(Group_A[[#This Row],[Column2]],CountryFlag,0),1)","v":"CRO"},{"$f":"INDEX(Sheet2!$A$36:$B$67,MATCH(Group_A[[#This Row],[Column4]],CountryFlag,0),1)","v":"MEX"},{"$f":"CONCATENATE(Group_A[[#This Row],[Column6]],\"-\",Group_A[[#This Row],[Column7]])","v":"CRO-MEX"},"NGA-BIH","1–0","21 June 2014","Arena Pantanal, Cuiabá",null,null,null,"Netherlands",null,null,null,null,null,null,null,null,null,null,null,null,"Mexico"]
["13 June 2014","Spain","1–5","Netherlands","Arena Fonte Nova, Salvador",{"$f":"INDEX(Sheet2!$A$36:$B$67,MATCH(Group_A[[#This Row],[Column2]],CountryFlag,0),1)","v":"ESP"},{"$f":"INDEX(Sheet2!$A$36:$B$67,MATCH(Group_A[[#This Row],[Column4]],CountryFlag,0),1)","v":"NED"},{"$f":"CONCATENATE(Group_A[[#This Row],[Column6]],\"-\",Group_A[[#This Row],[Column7]])","v":"ESP-NED"},"POR-GHA","2–1","26 June 2014","Estádio Nacional Mané Garrincha, Brasília",null,null,null,"Costa Rica",null,null,null,null,null,null,null,null,null,null,null,null,null,"Greece"]
["13 June 2014","Chile","3–1","Australia","Arena Pantanal, Cuiabá",{"$f":"INDEX(Sheet2!$A$36:$B$67,MATCH(Group_A[[#This Row],[Column2]],CountryFlag,0),1)","v":"CHI"},{"$f":"INDEX(Sheet2!$A$36:$B$67,MATCH(Group_A[[#This Row],[Column4]],CountryFlag,0),1)","v":"AUS"},{"$f":"CONCATENATE(Group_A[[#This Row],[Column6]],\"-\",Group_A[[#This Row],[Column7]])","v":"CHI-AUS"},"JPN-COL","1–4","24 June 2014","Arena Pantanal, Cuiabá",null,null,null,"Argentina",null,null,null,null,null,null,null,null,null,null,null,null,null,null,"Switzerland"]
["18 June 2014","Australia","2–3","Netherlands","Estádio Beira-Rio, Porto Alegre",{"$f":"INDEX(Sheet2!$A$36:$B$67,MATCH(Group_A[[#This Row],[Column2]],CountryFlag,0),1)","v":"AUS"},{"$f":"INDEX(Sheet2!$A$36:$B$67,MATCH(Group_A[[#This Row],[Column4]],CountryFlag,0),1)","v":"NED"},{"$f":"CONCATENATE(Group_A[[#This Row],[Column6]],\"-\",Group_A[[#This Row],[Column7]])","v":"AUS-NED"},"BRA-CHI","1 (3)-1 (2)","2014-06-28","Belo Horizonte",null,null,null,"Belgium",null,null,null,null,null,null,null,null,null,null,null,null,null,null,null,"United States"]
["18 June 2014","Spain","0–2","Chile","Estádio do Maracanã, Rio de Janeiro",{"$f":"INDEX(Sheet2!$A$36:$B$67,MATCH(Group_A[[#This Row],[Column2]],CountryFlag,0),1)","v":"ESP"},{"$f":"INDEX(Sheet2!$A$36:$B$67,MATCH(Group_A[[#This Row],[Column4]],CountryFlag,0),1)","v":"CHI"},{"$f":"CONCATENATE(Group_A[[#This Row],[Column6]],\"-\",Group_A[[#This Row],[Column7]])","v":"ESP-CHI"},"USA-POR","2–2","22 June 2014","Arena da Amazônia, Manaus",null,null,null,"Chile","Brazil"]
["23 June 2014","Australia","0–3","Spain","Arena da Baixada, Curitiba",{"$f":"INDEX(Sheet2!$A$36:$B$67,MATCH(Group_A[[#This Row],[Column2]],CountryFlag,0),1)","v":"AUS"},{"$f":"INDEX(Sheet2!$A$36:$B$67,MATCH(Group_A[[#This Row],[Column4]],CountryFlag,0),1)","v":"ESP"},{"$f":"CONCATENATE(Group_A[[#This Row],[Column6]],\"-\",Group_A[[#This Row],[Column7]])","v":"AUS-ESP"},"KOR-BEL","0–1","26 June 2014","Arena de São Paulo, São Paulo",null,null,null,"Uruguay",null,"Colombia"]
["23 June 2014","Netherlands","2–0","Chile","Arena de São Paulo, São Paulo",{"$f":"INDEX(Sheet2!$A$36:$B$67,MATCH(Group_A[[#This Row],[Column2]],CountryFlag,0),1)","v":"NED"},{"$f":"INDEX(Sheet2!$A$36:$B$67,MATCH(Group_A[[#This Row],[Column4]],CountryFlag,0),1)","v":"CHI"},{"$f":"CONCATENATE(Group_A[[#This Row],[Column6]],\"-\",Group_A[[#This Row],[Column7]])","v":"NED-CHI"},"BRA-GER","1-7","2014-07-08","Belo Horizonte",null,null,null,"Nigeria",null,null,"France"]
["14 June 2014","Colombia","3–0","Greece","Estádio Mineirão, Belo Horizonte",{"$f":"INDEX(Sheet2!$A$36:$B$67,MATCH(Group_A[[#This Row],[Column2]],CountryFlag,0),1)","v":"COL"},{"$f":"INDEX(Sheet2!$A$36:$B$67,MATCH(Group_A[[#This Row],[Column4]],CountryFlag,0),1)","v":"GRE"},{"$f":"CONCATENATE(Group_A[[#This Row],[Column6]],\"-\",Group_A[[#This Row],[Column7]])","v":"COL-GRE"},"CMR-BRA","1–4","23 June 2014","Estádio Nacional Mané Garrincha, Brasília",null,null,null,"Algeria",null,null,null,"Germany"]
["14 June 2014","Ivory Coast","2–1","Japan","Arena Pernambuco, Recife",{"$f":"INDEX(Sheet2!$A$36:$B$67,MATCH(Group_A[[#This Row],[Column2]],CountryFlag,0),1)","v":"CIV"},{"$f":"INDEX(Sheet2!$A$36:$B$67,MATCH(Group_A[[#This Row],[Column4]],CountryFlag,0),1)","v":"JPN"},{"$f":"CONCATENATE(Group_A[[#This Row],[Column6]],\"-\",Group_A[[#This Row],[Column7]])","v":"CIV-JPN"},"GER-GHA","2–2","21 June 2014","Estádio Castelão, Fortaleza",null,null,null,"Mexico",null,null,null,null,"Netherlands"]
["19 June 2014","Colombia","2–1","Ivory Coast","Estádio Nacional Mané Garrincha, Brasília",{"$f":"INDEX(Sheet2!$A$36:$B$67,MATCH(Group_A[[#This Row],[Column2]],CountryFlag,0),1)","v":"COL"},{"$f":"INDEX(Sheet2!$A$36:$B$67,MATCH(Group_A[[#This Row],[Column4]],CountryFlag,0),1)","v":"CIV"},{"$f":"CONCATENATE(Group_A[[#This Row],[Column6]],\"-\",Group_A[[#This Row],[Column7]])","v":"COL-CIV"},"ECU-FRA","0–0","25 June 2014","Estádio do Maracanã, Rio de Janeiro",null,null,null,"Greece",null,null,null,null,null,"Costa Rica"]
["19 June 2014","Japan","0–0","Greece","Arena das Dunas, Natal",{"$f":"INDEX(Sheet2!$A$36:$B$67,MATCH(Group_A[[#This Row],[Column2]],CountryFlag,0),1)","v":"JPN"},{"$f":"INDEX(Sheet2!$A$36:$B$67,MATCH(Group_A[[#This Row],[Column4]],CountryFlag,0),1)","v":"GRE"},{"$f":"CONCATENATE(Group_A[[#This Row],[Column6]],\"-\",Group_A[[#This Row],[Column7]])","v":"JPN-GRE"},"ENG-ITA","1–2","14 June 2014","Arena da Amazônia, Manaus",null,null,null,"Switzerland",null,null,null,null,null,null,"Argentina"]
["24 June 2014","Japan","1–4","Colombia","Arena Pantanal, Cuiabá",{"$f":"INDEX(Sheet2!$A$36:$B$67,MATCH(Group_A[[#This Row],[Column2]],CountryFlag,0),1)","v":"JPN"},{"$f":"INDEX(Sheet2!$A$36:$B$67,MATCH(Group_A[[#This Row],[Column4]],CountryFlag,0),1)","v":"COL"},{"$f":"CONCATENATE(Group_A[[#This Row],[Column6]],\"-\",Group_A[[#This Row],[Column7]])","v":"JPN-COL"},"NGA-ARG","2–3","25 June 2014","Estádio Beira-Rio, Porto Alegre",null,null,null,"United States",null,null,null,null,null,null,null,"Belgium"]
["24 June 2014","Greece","2–1","Ivory Coast","Estádio Castelão, Fortaleza",{"$f":"INDEX(Sheet2!$A$36:$B$67,MATCH(Group_A[[#This Row],[Column2]],CountryFlag,0),1)","v":"GRE"},{"$f":"INDEX(Sheet2!$A$36:$B$67,MATCH(Group_A[[#This Row],[Column4]],CountryFlag,0),1)","v":"CIV"},{"$f":"CONCATENATE(Group_A[[#This Row],[Column6]],\"-\",Group_A[[#This Row],[Column7]])","v":"GRE-CIV"},"CRC-GRE","1 (5)-1 (3)","2014-06-29","Recife"]
["14 June 2014","Uruguay","1–3","Costa Rica","Estádio Castelão, Fortaleza",{"$f":"INDEX(Sheet2!$A$36:$B$67,MATCH(Group_A[[#This Row],[Column2]],CountryFlag,0),1)","v":"URU"},{"$f":"INDEX(Sheet2!$A$36:$B$67,MATCH(Group_A[[#This Row],[Column4]],CountryFlag,0),1)","v":"CRC"},{"$f":"CONCATENATE(Group_A[[#This Row],[Column6]],\"-\",Group_A[[#This Row],[Column7]])","v":"URU-CRC"},"HON-SUI","0–3","25 June 2014","Arena da Amazônia, Manaus"]
["14 June 2014","England","1–2","Italy","Arena da Amazônia, Manaus",{"$f":"INDEX(Sheet2!$A$36:$B$67,MATCH(Group_A[[#This Row],[Column2]],CountryFlag,0),1)","v":"ENG"},{"$f":"INDEX(Sheet2!$A$36:$B$67,MATCH(Group_A[[#This Row],[Column4]],CountryFlag,0),1)","v":"ITA"},{"$f":"CONCATENATE(Group_A[[#This Row],[Column6]],\"-\",Group_A[[#This Row],[Column7]])","v":"ENG-ITA"},"GHA-USA","1–2","16 June 2014","Arena das Dunas, Natal"]
["19 June 2014","Uruguay","2–1","England","Arena de São Paulo, São Paulo",{"$f":"INDEX(Sheet2!$A$36:$B$67,MATCH(Group_A[[#This Row],[Column2]],CountryFlag,0),1)","v":"URU"},{"$f":"INDEX(Sheet2!$A$36:$B$67,MATCH(Group_A[[#This Row],[Column4]],CountryFlag,0),1)","v":"ENG"},{"$f":"CONCATENATE(Group_A[[#This Row],[Column6]],\"-\",Group_A[[#This Row],[Column7]])","v":"URU-ENG"},"SUI-ECU","2–1","15 June 2014","Estádio Nacional Mané Garrincha, Brasília"]
["20 June 2014","Italy","0–1","Costa Rica","Arena Pernambuco, Recife",{"$f":"INDEX(Sheet2!$A$36:$B$67,MATCH(Group_A[[#This Row],[Column2]],CountryFlag,0),1)","v":"ITA"},{"$f":"INDEX(Sheet2!$A$36:$B$67,MATCH(Group_A[[#This Row],[Column4]],CountryFlag,0),1)","v":"CRC"},{"$f":"CONCATENATE(Group_A[[#This Row],[Column6]],\"-\",Group_A[[#This Row],[Column7]])","v":"ITA-CRC"},"BRA-MEX","0–0","17 June 2014","Estádio Castelão, Fortaleza"]
["24 June 2014","Italy","0–1","Uruguay","Arena das Dunas, Natal",{"$f":"INDEX(Sheet2!$A$36:$B$67,MATCH(Group_A[[#This Row],[Column2]],CountryFlag,0),1)","v":"ITA"},{"$f":"INDEX(Sheet2!$A$36:$B$67,MATCH(Group_A[[#This Row],[Column4]],CountryFlag,0),1)","v":"URU"},{"$f":"CONCATENATE(Group_A[[#This Row],[Column6]],\"-\",Group_A[[#This Row],[Column7]])","v":"ITA-URU"},"GER-POR","4–0","16 June 2014","Arena Fonte Nova, Salvador"]
["24 June 2014","Costa Rica","0–0","England","Estádio Mineirão, Belo Horizonte",{"$f":"INDEX(Sheet2!$A$36:$B$67,MATCH(Group_A[[#This Row],[Column2]],CountryFlag,0),1)","v":"CRC"},{"$f":"INDEX(Sheet2!$A$36:$B$67,MATCH(Group_A[[#This Row],[Column4]],CountryFlag,0),1)","v":"ENG"},{"$f":"CONCATENATE(Group_A[[#This Row],[Column6]],\"-\",Group_A[[#This Row],[Column7]])","v":"CRC-ENG"},"ARG-BIH","2–1","15 June 2014","Estádio do Maracanã, Rio de Janeiro"]
["15 June 2014","Switzerland","2–1","Ecuador","Estádio Nacional Mané Garrincha, Brasília",{"$f":"INDEX(Sheet2!$A$36:$B$67,MATCH(Group_A[[#This Row],[Column2]],CountryFlag,0),1)","v":"SUI"},{"$f":"INDEX(Sheet2!$A$36:$B$67,MATCH(Group_A[[#This Row],[Column4]],CountryFlag,0),1)","v":"ECU"},{"$f":"CONCATENATE(Group_A[[#This Row],[Column6]],\"-\",Group_A[[#This Row],[Column7]])","v":"SUI-ECU"},"ARG-IRN","1–0","21 June 2014","Estádio Mineirão, Belo Horizonte"]
["15 June 2014","France","3–0","Honduras","Estádio Beira-Rio, Porto Alegre",{"$f":"INDEX(Sheet2!$A$36:$B$67,MATCH(Group_A[[#This Row],[Column2]],CountryFlag,0),1)","v":"FRA"},{"$f":"INDEX(Sheet2!$A$36:$B$67,MATCH(Group_A[[#This Row],[Column4]],CountryFlag,0),1)","v":"HON"},{"$f":"CONCATENATE(Group_A[[#This Row],[Column6]],\"-\",Group_A[[#This Row],[Column7]])","v":"FRA-HON"},"COL-CIV","2–1","19 June 2014","Estádio Nacional Mané Garrincha, Brasília"]
["20 June 2014","Switzerland","2–5","France","Arena Fonte Nova, Salvador",{"$f":"INDEX(Sheet2!$A$36:$B$67,MATCH(Group_A[[#This Row],[Column2]],CountryFlag,0),1)","v":"SUI"},{"$f":"INDEX(Sheet2!$A$36:$B$67,MATCH(Group_A[[#This Row],[Column4]],CountryFlag,0),1)","v":"FRA"},{"$f":"CONCATENATE(Group_A[[#This Row],[Column6]],\"-\",Group_A[[#This Row],[Column7]])","v":"SUI-FRA"},"GRE-CIV","2–1","24 June 2014","Estádio Castelão, Fortaleza"]
["20 June 2014","Honduras","1–2","Ecuador","Arena da Baixada, Curitiba",{"$f":"INDEX(Sheet2!$A$36:$B$67,MATCH(Group_A[[#This Row],[Column2]],CountryFlag,0),1)","v":"HON"},{"$f":"INDEX(Sheet2!$A$36:$B$67,MATCH(Group_A[[#This Row],[Column4]],CountryFlag,0),1)","v":"ECU"},{"$f":"CONCATENATE(Group_A[[#This Row],[Column6]],\"-\",Group_A[[#This Row],[Column7]])","v":"HON-ECU"},"CIV-JPN","2–1","14 June 2014","Arena Pernambuco, Recife"]
["25 June 2014","Honduras","0–3","Switzerland","Arena da Amazônia, Manaus",{"$f":"INDEX(Sheet2!$A$36:$B$67,MATCH(Group_A[[#This Row],[Column2]],CountryFlag,0),1)","v":"HON"},{"$f":"INDEX(Sheet2!$A$36:$B$67,MATCH(Group_A[[#This Row],[Column4]],CountryFlag,0),1)","v":"SUI"},{"$f":"CONCATENATE(Group_A[[#This Row],[Column6]],\"-\",Group_A[[#This Row],[Column7]])","v":"HON-SUI"},"NED-MEX","2-1","2014-06-29","Fortaleza"]
["25 June 2014","Ecuador","0–0","France","Estádio do Maracanã, Rio de Janeiro",{"$f":"INDEX(Sheet2!$A$36:$B$67,MATCH(Group_A[[#This Row],[Column2]],CountryFlag,0),1)","v":"ECU"},{"$f":"INDEX(Sheet2!$A$36:$B$67,MATCH(Group_A[[#This Row],[Column4]],CountryFlag,0),1)","v":"FRA"},{"$f":"CONCATENATE(Group_A[[#This Row],[Column6]],\"-\",Group_A[[#This Row],[Column7]])","v":"ECU-FRA"},"NED-CRC","0 (4)-0 (3)","2014-07-05","Salvador"]
["15 June 2014","Argentina","2–1","Bosnia and Herzegovina","Estádio do Maracanã, Rio de Janeiro",{"$f":"INDEX(Sheet2!$A$36:$B$67,MATCH(Group_A[[#This Row],[Column2]],CountryFlag,0),1)","v":"ARG"},{"$f":"INDEX(Sheet2!$A$36:$B$67,MATCH(Group_A[[#This Row],[Column4]],CountryFlag,0),1)","v":"BIH"},{"$f":"CONCATENATE(Group_A[[#This Row],[Column6]],\"-\",Group_A[[#This Row],[Column7]])","v":"ARG-BIH"},"COL-URU","2-0","2014-06-28","Rio de Janeiro"]
["16 June 2014","Iran","0–0","Nigeria","Arena da Baixada, Curitiba",{"$f":"INDEX(Sheet2!$A$36:$B$67,MATCH(Group_A[[#This Row],[Column2]],CountryFlag,0),1)","v":"IRN"},{"$f":"INDEX(Sheet2!$A$36:$B$67,MATCH(Group_A[[#This Row],[Column4]],CountryFlag,0),1)","v":"NGA"},{"$f":"CONCATENATE(Group_A[[#This Row],[Column6]],\"-\",Group_A[[#This Row],[Column7]])","v":"IRN-NGA"},"RUS-KOR","1–1","17 June 2014","Arena Pantanal, Cuiabá"]
["21 June 2014","Argentina","1–0","Iran","Estádio Mineirão, Belo Horizonte",{"$f":"INDEX(Sheet2!$A$36:$B$67,MATCH(Group_A[[#This Row],[Column2]],CountryFlag,0),1)","v":"ARG"},{"$f":"INDEX(Sheet2!$A$36:$B$67,MATCH(Group_A[[#This Row],[Column4]],CountryFlag,0),1)","v":"IRN"},{"$f":"CONCATENATE(Group_A[[#This Row],[Column6]],\"-\",Group_A[[#This Row],[Column7]])","v":"ARG-IRN"},"JPN-GRE","0–0","19 June 2014","Arena das Dunas, Natal"]
["21 June 2014","Nigeria","1–0","Bosnia and Herzegovina","Arena Pantanal, Cuiabá",{"$f":"INDEX(Sheet2!$A$36:$B$67,MATCH(Group_A[[#This Row],[Column2]],CountryFlag,0),1)","v":"NGA"},{"$f":"INDEX(Sheet2!$A$36:$B$67,MATCH(Group_A[[#This Row],[Column4]],CountryFlag,0),1)","v":"BIH"},{"$f":"CONCATENATE(Group_A[[#This Row],[Column6]],\"-\",Group_A[[#This Row],[Column7]])","v":"NGA-BIH"},"AUS-NED","2–3","18 June 2014","Estádio Beira-Rio, Porto Alegre"]
["25 June 2014","Nigeria","2–3","Argentina","Estádio Beira-Rio, Porto Alegre",{"$f":"INDEX(Sheet2!$A$36:$B$67,MATCH(Group_A[[#This Row],[Column2]],CountryFlag,0),1)","v":"NGA"},{"$f":"INDEX(Sheet2!$A$36:$B$67,MATCH(Group_A[[#This Row],[Column4]],CountryFlag,0),1)","v":"ARG"},{"$f":"CONCATENATE(Group_A[[#This Row],[Column6]],\"-\",Group_A[[#This Row],[Column7]])","v":"NGA-ARG"},"CHI-AUS","3–1","13 June 2014","Arena Pantanal, Cuiabá"]
["25 June 2014","Bosnia and Herzegovina","3–1","Iran","Arena Fonte Nova, Salvador",{"$f":"INDEX(Sheet2!$A$36:$B$67,MATCH(Group_A[[#This Row],[Column2]],CountryFlag,0),1)","v":"BIH"},{"$f":"INDEX(Sheet2!$A$36:$B$67,MATCH(Group_A[[#This Row],[Column4]],CountryFlag,0),1)","v":"IRN"},{"$f":"CONCATENATE(Group_A[[#This Row],[Column6]],\"-\",Group_A[[#This Row],[Column7]])","v":"BIH-IRN"},"COL-GRE","3–0","14 June 2014","Estádio Mineirão, Belo Horizonte"]
["16 June 2014","Germany","4–0","Portugal","Arena Fonte Nova, Salvador",{"$f":"INDEX(Sheet2!$A$36:$B$67,MATCH(Group_A[[#This Row],[Column2]],CountryFlag,0),1)","v":"GER"},{"$f":"INDEX(Sheet2!$A$36:$B$67,MATCH(Group_A[[#This Row],[Column4]],CountryFlag,0),1)","v":"POR"},{"$f":"CONCATENATE(Group_A[[#This Row],[Column6]],\"-\",Group_A[[#This Row],[Column7]])","v":"GER-POR"},"BEL-RUS","1–0","22 June 2014","Estádio do Maracanã, Rio de Janeiro"]
["16 June 2014","Ghana","1–2","United States","Arena das Dunas, Natal",{"$f":"INDEX(Sheet2!$A$36:$B$67,MATCH(Group_A[[#This Row],[Column2]],CountryFlag,0),1)","v":"GHA"},{"$f":"INDEX(Sheet2!$A$36:$B$67,MATCH(Group_A[[#This Row],[Column4]],CountryFlag,0),1)","v":"USA"},{"$f":"CONCATENATE(Group_A[[#This Row],[Column6]],\"-\",Group_A[[#This Row],[Column7]])","v":"GHA-USA"},"BRA-CRO","3–1","12 June 2014","Arena de São Paulo, São Paulo"]
["21 June 2014","Germany","2–2","Ghana","Estádio Castelão, Fortaleza",{"$f":"INDEX(Sheet2!$A$36:$B$67,MATCH(Group_A[[#This Row],[Column2]],CountryFlag,0),1)","v":"GER"},{"$f":"INDEX(Sheet2!$A$36:$B$67,MATCH(Group_A[[#This Row],[Column4]],CountryFlag,0),1)","v":"GHA"},{"$f":"CONCATENATE(Group_A[[#This Row],[Column6]],\"-\",Group_A[[#This Row],[Column7]])","v":"GER-GHA"},"HON-ECU","1–2","20 June 2014","Arena da Baixada, Curitiba"]
["22 June 2014","United States","2–2","Portugal","Arena da Amazônia, Manaus",{"$f":"INDEX(Sheet2!$A$36:$B$67,MATCH(Group_A[[#This Row],[Column2]],CountryFlag,0),1)","v":"USA"},{"$f":"INDEX(Sheet2!$A$36:$B$67,MATCH(Group_A[[#This Row],[Column4]],CountryFlag,0),1)","v":"POR"},{"$f":"CONCATENATE(Group_A[[#This Row],[Column6]],\"-\",Group_A[[#This Row],[Column7]])","v":"USA-POR"},"KOR-ALG","2–4","22 June 2014","Estádio Beira-Rio, Porto Alegre"]
["26 June 2014","United States","0–1","Germany","Arena Pernambuco, Recife",{"$f":"INDEX(Sheet2!$A$36:$B$67,MATCH(Group_A[[#This Row],[Column2]],CountryFlag,0),1)","v":"USA"},{"$f":"INDEX(Sheet2!$A$36:$B$67,MATCH(Group_A[[#This Row],[Column4]],CountryFlag,0),1)","v":"GER"},{"$f":"CONCATENATE(Group_A[[#This Row],[Column6]],\"-\",Group_A[[#This Row],[Column7]])","v":"USA-GER"},"FRA-HON","3–0","15 June 2014","Estádio Beira-Rio, Porto Alegre"]
["26 June 2014","Portugal","2–1","Ghana","Estádio Nacional Mané Garrincha, Brasília",{"$f":"INDEX(Sheet2!$A$36:$B$67,MATCH(Group_A[[#This Row],[Column2]],CountryFlag,0),1)","v":"POR"},{"$f":"INDEX(Sheet2!$A$36:$B$67,MATCH(Group_A[[#This Row],[Column4]],CountryFlag,0),1)","v":"GHA"},{"$f":"CONCATENATE(Group_A[[#This Row],[Column6]],\"-\",Group_A[[#This Row],[Column7]])","v":"POR-GHA"},"URU-ENG","2–1","19 June 2014","Arena de São Paulo, São Paulo"]
["17 June 2014","Belgium","2–1","Algeria","Estádio Mineirão, Belo Horizonte",{"$f":"INDEX(Sheet2!$A$36:$B$67,MATCH(Group_A[[#This Row],[Column2]],CountryFlag,0),1)","v":"BEL"},{"$f":"INDEX(Sheet2!$A$36:$B$67,MATCH(Group_A[[#This Row],[Column4]],CountryFlag,0),1)","v":"ALG"},{"$f":"CONCATENATE(Group_A[[#This Row],[Column6]],\"-\",Group_A[[#This Row],[Column7]])","v":"BEL-ALG"},"ITA-URU","0–1","24 June 2014","Arena das Dunas, Natal"]
["17 June 2014","Russia","1–1","South Korea","Arena Pantanal, Cuiabá",{"$f":"INDEX(Sheet2!$A$36:$B$67,MATCH(Group_A[[#This Row],[Column2]],CountryFlag,0),1)","v":"RUS"},{"$f":"INDEX(Sheet2!$A$36:$B$67,MATCH(Group_A[[#This Row],[Column4]],CountryFlag,0),1)","v":"KOR"},{"$f":"CONCATENATE(Group_A[[#This Row],[Column6]],\"-\",Group_A[[#This Row],[Column7]])","v":"RUS-KOR"},"BRA-COL","2-1","2014-07-04","Fortaleza"]
["22 June 2014","Belgium","1–0","Russia","Estádio do Maracanã, Rio de Janeiro",{"$f":"INDEX(Sheet2!$A$36:$B$67,MATCH(Group_A[[#This Row],[Column2]],CountryFlag,0),1)","v":"BEL"},{"$f":"INDEX(Sheet2!$A$36:$B$67,MATCH(Group_A[[#This Row],[Column4]],CountryFlag,0),1)","v":"RUS"},{"$f":"CONCATENATE(Group_A[[#This Row],[Column6]],\"-\",Group_A[[#This Row],[Column7]])","v":"BEL-RUS"},"FRA-NGA","2-0","2014-06-30","Brasília"]
["22 June 2014","South Korea","2–4","Algeria","Estádio Beira-Rio, Porto Alegre",{"$f":"INDEX(Sheet2!$A$36:$B$67,MATCH(Group_A[[#This Row],[Column2]],CountryFlag,0),1)","v":"KOR"},{"$f":"INDEX(Sheet2!$A$36:$B$67,MATCH(Group_A[[#This Row],[Column4]],CountryFlag,0),1)","v":"ALG"},{"$f":"CONCATENATE(Group_A[[#This Row],[Column6]],\"-\",Group_A[[#This Row],[Column7]])","v":"KOR-ALG"},"CRO-MEX","1–3","23 June 2014","Arena Pernambuco, Recife"]
["26 June 2014","South Korea","0–1","Belgium","Arena de São Paulo, São Paulo",{"$f":"INDEX(Sheet2!$A$36:$B$67,MATCH(Group_A[[#This Row],[Column2]],CountryFlag,0),1)","v":"KOR"},{"$f":"INDEX(Sheet2!$A$36:$B$67,MATCH(Group_A[[#This Row],[Column4]],CountryFlag,0),1)","v":"BEL"},{"$f":"CONCATENATE(Group_A[[#This Row],[Column6]],\"-\",Group_A[[#This Row],[Column7]])","v":"KOR-BEL"},"ESP-CHI","0–2","18 June 2014","Estádio do Maracanã, Rio de Janeiro"]
["26 June 2014","Algeria","1–1","Russia","Arena da Baixada, Curitiba",{"$f":"INDEX(Sheet2!$A$36:$B$67,MATCH(Group_A[[#This Row],[Column2]],CountryFlag,0),1)","v":"ALG"},{"$f":"INDEX(Sheet2!$A$36:$B$67,MATCH(Group_A[[#This Row],[Column4]],CountryFlag,0),1)","v":"RUS"},{"$f":"CONCATENATE(Group_A[[#This Row],[Column6]],\"-\",Group_A[[#This Row],[Column7]])","v":"ALG-RUS"},"ESP-NED","1–5","13 June 2014","Arena Fonte Nova, Salvador"]
["2014-06-28","Brazil","1 (3)-1 (2)","Chile","Belo Horizonte",{"$f":"INDEX(Sheet2!$A$36:$B$67,MATCH(B50,CountryFlag,0),1)","v":"BRA"},{"$f":"INDEX(Sheet2!$A$36:$B$67,MATCH(D50,CountryFlag,0),1)","v":"CHI"},{"$f":"CONCATENATE(F50,\"-\",G50)","v":"BRA-CHI"},"URU-CRC","1–3","14 June 2014","Estádio Castelão, Fortaleza"]
["2014-06-28","Colombia","2-0","Uruguay","Rio de Janeiro",{"$f":"INDEX(Sheet2!$A$36:$B$67,MATCH(B51,CountryFlag,0),1)","v":"COL"},{"$f":"INDEX(Sheet2!$A$36:$B$67,MATCH(D51,CountryFlag,0),1)","v":"URU"},{"$f":"CONCATENATE(F51,\"-\",G51)","v":"COL-URU"},"FRA-GER","0-1","2014-07-04","Rio de Janeiro"]
["2014-06-30","France","2-0","Nigeria","Brasília",{"$f":"INDEX(Sheet2!$A$36:$B$67,MATCH(B52,CountryFlag,0),1)","v":"FRA"},{"$f":"INDEX(Sheet2!$A$36:$B$67,MATCH(D52,CountryFlag,0),1)","v":"NGA"},"FRA-NGA","NED-CHI","2–0","23 June 2014","Arena de São Paulo, São Paulo"]
["2014-06-30","Germany","2-1","Algeria","Porto Alegre",{"$f":"INDEX(Sheet2!$A$36:$B$67,MATCH(B53,CountryFlag,0),1)","v":"GER"},{"$f":"INDEX(Sheet2!$A$36:$B$67,MATCH(D53,CountryFlag,0),1)","v":"ALG"},"GER-ALG","BIH-IRN","3–1","25 June 2014","Arena Fonte Nova, Salvador"]
["2014-06-29","Netherlands","2-1","Mexico","Fortaleza",{"$f":"INDEX(Sheet2!$A$36:$B$67,MATCH(B54,CountryFlag,0),1)","v":"NED"},{"$f":"INDEX(Sheet2!$A$36:$B$67,MATCH(D54,CountryFlag,0),1)","v":"MEX"},"NED-MEX","ITA-CRC","0–1","20 June 2014","Arena Pernambuco, Recife"]
["2014-06-29","Costa Rica","1 (5)-1 (3)","Greece","Recife",{"$f":"INDEX(Sheet2!$A$36:$B$67,MATCH(B55,CountryFlag,0),1)","v":"CRC"},{"$f":"INDEX(Sheet2!$A$36:$B$67,MATCH(D55,CountryFlag,0),1)","v":"GRE"},"CRC-GRE","ARG-BEL","1-0","2014-07-05","Brasília"]
["2014-07-01","Argentina","1-0","Switzerland","São Paulo",{"$f":"INDEX(Sheet2!$A$36:$B$67,MATCH(B56,CountryFlag,0),1)","v":"ARG"},{"$f":"INDEX(Sheet2!$A$36:$B$67,MATCH(D56,CountryFlag,0),1)","v":"SUI"},"ARG-SUI","MEX-CMR","1–0","13 June 2014","Arena das Dunas, Natal"]
["2014-07-01","Belgium","2-1","United States","Salvador",{"$f":"INDEX(Sheet2!$A$36:$B$67,MATCH(B57,CountryFlag,0),1)","v":"BEL"},{"$f":"INDEX(Sheet2!$A$36:$B$67,MATCH(D57,CountryFlag,0),1)","v":"USA"},"BEL-USA","BEL-ALG","2–1","17 June 2014","Estádio Mineirão, Belo Horizonte"]
["2014-07-04","Brazil","2-1","Colombia","Fortaleza",{"$f":"INDEX(Sheet2!$A$36:$B$67,MATCH(B58,CountryFlag,0),1)","v":"BRA"},{"$f":"INDEX(Sheet2!$A$36:$B$67,MATCH(D58,CountryFlag,0),1)","v":"COL"},"BRA-COL","ALG-RUS","1–1","26 June 2014","Arena da Baixada, Curitiba"]
["2014-07-04","France","0-1","Germany","Rio de Janeiro",{"$f":"INDEX(Sheet2!$A$36:$B$67,MATCH(B59,CountryFlag,0),1)","v":"FRA"},{"$f":"INDEX(Sheet2!$A$36:$B$67,MATCH(D59,CountryFlag,0),1)","v":"GER"},"FRA-GER","IRN-NGA","0–0","16 June 2014","Arena da Baixada, Curitiba"]
["2014-07-05","Netherlands","0 (4)-0 (3)","Costa Rica","Salvador",{"$f":"INDEX(Sheet2!$A$36:$B$67,MATCH(B60,CountryFlag,0),1)","v":"NED"},{"$f":"INDEX(Sheet2!$A$36:$B$67,MATCH(D60,CountryFlag,0),1)","v":"CRC"},"NED-CRC","USA-GER","0–1","26 June 2014","Arena Pernambuco, Recife"]
["2014-07-05","Argentina","1-0","Belgium","Brasília",{"$f":"INDEX(Sheet2!$A$36:$B$67,MATCH(B61,CountryFlag,0),1)","v":"ARG"},{"$f":"INDEX(Sheet2!$A$36:$B$67,MATCH(D61,CountryFlag,0),1)","v":"BEL"},"ARG-BEL","AUS-ESP","0–3","23 June 2014","Arena da Baixada, Curitiba"]
["2014-07-08","Brazil","1-7","Germany","Belo Horizonte",{"$f":"INDEX(Sheet2!$A$36:$B$67,MATCH(B62,CountryFlag,0),1)","v":"BRA"},{"$f":"INDEX(Sheet2!$A$36:$B$67,MATCH(D62,CountryFlag,0),1)","v":"GER"},"BRA-GER","CRC-ENG","0–0","24 June 2014","Estádio Mineirão, Belo Horizonte"]
["2014-07-09","Netherlands","0 (2)-0 (4)","Argentina","São Paulo",{"$f":"INDEX(Sheet2!$A$36:$B$67,MATCH(B63,CountryFlag,0),1)","v":"NED"},{"$f":"INDEX(Sheet2!$A$36:$B$67,MATCH(D63,CountryFlag,0),1)","v":"ARG"},"NED-ARG"]

{"sheet":"Sheet2","index":2,"n_rows":67,"n_cols":90,"rows_kept":67,"cut":false,"hidden":false,"merged":[[0,38,0,43],[0,15,0,16],[0,18,0,26],[0,28,0,37]]}
[null,null,null,null,null,null,null,null,null,null,null,null,null,null,null,"Scoring",null,null,"Attack",null,null,null,null,null,null,null,null,null,"Defense",null,null,null,null,null,null,null,null,null,"Passing"]
[null,"Current ranking","Coach",null,null,"Stage","Matches Played","Goals For","Total Goals Scored","Goals Conceded","Penalty Goal","Own Goals For","Open Play Goals","Set Piece Goals","Distance covered","Goal/min","Goal/attempt","Attempts","Shots saved","Attempt off target","Shots blocked","Goals scored","Dribble into penalty area","Deliveries in penalty area","Crosses total","Crosses Completed","Offsides","Total attempts","Tackles","Blocks","Saves","Attempted Clearances","Completed Clearances","Recovered Balls","Tackles","Tackles won","Tackles lost","Offsides given","Short Passes Complete","Medium Passes Complete","Long Passes Complete","Total passes complete","Crosses","Throw ins",null,null,null,"Short Passes Complete",null,null,null,null,null,{"$f":"CHOOSE($AW$16,AU15,AU16,AU17,AU18,AU19,AU20)","v":"Goal/min"},null,{"$f":"$AV$8 & \" \" &BB2","v":"Germany Goal/min"},null,{"$f":"CHOOSE($AW$17,AU15,AU16,AU17,AU18,AU19,AU20)","v":"Set Piece Goals"},null,{"$f":"$AV$8 & \" \" &BF2","v":"Germany Set Piece Goals"},null,{"$f":"CHOOSE($AW$18,AU15,AU16,AU17,AU18,AU19,AU20)","v":"Goals For"},null,{"$f":"$AV$8 & \" \" &BJ2","v":"Germany Goals For"},null,null,null,null,"Top goals","Open play","Set piece","Penalty",null,null,25,null,28,null,null,null,null,null,null,null,"Top goals","Open play","Set piece","Penalty"]
[null,1,"Joachim Löw",1,"Germany","Winners",7,18,18,4,1,0,15,3,"846.8 km",38,5.4,{"$f":"SUM(S3:V3)","v":97},29,27,23,18,28,2,148,40,17,{"$f":"SUM(AC3:AE3)","v":157},110,24,23,104,88,327,110,31,79,20,1017,2763,377,{"$f":"SUM(AM3:AO3)","v":4157},148,221,null,null,"Scoring",{"$f":"parameterSel","v":"Scoring"},{"$f":"MATCH($AV$3,$P$1:$AR$1,0)","v":1},{"$f":"MATCH(AV3,lstParameters,0)","v":1},null,"Germany",2,{"$f":"INDEX($E$2:$AR$34,MATCH($AZ3,$E$2:$E$34,0),MATCH(CHOOSE($AW$16,$AU$15,$AU$16,$AU$17,$AU$18,$AU$19,$AU$20),$E$2:$AR$2,0))","v":38},{"$f":"BB3/MAX($BB$3:$BB$34)","v":0.14074074074074075},{"$f":"IF(linkedCellFlag=$AZ3,$BC3,NA())/MAX($BC$3:$BC$34)","v":0.14074074074074075},5,{"$f":"INDEX($E$2:$AR$34,MATCH($AZ3,$E$2:$E$34,0),MATCH(CHOOSE($AW$17,$AU$15,$AU$16,$AU$17,$AU$18,$AU$19,$AU$20),$E$2:$AR$2,0))","v":3},{"$f":"IF($BF$2=\"Goal/min\",1-BF3/MAX($BF$3:$BF$34),BF3/MAX($BF$3:$BF$34))","v":1},{"$f":"IF(linkedCellFlag=$AZ3,$BG3,NA())/MAX($BG$3:$BG$34)","v":1},8,{"$f":"INDEX($E$2:$AR$34,MATCH($AZ3,$E$2:$E$34,0),MATCH(CHOOSE($AW$18,$AU$15,$AU$16,$AU$17,$AU$18,$AU$19,$AU$20),$E$2:$AR$2,0))","v":18},{"$f":"BJ3/MAX($BJ$3:$BJ$34)","v":1},{"$f":"IF(linkedCellFlag=$AZ3,$BK3,NA())/MAX($BK$3:$BK$34)","v":1},null,846.8,{"$f":"AP3/G3","v":593.85714285714289},1,{"$f":"INDEX($E$3:$N$34,MATCH(LARGE($I$3:$I$34,BP3),$I$3:$I$34,0),1)","v":"Germany"},{"$f":"INDEX($E$3:$N$34,MATCH(BQ3,$E$3:$E$34,0),9)","v":15},{"$f":"INDEX($E$3:$N$34,MATCH(BQ3,$E$3:$E$34,0),10)","v":3},{"$f":"INDEX($E$3:$N$34,MATCH(BQ3,$E$3:$E$34,0),7)","v":1},null,null,{"$f":"INDEX(Sheet3!$AN$3:$AN$34,BW2,1)","v":"Germany"},null,{"$f":"INDEX(Sheet3!$AN$3:$AN$34,BY2,1)","v":"United States"},null,{"$f":"BW3","v":"Germany"},"Tournament average",{"$f":"BY3","v":"United States"},null,null,1,"Germany",15,3,1]
[null,4,"José Pékerman (Argentina)",2,"Colombia",{"$f":"CHOOSE($G4,\"\",\"\",\"Group stage\",\"Round of 16\",\"Quarter finals\",\"Semi finals\", \"Finals\")","v":"Quarter finals"},5,12,12,4,2,0,9,3,"516.6 km",38,4.8,{"$f":"SUM(S4:V4)","v":57},12,19,16,10,11,3,65,19,10,{"$f":"SUM(AC4:AE4)","v":127},85,22,20,56,47,180,85,22,63,6,407,902,168,{"$f":"SUM(AM4:AO4)","v":1477},65,159,null,null,null,null,null,{"$f":"\"Team: \"&linkedCellFlag &\" \" &CHAR(10)\n&\"Stage: \" &INDEX($E$3:$F$34,MATCH(linkedCellFlag,$E$3:$E$34,0),2) &CHAR(10) &\"Current Rank: \" &INDEX($B$3:$E$34,MATCH(linkedCellFlag,$E$3:$E$34,0),1) &CHAR(10) &\"Coach: \" &INDEX($B$3:$E$34,MATCH(linkedCellFlag,$E$3:$E$34,0),2) & CHAR(10) &\"Distance covered by \"&linkedCellFlag&\" in \" &CHAR(10) &INDEX(Sheet2!$E$3:$G$34,MATCH(linkedCellFlag,Sheet2!$E$3:$E$34,0),3)&\" mathces is \" &INDEX(Sheet2!$E$3:$O$34,MATCH(linkedCellFlag,Sheet2!$E$3:$E$34,0),COLUMNS(Sheet2!$E$3:$O$3))","v":"Team: Germany \nStage: Winners\nCurrent Rank: 1\nCoach: Joachim Löw\nDistance covered by Germany in \n7 mathces is 846.8 km"},null,"Colombia",2,{"$f":"INDEX($E$2:$AR$34,MATCH($AZ4,$E$2:$E$34,0),MATCH(CHOOSE($AW$16,$AU$15,$AU$16,$AU$17,$AU$18,$AU$19,$AU$20),$E$2:$AR$2,0))","v":38},{"$f":"BB4/MAX($BB$3:$BB$34)","v":0.14074074074074075},{"$error":"#N/A"},5,3,{"$f":"IF($BF$2=\"Goal/min\",1-BF4/MAX($BF$3:$BF$34),BF4/MAX($BF$3:$BF$34))","v":1},{"$error":"#N/A"},8,12,{"$f":"BJ4/MAX($BJ$3:$BJ$34)","v":0.66666666666666663},{"$error":"#N/A"},null,516.6,{"$f":"AP4/G4","v":295.39999999999998},2,{"$f":"INDEX($E$3:$N$34,MATCH(LARGE($I$3:$I$34,BP4),$I$3:$I$34,0),1)","v":"Netherlands"},{"$f":"INDEX($E$3:$N$34,MATCH(BQ4,$E$3:$E$34,0),9)","v":13},{"$f":"INDEX($E$3:$N$34,MATCH(BQ4,$E$3:$E$34,0),10)","v":1},{"$f":"INDEX($E$3:$N$34,MATCH(BQ4,$E$3:$E$34,0),7)","v":2},null,null,{"$f":"INDEX($E$2:$AR$34,MATCH(BW$3,$E$2:$E$34,0),MATCH($BX4,$E$2:$AR$2,0))","v":7},"Matches played",{"$f":"INDEX($E$2:$AR$34,MATCH(BY$3,$E$2:$E$34,0),MATCH($BX4,$E$2:$AR$2,0))","v":4},{"$f":"7-CA4","v":0},{"$f":"BW4","v":7},0,4,{"$f":"7-CA4","v":0},null,2,"Netherlands",13,1,2]
[null,3,"Louis van Gaal",3,"Netherlands","3rd place",7,15,15,4,2,0,13,1,"826.3 km",46,6,90,26,26,23,15,31,7,121,28,27,123,92,18,13,93,81,308,92,30,57,16,569,2006,425,3000,121,228,null,null,{"$f":"IF($AW$3<3,K2,IF($AW$3<12,U2,IF($AW$3<22,AG2,AO2)))","v":"Penalty Goal"},{"$f":"INDEX($E$2:$AR$34,MATCH(linkedCellFlag,$E$2:$E$34,0),MATCH($AU5,$E$2:$AR$2,0))","v":1},null,null,null,"Netherlands",2,46,0.17037037037037037,{"$error":"#N/A"},5,1,0.33333333333333331,{"$error":"#N/A"},8,15,0.83333333333333337,{"$error":"#N/A"},null,826.3,428.57142857142856,3,{"$f":"INDEX($E$3:$N$34,MATCH(LARGE($I$3:$I$34,BP5),$I$3:$I$34,0),1)","v":"Colombia"},{"$f":"INDEX($E$3:$N$34,MATCH(BQ5,$E$3:$E$34,0),9)","v":9},{"$f":"INDEX($E$3:$N$34,MATCH(BQ5,$E$3:$E$34,0),10)","v":3},{"$f":"INDEX($E$3:$N$34,MATCH(BQ5,$E$3:$E$34,0),7)","v":2},null,5.2,{"$f":"INDEX($E$2:$AR$34,MATCH(BW$3,$E$2:$E$34,0),MATCH($BX5,$E$2:$AR$2,0))","v":18},"Total goals scored",{"$f":"INDEX($E$2:$AR$34,MATCH(BY$3,$E$2:$E$34,0),MATCH($BX5,$E$2:$AR$2,0))","v":5},{"$f":"MAX($H$3:$H$34)-CA5","v":0},18,3,5,{"$f":"MAX($H$3:$H$34)-CC5","v":13},null,3,"Colombia",9,3,2,null,5]
[null,7,"Luiz Felipe Scolari",4,"Brazil","4h place",7,11,11,11,1,0,8,3,"747.6 km",60,10.1,111,33,39,28,11,26,7,155,36,15,168,141,17,10,93,72,300,141,48,93,9,727,1688,316,2731,155,203,null,null,{"$f":"IF($AW$3<3,L2,IF($AW$3<12,V2,IF($AW$3<22,AH2,AN2)))","v":"Own Goals For"},{"$f":"INDEX($E$2:$AR$34,MATCH(linkedCellFlag,$E$2:$E$34,0),MATCH($AU6,$E$2:$AR$2,0))","v":0},null,null,null,"Brazil",2,60,0.22222222222222221,{"$error":"#N/A"},5,3,1,{"$error":"#N/A"},8,11,0.61111111111111116,{"$error":"#N/A"},null,747.6,390.14285714285717,4,{"$f":"INDEX($E$3:$N$34,MATCH(LARGE($I$3:$I$34,BP6),$I$3:$I$34,0),1)","v":"Brazil"},{"$f":"INDEX($E$3:$N$34,MATCH(BQ6,$E$3:$E$34,0),9)","v":8},{"$f":"INDEX($E$3:$N$34,MATCH(BQ6,$E$3:$E$34,0),10)","v":3},{"$f":"INDEX($E$3:$N$34,MATCH(BQ6,$E$3:$E$34,0),7)","v":1},null,1.3,{"$f":"BW5/BW4","v":2.5714285714285716},"Goals/match",{"$f":"BY5/BY4","v":1.25},{"$f":"AVERAGE($H$3:$H$34)-CA6","v":2.34375},3,1,1,{"$f":"AVERAGE($H$3:$H$34)-CC6","v":4.34375},null,4,"Brazil",8,3,1,null,1]
[null,10,"Didier Deschamps ",5,"France","Quarter finals",5,10,8,3,1,2,8,2,"528.4 km",45,9,90,28,33,21,8,13,7,138,43,10,90,65,15,10,50,41,193,65,20,44,6,590,1360,233,2183,138,150,null,null,{"$f":"IF($AW$3<3,M2,IF($AW$3<12,W2,IF($AW$3<22,AI2,AM2)))","v":"Open Play Goals"},{"$f":"INDEX($E$2:$AR$34,MATCH(linkedCellFlag,$E$2:$E$34,0),MATCH($AU7,$E$2:$AR$2,0))","v":15},null,null,null,"France",2,45,0.16666666666666666,{"$error":"#N/A"},5,2,0.66666666666666663,{"$error":"#N/A"},8,10,0.55555555555555558,{"$error":"#N/A"},null,528.4,436.6,5,{"$f":"INDEX($E$3:$N$34,MATCH(LARGE($I$3:$I$34,BP7),$I$3:$I$34,0),1)","v":"France"},{"$f":"INDEX($E$3:$N$34,MATCH(BQ7,$E$3:$E$34,0),9)","v":8},{"$f":"INDEX($E$3:$N$34,MATCH(BQ7,$E$3:$E$34,0),10)","v":2},{"$f":"INDEX($E$3:$N$34,MATCH(BQ7,$E$3:$E$34,0),7)","v":1},null,{"$f":"AVERAGE(P3:P34)/10","v":9.9375},{"$f":"(INDEX($E$2:$AR$34,MATCH(BW$3,$E$2:$E$34,0),MATCH($BX7,$E$2:$AR$2,0)))/10","v":3.8},"Goal/min",{"$f":"(INDEX($E$2:$AR$34,MATCH(BY$3,$E$2:$E$34,0),MATCH($BX7,$E$2:$AR$2,0)))/10","v":7.8},{"$f":"MAX($P$3:$P$34)/10-CA7","v":23},4,3,8,{"$f":"MAX($P$3:$P$34)/10-CC7","v":19},null,5,"France",8,2,1,null,10]
[null,2,"Alejandro Sabella",6,"Argentina","Runner up",7,8,7,3,0,1,7,1,"821.9 km",90,13.1,105,29,42,27,7,32,5,174,33,6,157,118,20,19,98,85,328,118,35,81,19,763,2232,349,3344,174,260,null,null,null,{"$f":"linkedCellFlag&\"\"","v":"Germany"},"Average",null,null,"Argentina",2,90,0.33333333333333331,{"$error":"#N/A"},5,1,0.33333333333333331,{"$error":"#N/A"},8,8,0.44444444444444442,{"$error":"#N/A"},null,821.9,477.71428571428572,null,null,null,null,null,null,{"$f":"AVERAGE(AE3:AE34)","v":12.1875},{"$f":"INDEX($E$2:$AR$34,MATCH(BW$3,$E$2:$E$34,0),MATCH($BX8,$E$2:$AR$2,0))","v":23},"Saves",{"$f":"INDEX($E$2:$AR$34,MATCH(BY$3,$E$2:$E$34,0),MATCH($BX8,$E$2:$AR$2,0))","v":19},{"$f":"MAX($AE$3:$AE$34)-CA8","v":0},23,{"$f":"BV8","v":12.1875},19,{"$f":"MAX($AE$3:$AE$34)-CC8","v":4}]
[null,9,"Ottmar Hitzfeld (Germany)",7,"Switzerland","Round of 16",4,7,7,7,0,0,5,2,"472.9 km",56,9.3000000000000007,65,19,25,14,7,8,5,59,14,5,120,77,21,22,82,60,179,77,28,43,6,456,976,122,1554,59,125,null,null,{"$f":"IF($AW$3<3,I2,IF($AW$3<12,Y2,IF($AW$3<22,AI2,AQ2)))","v":"Total Goals Scored"},{"$f":"IFERROR(INDEX($E$2:$AR$34,MATCH(linkedCellFlag,$E$2:$E$34,0),MATCH(AU9,$E$2:$AR$2,0)),\" \")","v":18},{"$f":"IFERROR(AVERAGE(INDEX($G$2:$AR$34,,MATCH(AU9,$G$2:$AR$2,0))),\" \")","v":5.1875},null,null,"Switzerland",2,56,0.2074074074074074,{"$error":"#N/A"},5,2,0.66666666666666663,{"$error":"#N/A"},8,7,0.3888888888888889,{"$error":"#N/A"},null,472.9,388.5,null,"Best attack","Goals scored","Shots bolcked","Shots saved","Attempts off target",{"$f":"AVERAGE(R3:R34)/10","v":5.2718749999999996},{"$f":"INDEX($E$2:$AR$34,MATCH(BW$3,$E$2:$E$34,0),MATCH($BX9,$E$2:$AR$2,0))/10","v":9.6999999999999993},"Attempts",{"$f":"INDEX($E$2:$AR$34,MATCH(BY$3,$E$2:$E$34,0),MATCH($BX9,$E$2:$AR$2,0))/10","v":4.0999999999999996},{"$f":"MAX($R$3:$R$34)/10-CA9","v":1.0999999999999996},10,5.2718749999999996,4,{"$f":"MAX($R$3:$R$34)/10-CC9","v":7.1}]
[null,24,"Vahid Halilhodžić (Bosnia and Herzegovina)",8,"Algeria","Round of 16",4,7,7,7,1,0,4,3,"462.0 km",56,5.3,37,15,10,7,5,9,4,67,13,7,135,97,23,15,82,69,183,97,22,58,11,332,719,143,1194,67,146,null,null,{"$f":"IF($AW$3<3,M2,IF($AW$3<12,Z2,IF($AW$3<22,AJ2,AR2)))","v":"Open Play Goals"},15,4.40625,null,null,"Algeria",2,56,0.2074074074074074,{"$error":"#N/A"},5,3,1,{"$error":"#N/A"},8,7,0.3888888888888889,{"$error":"#N/A"},null,462,298.5,1,{"$f":"INDEX($E$3:$V$34,MATCH(LARGE($R$3:$R$34,BP10),$R$3:$R$34,0),1)","v":"Brazil"},{"$f":"INDEX($E$3:$V$34,MATCH(LARGE($R$3:$R$34,BP10),$R$3:$R$34,0),18)","v":11},{"$f":"INDEX($E$3:$V$34,MATCH(LARGE($R$3:$R$34,BP10),$R$3:$R$34,0),17)","v":28},{"$f":"INDEX($E$3:$V$34,MATCH(LARGE($R$3:$R$34,BP10),$R$3:$R$34,0),16)","v":39},{"$f":"INDEX($E$3:$V$34,MATCH(LARGE($R$3:$R$34,BP10),$R$3:$R$34,0),15)","v":33},{"$f":"AVERAGE(AP3:AP34)/1000","v":1.58184375},{"$f":"INDEX($E$2:$AR$34,MATCH(BW$3,$E$2:$E$34,0),MATCH($BX10,$E$2:$AR$2,0))/1000","v":4.157},"Total passes complete",{"$f":"INDEX($E$2:$AR$34,MATCH(BY$3,$E$2:$E$34,0),MATCH($BX10,$E$2:$AR$2,0))/1000","v":1.6759999999999999},{"$f":"MAX($AP$3:$AP$34)/100-CA10","v":37.57},4,1.58184375,2,{"$f":"MAX($AP$3:$AP$34)/100-CC10","v":39.57},null,1,"Brazil",11,26,36,31]
[null,12,"Jorge Sampaoli (Argentina)",9,"Chile","Round of 16",4,6,6,4,0,0,6,0,"481.2 km",65,6.3,38,7,19,6,6,15,2,74,17,8,115,83,14,18,74,61,193,83,19,55,5,359,1235,256,1850,74,158,null,null,{"$f":"IF($AW$3<3,N2,IF($AW$3<12,AA2,IF($AW$3<22,AL2,\" \")))","v":"Set Piece Goals"},3,0.90625,null,null,"Chile",2,65,0.24074074074074073,{"$error":"#N/A"},5,0,0,{"$error":"#N/A"},8,6,0.33333333333333331,{"$error":"#N/A"},null,481.2,462.5,2,{"$f":"INDEX($E$3:$V$34,MATCH(LARGE($R$3:$R$34,BP11),$R$3:$R$34,0),1)","v":"Argentina"},{"$f":"INDEX($E$3:$V$34,MATCH(LARGE($R$3:$R$34,BP11),$R$3:$R$34,0),18)","v":7},{"$f":"INDEX($E$3:$V$34,MATCH(LARGE($R$3:$R$34,BP11),$R$3:$R$34,0),17)","v":27},{"$f":"INDEX($E$3:$V$34,MATCH(LARGE($R$3:$R$34,BP11),$R$3:$R$34,0),16)","v":42},{"$f":"INDEX($E$3:$V$34,MATCH(LARGE($R$3:$R$34,BP11),$R$3:$R$34,0),15)","v":29},null,0,null,0,0,0,0,0,0,null,2,"Argentina",6,26,41,26]
[null,5,"Marc Wilmots",10,"Belgium","Quarter finals",5,6,6,3,0,0,6,0,"576.9 km",80,15.2,91,30,33,22,6,24,4,125,26,22,93,61,19,13,59,56,211,61,15,36,2,472,1261,259,1992,125,196,null,null,{"$f":"IF($AW$3<3,K2,IF($AW$3<12,AC2,IF($AW$3<22,AM2,\" \")))","v":"Penalty Goal"},1,0.375,null,null,"Belgium",2,80,0.29629629629629628,{"$error":"#N/A"},5,0,0,{"$error":"#N/A"},8,6,0.33333333333333331,{"$error":"#N/A"},null,576.9,398.4,3,"Germany",{"$f":"INDEX($E$3:$V$34,MATCH(LARGE($R$3:$R$34,BP12),$R$3:$R$34,0),18)","v":18},{"$f":"INDEX($E$3:$V$34,MATCH(LARGE($R$3:$R$34,BP12),$R$3:$R$34,0),17)","v":23},{"$f":"INDEX($E$3:$V$34,MATCH(LARGE($R$3:$R$34,BP12),$R$3:$R$34,0),16)","v":27},{"$f":"INDEX($E$3:$V$34,MATCH(LARGE($R$3:$R$34,BP12),$R$3:$R$34,0),15)","v":29},{"$f":"AVERAGE(LEFT(O3:O34,5))/100","v":5.7690000000000001},{"$f":"LEFT(INDEX($E$2:$AR$34,MATCH(BW$3,$E$2:$E$34,0),MATCH($BX12,$E$2:$AR$2,0)),5)/100","v":8.468},"Distance covered",{"$f":"LEFT(INDEX($E$2:$AR$34,MATCH(BY$3,$E$2:$E$34,0),MATCH($BX12,$E$2:$AR$2,0)),5)/100","v":4.968},{"$f":"MAX($BN$3:$BN$34)/100-CA12","v":0.46799999999999997},8,5.7690000000000001,5,{"$f":"MAX($BN$3:$BN$34)/100-CC12","v":3.468},null,3,"Germany",16,21,26,26]
[null,17,"Niko Kovač",11,"Croatia","Group stage",3,6,5,6,0,1,5,1,"314.4 km",54,8.1999999999999993,41,10,18,8,5,15,2,68,19,5,77,59,13,5,35,35,107,59,16,32,2,237,613,171,1021,68,110,null,null,{"$f":"IF($AW$3<3,P2,IF($AW$3<12,AD2,IF($AW$3<22,AN2,\" \")))","v":"Goal/min"},38,99.375,null,null,"Croatia",2,54,0.2,{"$error":"#N/A"},5,1,0.33333333333333331,{"$error":"#N/A"},8,6,0.33333333333333331,{"$error":"#N/A"},null,314.39999999999998,340.33333333333331,4,"Belgium",{"$f":"INDEX($E$3:$V$34,MATCH(LARGE($R$3:$R$34,BP13),$R$3:$R$34,0),18)","v":6},{"$f":"INDEX($E$3:$V$34,MATCH(LARGE($R$3:$R$34,BP13),$R$3:$R$34,0),17)","v":22},{"$f":"INDEX($E$3:$V$34,MATCH(LARGE($R$3:$R$34,BP13),$R$3:$R$34,0),16)","v":33},{"$f":"INDEX($E$3:$V$34,MATCH(LARGE($R$3:$R$34,BP13),$R$3:$R$34,0),15)","v":30},{"$f":"BV12/AVERAGE(7,3)","v":1.1537999999999999},{"$f":"BW12/BW4","v":1.2097142857142857},"Distance covered per match",{"$f":"BY12/BY4","v":1.242},{"$f":"AVERAGE($BO$3:$BO$34)/100-CA13","v":2.8822715773809522},1,1.1537999999999999,1,{"$f":"AVERAGE($BO$3:$BO$34)/100-CC13","v":2.8822715773809522},null,4,"Belgium",6,21,31,26]
[null,18,"Miguel Herrera",12,"Mexico","Round of 16",4,5,5,3,0,0,4,1,"425.3 km",72,9.1999999999999993,46,11,24,6,5,6,4,60,14,7,90,68,12,10,68,52,158,68,18,49,10,343,888,162,1393,60,118,null,null,null," "," ",null,null,"Mexico",2,72,0.26666666666666666,{"$error":"#N/A"},5,1,0.33333333333333331,{"$error":"#N/A"},8,5,0.27777777777777779,{"$error":"#N/A"},null,425.3,348.25,5,"Netherlands",{"$f":"INDEX($E$3:$V$34,MATCH(LARGE($R$3:$R$34,BP14),$R$3:$R$34,0),18)","v":15},{"$f":"INDEX($E$3:$V$34,MATCH(LARGE($R$3:$R$34,BP14),$R$3:$R$34,0),17)","v":23},{"$f":"INDEX($E$3:$V$34,MATCH(LARGE($R$3:$R$34,BP14),$R$3:$R$34,0),16)","v":26},{"$f":"INDEX($E$3:$V$34,MATCH(LARGE($R$3:$R$34,BP14),$R$3:$R$34,0),15)","v":26},null,null,null,null,null,null,null,null,null,null,5,"Netherlands",11,21,26,26]
[null,16,"Jorge Luis Pinto (Columbia)",13,"Costa Rica","Quarter finals",5,5,5,2,0,0,4,1,"596.6 km",102,7.6,38,20,8,5,5,9,2,62,12,11,144,104,21,19,81,62,222,104,29,62,41,435,958,197,1590,62,169,null,null,{"$f":"CHOOSE($AX$3,H2,S2,AC2,AM2)","v":"Goals For"},null,null,null,null,"Costa Rica",2,102,0.37777777777777777,{"$error":"#N/A"},5,1,0.33333333333333331,{"$error":"#N/A"},8,5,0.27777777777777779,{"$error":"#N/A"},null,596.6,318]
[null,15,"Jürgen Klinsmann (Germany)",14,"United States","Round of 16",4,5,5,6,0,0,4,1,"496.8 km",78,8.1999999999999993,41,10,14,12,5,8,2,64,13,4,128,82,27,19,69,53,146,82,21,61,18,473,1034,169,1676,64,150,null,null,{"$f":"CHOOSE($AX$3,M2,T2,AD2,AN2)","v":"Open Play Goals"},null,5,null,null,"United States",2,78,0.28888888888888886,{"$error":"#N/A"},5,1,0.33333333333333331,{"$error":"#N/A"},8,5,0.27777777777777779,{"$error":"#N/A"},null,496.8,419,null,"Best defence","Tackles","Saves","Blocks"]
[null,11,"Paulo Bento",15,"Portugal","Group stage",3,4,3,7,0,1,4,0,"323.1 km",68,13.3,53,14,25,11,3,6,1,68,13,5,52,35,10,7,21,14,130,35,10,25,7,315,839,143,1297,68,90,null,null,{"$f":"CHOOSE($AX$3,N2,U2,AE2,AO2)","v":"Set Piece Goals"},null,3,null,null,"Portugal",2,68,0.25185185185185183,{"$error":"#N/A"},5,0,0,{"$error":"#N/A"},8,4,0.22222222222222221,{"$error":"#N/A"},null,323.10000000000002,432.33333333333331,1,{"$f":"INDEX($E$3:$AE$34,MATCH(LARGE($AB$3:$AB$34,BP17),$AB$3:$AB$34,0),1)","v":"Brazil"},{"$f":"INDEX($E$3:$AE$34,MATCH(LARGE($AB$3:$AB$34,BP17),$AB$3:$AB$34,0),25)","v":141},{"$f":"INDEX($E$3:$AE$34,MATCH(LARGE($AB$3:$AB$34,BP17),$AB$3:$AB$34,0),26)","v":17},{"$f":"INDEX($E$3:$AE$34,MATCH(LARGE($AB$3:$AB$34,BP17),$AB$3:$AB$34,0),27)","v":10},null,null,null,null,null,null,null,null,null,null,null,1,"Brazil",140,10,10]
[null,25,"Sabri Lamouchi (France)",16,"Ivory Coast","Group stage",3,4,4,5,0,0,4,0,"287.4 km",68,11.8,47,11,17,15,4,18,3,62,12,6,72,60,4,8,51,43,107,60,16,33,5,265,839,111,1215,62,91,null,null,{"$f":"CHOOSE($AX$3,K2,V2,AF2,AQ2)","v":"Penalty Goal"},null,1,null,null,"Ivory Coast",2,68,0.25185185185185183,{"$error":"#N/A"},5,0,0,{"$error":"#N/A"},8,4,0.22222222222222221,{"$error":"#N/A"},null,287.39999999999998,405,2,{"$f":"INDEX($E$3:$AE$34,MATCH(LARGE($AB$3:$AB$34,BP18),$AB$3:$AB$34,0),1)","v":"Germany"},{"$f":"INDEX($E$3:$AE$34,MATCH(LARGE($AB$3:$AB$34,BP18),$AB$3:$AB$34,0),25)","v":110},{"$f":"INDEX($E$3:$AE$34,MATCH(LARGE($AB$3:$AB$34,BP18),$AB$3:$AB$34,0),26)","v":24},{"$f":"INDEX($E$3:$AE$34,MATCH(LARGE($AB$3:$AB$34,BP18),$AB$3:$AB$34,0),27)","v":23},null,null,null,null,null,null,null,null,null,null,null,2,"Germany",110,20,20]
[null,8,"Vicente del Bosque",17,"Spain","Group stage",3,4,4,7,1,0,3,1,"325.5 km",68,8.8000000000000007,35,10,12,9,4,11,5,45,13,12,39,31,1,7,29,25,144,31,12,16,8,594,964,145,1703,45,93,null,null,{"$f":"CHOOSE($AX$3,P2,W2,AG2,AR2)","v":"Goal/min"},null,null,null,null,"Spain",2,68,0.25185185185185183,{"$error":"#N/A"},5,1,0.33333333333333331,{"$error":"#N/A"},8,4,0.22222222222222221,{"$error":"#N/A"},null,325.5,567.66666666666663,3,{"$f":"INDEX($E$3:$AE$34,MATCH(LARGE($AB$3:$AB$34,BP19),$AB$3:$AB$34,0),1)","v":"Germany"},{"$f":"INDEX($E$3:$AE$34,MATCH(LARGE($AB$3:$AB$34,BP19),$AB$3:$AB$34,0),25)","v":110},{"$f":"INDEX($E$3:$AE$34,MATCH(LARGE($AB$3:$AB$34,BP19),$AB$3:$AB$34,0),26)","v":24},{"$f":"INDEX($E$3:$AE$34,MATCH(LARGE($AB$3:$AB$34,BP19),$AB$3:$AB$34,0),27)","v":23},null,null,null,null,null,null,null,null,null,null,null,3,"Germany",110,20,20]
[null,6,"Óscar Tabárez",18,"Uruguay","Round of 16",4,4,4,6,1,0,2,2,"419.5 km",90,12.3,51,13,23,11,4,5,3,76,16,11,103,84,10,9,58,47,162,84,12,46,7,288,789,147,1224,76,143,null,null,{"$f":"CHOOSE($AX$3,Q2,X2,AH2,O2)","v":"Goal/attempt"},null,null,null,null,"Uruguay",2,90,0.33333333333333331,{"$error":"#N/A"},5,2,0.66666666666666663,{"$error":"#N/A"},8,4,0.22222222222222221,{"$error":"#N/A"},null,419.5,306,4,{"$f":"INDEX($E$3:$AE$34,MATCH(LARGE($AB$3:$AB$34,BP20),$AB$3:$AB$34,0),1)","v":"Costa Rica"},{"$f":"INDEX($E$3:$AE$34,MATCH(LARGE($AB$3:$AB$34,BP20),$AB$3:$AB$34,0),25)","v":104},{"$f":"INDEX($E$3:$AE$34,MATCH(LARGE($AB$3:$AB$34,BP20),$AB$3:$AB$34,0),26)","v":21},{"$f":"INDEX($E$3:$AE$34,MATCH(LARGE($AB$3:$AB$34,BP20),$AB$3:$AB$34,0),27)","v":19},null,null,null,null,null,null,null,null,null,null,null,4,"Costa Rica",100,20,10]
[null,19,"Safet Sušić",19,"Bosnia and Herzegovina","Group stage",3,4,4,4,0,0,4,0,"337.8 km",68,11.8,46,15,17,10,4,6,1,72,19,6,80,60,13,7,39,28,135,60,20,38,11,350,926,136,1412,72,77,null,null,null,null,null,null,null,"Bosnia and Herzegovina",2,68,0.25185185185185183,{"$error":"#N/A"},5,0,0,{"$error":"#N/A"},8,4,0.22222222222222221,{"$error":"#N/A"},null,337.8,470.66666666666669,5,{"$f":"INDEX($E$3:$AE$34,MATCH(LARGE($AB$3:$AB$34,BP21),$AB$3:$AB$34,0),1)","v":"Algeria"},{"$f":"INDEX($E$3:$AE$34,MATCH(LARGE($AB$3:$AB$34,BP21),$AB$3:$AB$34,0),25)","v":97},{"$f":"INDEX($E$3:$AE$34,MATCH(LARGE($AB$3:$AB$34,BP21),$AB$3:$AB$34,0),26)","v":23},{"$f":"INDEX($E$3:$AE$34,MATCH(LARGE($AB$3:$AB$34,BP21),$AB$3:$AB$34,0),27)","v":15},null,null,null,null,null,null,null,null,null,null,null,5,"Algeria",90,20,10]
[null,38,"James Kwesi Appiah",20,"Ghana","Group stage",3,4,4,6,0,0,4,0,"332.8 km",68,14.8,58,11,35,8,4,7,2,60,21,14,49,31,12,6,28,24,140,31,8,23,2,264,657,144,1065,60,123,null,null,null,null,null,null,null,"Ghana",2,68,0.25185185185185183,{"$error":"#N/A"},5,0,0,{"$error":"#N/A"},8,4,0.22222222222222221,{"$error":"#N/A"},null,332.8,355]
[null,76,"Ange Postecoglou",21,"Australia","Group stage",3,3,3,9,1,0,2,1,"354.3 km",90,9,26,5,13,5,3,7,2,47,11,3,70,47,12,11,32,28,124,47,9,31,8,231,752,120,1103,47,101,null,null,null,null,null,null,null,"Australia",2,90,0.33333333333333331,{"$error":"#N/A"},5,1,0.33333333333333331,{"$error":"#N/A"},8,3,0.16666666666666666,{"$error":"#N/A"},null,354.3,367.66666666666669,null,"Best passing","Short passes complete","Medium passes complete","Long passes complete"]
[null,56,"Hong Myung-Bo",22,"South Korea","Group stage",3,3,3,6,0,0,3,0,"333.0 km",90,12.3,37,12,13,9,3,5,0,52,15,2,47,24,12,11,38,32,132,42,11,31,5,276,714,160,1150,52,95,null,null,{"$f":"INDEX($E$2:$AR$34,MATCH(linkedCellFlag,$E$2:$E$34,0),MATCH(CHOOSE($AX$3,$I$2,$R$2,$AB$2,$AP$2),$E$2:$AR$2,0))","v":18},null,null,null,null,"South Korea",2,90,0.33333333333333331,{"$error":"#N/A"},5,0,0,{"$error":"#N/A"},8,3,0.16666666666666666,{"$error":"#N/A"},null,333,383.33333333333331,1,{"$f":"INDEX($E$3:$AR$34,MATCH(LARGE($AP$3:$AP$34,BP24),$AP$3:$AP$34,0),1)","v":"Germany"},{"$f":"INDEX($E$3:$AR$34,MATCH(LARGE($AP$3:$AP$34,BP24),$AP$3:$AP$34,0),35)","v":1017},{"$f":"INDEX($E$3:$AR$34,MATCH(LARGE($AP$3:$AP$34,BP24),$AP$3:$AP$34,0),36)","v":2763},{"$f":"INDEX($E$3:$AR$34,MATCH(LARGE($AP$3:$AP$34,BP24),$AP$3:$AP$34,0),37)","v":377},null,null,null,null,null,null,null,null,null,null,null,1,"Germany",933,2733,333]
[null,34,"Stephen Keshi",23,"Nigeria","Round of 16",4,3,3,5,0,0,3,0,"402.1 km",120,16.7,50,16,18,13,3,17,2,87,14,6,114,83,10,21,74,66,168,83,22,52,7,296,926,164,1386,87,119,null,null,{"$f":"INDEX($E$2:$AR$34,1,MATCH(CHOOSE($AX$3,$I$2,$R$2,$AB$2,$AP$2),$E$2:$AR$2,0))","v":"Total Goals Scored"},null,null,null,null,"Nigeria",2,120,0.44444444444444442,{"$error":"#N/A"},5,0,0,{"$error":"#N/A"},8,3,0.16666666666666666,{"$error":"#N/A"},null,402.1,346.5,2,{"$f":"INDEX($E$3:$AR$34,MATCH(LARGE($AP$3:$AP$34,BP25),$AP$3:$AP$34,0),1)","v":"Argentina"},{"$f":"INDEX($E$3:$AR$34,MATCH(LARGE($AP$3:$AP$34,BP25),$AP$3:$AP$34,0),35)","v":763},{"$f":"INDEX($E$3:$AR$34,MATCH(LARGE($AP$3:$AP$34,BP25),$AP$3:$AP$34,0),36)","v":2232},{"$f":"INDEX($E$3:$AR$34,MATCH(LARGE($AP$3:$AP$34,BP25),$AP$3:$AP$34,0),37)","v":349},null,null,null,null,null,null,null,null,null,null,null,2,"Argentina",733,2133,333]
[null,13,"Fernando Santos (Portugal)",24,"Greece","Round of 16",4,3,3,5,1,0,2,1,"436.7 km",130,19.3,57,17,28,9,3,13,2,118,19,17,109,84,14,11,54,42,149,84,26,56,4,310,786,192,1288,118,101,null,null,{"$f":"INDEX($E$2:$AR$34,MATCH(linkedCellFlag,$E$2:$E$34,0),1)","v":"Germany"},{"$f":"AU25&\": \"&AU24","v":"Total Goals Scored: 18"},null,null,null,"Greece",2,130,0.48148148148148145,{"$error":"#N/A"},5,1,0.33333333333333331,{"$error":"#N/A"},8,3,0.16666666666666666,{"$error":"#N/A"},null,436.7,322,3,{"$f":"INDEX($E$3:$AR$34,MATCH(LARGE($AP$3:$AP$34,BP26),$AP$3:$AP$34,0),1)","v":"Netherlands"},569,2006,425,null,null,null,null,null,null,null,null,null,null,null,3,"Netherlands",533,1933,333]
[null,21,"Reinaldo Rueda (Columbia)",25,"Ecuador","Group stage",3,3,3,3,0,0,1,2,"296.3 km",90,9.6999999999999993,29,8,11,7,3,10,3,46,7,6,77,44,18,15,37,34,125,44,13,24,3,185,504,110,799,46,111,null,null,null,null,null,null,null,"Ecuador",2,90,0.33333333333333331,{"$error":"#N/A"},5,2,0.66666666666666663,{"$error":"#N/A"},8,3,0.16666666666666666,{"$error":"#N/A"},null,296.3,266.33333333333331,4,{"$f":"INDEX($E$3:$AR$34,MATCH(LARGE($AP$3:$AP$34,BP27),$AP$3:$AP$34,0),1)","v":"Brazil"},727,1688,316,null,null,null,null,null,null,null,null,null,null,null,4,"Brazil",633,1633,233]
[null,14,"Cesare Prandelli",26,"Italy","Group stage",3,2,2,3,0,0,2,0,"321.3 km",135,15.5,31,15,8,6,2,3,1,36,6,21,57,37,12,8,33,24,113,37,11,23,5,424,1039,117,1580,36,77,null,null,null,null,null,null,null,"Italy",2,135,0.5,{"$error":"#N/A"},5,0,0,{"$error":"#N/A"},8,2,0.1111111111111111,{"$error":"#N/A"},null,321.3,526.66666666666663,5,{"$f":"INDEX($E$3:$AR$34,MATCH(LARGE($AP$3:$AP$34,BP28),$AP$3:$AP$34,0),1)","v":"France"},590,1360,233,null,null,null,null,null,null,null,null,null,null,null,5,"France",533,1333,233]
[null,20,"Roy Hodgson",27,"England","Group stage",3,2,2,4,0,0,2,0,"319.0 km",135,19.5,39,10,20,7,2,10,4,70,15,2,43,33,6,4,39,32,112,33,6,21,13,330,796,130,1256,70,87,null,null,null,null,null,null,null,"England",2,135,0.5,{"$error":"#N/A"},5,0,0,{"$error":"#N/A"},8,2,0.1111111111111111,{"$error":"#N/A"},null,319,418.66666666666669]
[null,23,"Fabio Capello (Italy)",28,"Russia","Group stage",3,2,2,3,0,0,2,0,"347.5 km",135,19.5,40,11,17,10,2,4,2,74,15,3,49,33,6,10,32,29,131,33,6,27,9,309,754,114,1177,74,100,null,null,null,null,null,null,null,"Russia",2,135,0.5,{"$error":"#N/A"},5,0,0,{"$error":"#N/A"},8,2,0.1111111111111111,{"$error":"#N/A"},null,347.5,392.33333333333331]
[null,45,"Alberto Zaccheroni (Italy)",29,"Japan","Group stage",3,2,2,6,0,0,2,0,"317.5 km",135,23,46,13,18,13,2,6,2,58,13,2,61,44,9,8,23,19,106,44,9,24,8,347,811,116,1274,58,90,null,null,null,null,null,null,null,"Japan",2,135,0.5,{"$error":"#N/A"},5,0,0,{"$error":"#N/A"},8,2,0.1111111111111111,{"$error":"#N/A"},null,317.5,424.66666666666669]
[null,40,"Luis Fernando Suárez (Columbia)",30,"Honduras","Group stage",3,1,1,8,0,0,1,0,"288.3 km",270,33,33,8,16,8,1,6,2,44,10,3,90,69,11,10,36,32,122,69,25,41,4,256,668,122,1046,44,81,null,null,null,null,null,null,null,"Honduras",2,270,1,{"$error":"#N/A"},5,0,0,{"$error":"#N/A"},8,1,5.5555555555555552E-2,{"$error":"#N/A"},null,288.3,348.66666666666669]
[null,49,"Carlos Queiroz (Potugal)",31,"Iran","Group stage",3,1,1,4,0,0,1,0,"323.5 km",270,22,22,6,10,5,1,2,2,60,17,10,92,72,12,8,67,56,121,72,13,50,1,155,363,86,604,60,104,null,null,null,null,null,null,null,"Iran",2,270,1,{"$error":"#N/A"},5,0,0,{"$error":"#N/A"},8,1,5.5555555555555552E-2,{"$error":"#N/A"},null,323.5,201.33333333333334]
[null,53,"Volker Finke (Germany)",32,"Cameroon","Group stage",3,1,1,9,0,0,1,0,"292.0 km",270,40,40,2,23,14,1,6,5,49,15,4,66,38,15,13,41,36,108,38,8,25,12,240,544,94,878,49,90,null,null,null,null,null,null,null,"Cameroon",2,270,1,{"$error":"#N/A"},5,0,0,{"$error":"#N/A"},8,1,5.5555555555555552E-2,{"$error":"#N/A"},null,292,292.66666666666669]
[null,null,null,null,null,null,null,null,null,null,null,null,null,null,null,null,null,null,null,null,null,null,null,null,null,null,null,null,null,null,null,null,null,null,null,null,null,null,null,null,null,null,null,null,null,null,null,null,null,null,null,null,3,{"$f":"AVERAGE(BB3:BB34)/MAX($BB$3:$BB$34)","v":0.36805555555555558},null,null,4,{"$f":"AVERAGE(BF3:BF34)/MAX(BF3:$BF$34)","v":0.30208333333333331},null,null,7,{"$f":"AVERAGE(BJ3:BJ34)","v":5.34375},0.296875]
["GER","Germany",null,null,"Germany",27,null,null,null,null,null,null,null,null,null,null,null,null,null,null,null,null,null,null,null,null,null,null,null,null,null,null,null,null,null,null,null,null,null,null,null,null,null,null,null,null,null,null,null,null,null,{"$f":"\"Tournament \" &BB2 &\" average\"","v":"Tournament Goal/min average"},1,{"$f":"BB35","v":0.36805555555555558},null,{"$f":"\"Tournament \" &BF2 &\" average\"","v":"Tournament Set Piece Goals average"},6,{"$f":"BF35","v":0.30208333333333331},null,{"$f":"\"Tournament \" &BJ2 &\" average\"","v":"Tournament Goals For average"},9,{"$f":"BJ35","v":5.34375},0.296875]
["COL","Colombia",null,null,{"$f":"INDEX($A$36:$B$67,MATCH(linkedCellFlag,CountryFlag,0),1)","v":"GER"}]
["NED","Netherlands"]
["BRA","Brazil"]
["FRA","France"]
["ARG","Argentina"]
["SUI","Switzerland"]
["ALG","Algeria"]
["CHI","Chile"]
["BEL","Belgium"]
["CRO","Croatia"]
["MEX","Mexico"]
["CRC","Costa Rica"]
["USA","United States"]
["POR","Portugal"]
["CIV","Ivory Coast"]
["ESP","Spain"]
["URU","Uruguay"]
["BIH","Bosnia and Herzegovina"]
["GHA","Ghana"]
["AUS","Australia"]
["KOR","South Korea"]
["NGA","Nigeria"]
["GRE","Greece"]
["ECU","Ecuador"]
["ITA","Italy"]
["ENG","England"]
["RUS","Russia"]
["JPN","Japan"]
["HON","Honduras"]
["IRN","Iran"]
["CMR","Cameroon"]

{"sheet":"Sheet3","index":3,"n_rows":69,"n_cols":150,"rows_kept":69,"cut":false,"hidden":false,"merged":[[0,12,0,18],[0,6,0,11],[0,19,0,22],[0,23,0,26],[0,27,0,34]]}
[null,null,null,null,null,null,"Shots",null,null,null,null,null,"Goals scored",null,null,null,null,null,null,"Disciplinary",null,null,null,"Attacks",null,null,null,"Passes",null,null,null,null,null,null,null,null,null,null,null,null,null,null,null,null,null,null,null,null,null,null,null,null,null,null,null,null,null,null,null,null,null,null,null,null,null,null,null,null,null,null,null,null,"Round of 16",null,null,null,null,null,null,null,null,null,null,null,null,null,null,null,null,"Quaterfinals",null,null,null,null,null,null,null,null,"Semis",null,null,null,null,"Finals",null,null,"3rd position"]
["Date","Stadium","Score","MOM",null,"Matches","Shots","Shots on target (%)","Attempts on-target from inside the area","Attempts on-target from outside the area","Attempts off-target from inside the area","Attempts off-target from outside the area","Goals for","Goals from inside the area","Goals from outside the area","Own goals For","Open Play Goals","Set Piece Goals","Penalty goal","Yellow Card","Second yellow card and red card","Red Cards","Fouls Committed","Attacks","Solo runs into area","Assists","Offsides","Total Passes","Passes Completed","Passes Completed%","Crosses","Crosses Completed","Crosses Completed%","Corners","Throw-ins",null,{"$f":"INDEX($AN$2:$AN$34,AL2+1,1)","v":"Germany"},25,null,null,"Brazil","Mexico","Croatia","Cameroon","Spain","Chile","Australia","Netherlands","Colombia","Ivory Coast","Greece","Japan","Uruguay","England","Costa Rica","Italy","Switzerland","France","Ecuador","Honduras","Argentina","Iran","Bosnia and Herzegovina","Nigeria","Germany","Ghana","Portugal","United States","Belgium","Russia","Algeria","South Korea",null,"Brazil","Colombia","France","Germany","Netherlands","Costa Rica","Argentina","Belgium","Chile","Uruguay","Nigeria","Algeria","Mexico","Greece","Switzerland","United States",null,"Brazil","Germany","Netherlands","Argentina","Colombia","France","Costa Rica","Belgium",null,"Brazil","Netherlands","Germany","Argentina",null,"Germany","Argentina",null,"Brazil","Netherlands"]
["2014-07-01","Salvador","2-1","Tim Howard",{"$f":"CONCATENATE(MATCH(LEFT(F3,3),$AM$3:$AM$34,0),\"-\",(MATCH(RIGHT(F3,3),$AM$3:$AM$34,0)))","v":"29-28"},"BEL-USA",52,0.67,20,15,11,6,3,3,0,0,3,0,0,2,0,0,38,142,14,2,2,1353,1033,0.77,83,22,0.27,23,83,null,6,{"$f":"IF(MOD($AL$2,4)=0,4,MOD($AL$2,4))","v":1},{"$f":"INDEX(Sheet2!$A$36:$B$67,MATCH(Sheet3!$AN3,CountryFlag,0),1)","v":"BRA"},"Brazil",{"$f":"IFERROR(INDEX($AN$3:$AN$34,IF(AO$2=$AN3,\" \",IF(ISNUMBER(MATCH(AO$2,GrpA,0)),MATCH(AO$2,$AO$2:$BT$2,0),\"\")),1),\"\")","v":""},{"$f":"IFERROR(INDEX($AN$3:$AN$34,IF(AP$2=$AN3,\" \",IF(ISNUMBER(MATCH(AP$2,GrpA,0)),MATCH(AP$2,$AO$2:$BT$2,0),\"\")),1),\"\")","v":"Mexico"},"Croatia","Cameroon","","","","","","",{"$f":"IFERROR(INDEX($AN$3:$AN$34,IF(AY$2=$AN3,\" \",IF(ISNUMBER(MATCH(AY$2,GrpA,0)),MATCH(AY$2,$AO$2:$BT$2,0),\"\")),1),\"\")","v":""},"","","","","","","","","",{"$f":"IFERROR(INDEX($AN$3:$AN$34,IF(BI$2=$AN3,\" \",IF(ISNUMBER(MATCH(BI$2,GrpA,0)),MATCH(BI$2,$AO$2:$BT$2,0),\"\")),1),\"\")","v":""},"","","","","","","","","","","","Brazil",null,null,null,null,null,null,null,null,"Chile",null,null,null,null,null,null,null,"Brazil",null,null,null,null,"Colombia",null,null,null,"Brazil",null,null,"Germany",null,"Germany",null,"Argentina","Brazil",null,"Netherlands"]
["2014-07-01","São Paulo","1-0","Lionel Messi","21-17","ARG-SUI",43,0.67,13,16,6,8,1,1,0,0,1,0,0,5,0,0,47,113,9,1,1,1257,922,0.74,75,15,0.2,18,92,null,null,{"$f":"IFERROR(CHOOSE($AK$3,AK4,AK5,AK6,AK7,RIGHT(AK8,LEN(AK8)-13),RIGHT(AK9,LEN(AK9)-15),RIGHT(AK10,LEN(AK10)-12),IF(LEFT($AK$11,3)=\"Fin\",RIGHT(AK11,LEN(AK11)-8),RIGHT(AK11,LEN(AK11)-11))),\"\")","v":"France"},{"$f":"INDEX(Sheet2!$A$36:$B$67,MATCH(Sheet3!$AN4,CountryFlag,0),1)","v":"MEX"},"Mexico","Brazil","","Croatia","Cameroon","","","","","","","","","","","","","","","","","","","","","","","","","","","","","Colombia",null,null,null,null,null,null,null,null,null,"Uruguay",null,null,null,null,null,null,"Germany",null,null,null,null,null,"France",null,null,"Netherlands",null,null,null,"Argentina","Argentina","Germany",null,"Netherlands","Brazil",null,null,null,null,null,null,null,null,null,null,null,null,null,52,0.67,20,15,11,6,3,3,0,0,3,0,0,2,0,0,38,142,14,2,2,1353,1033,0.77,83,22,0.27,23,83]
["2014-06-30","Porto Alegre","2-1","Raïs M'Bolhi","25-31","GER-ALG",40,0.73,19,10,6,5,3,3,0,0,3,0,0,2,0,0,31,75,7,2,8,1444,1103,0.77,51,11,0.22,14,90,null,{"$f":"CHOOSE($AL$3,INDEX($AN$2:$BT$34,MATCH($AK$2,$AN$2:$AN$34,0),MATCH($AK$2,$AN$2:$BT$2,0)+1),INDEX($AN$2:$BT$34,MATCH($AK$2,$AN$2:$AN$34,0),MATCH($AK$2,$AN$2:$BT$2,0)-1),INDEX($AN$2:$BT$34,MATCH($AK$2,$AN$2:$AN$34,0),MATCH($AK$2,$AN$2:$BT$2,0)-2),INDEX($AN$2:$BT$34,MATCH($AK$2,$AN$2:$AN$34,0),MATCH($AK$2,$AN$2:$BT$2,0)-3))","v":"Ghana"},null,{"$f":"INDEX(Sheet2!$A$36:$B$67,MATCH(Sheet3!$AN5,CountryFlag,0),1)","v":"CRO"},"Croatia","Brazil","Mexico","","Cameroon","","","","","","","","","","","","","","","","","","","","","","","","","","","","","France",null,null,null,null,null,null,null,null,null,null,"Nigeria",null,null,null,null,null,"Netherlands",null,null,null,null,null,null,"Costa Rica",null,"Germany","Brazil",null,null,null,null,null,null,null,null,null,null,null,null,null,null,null,null,null,null,null,null,null,43,0.67,13,16,6,8,1,1,0,0,1,0,0,5,0,0,47,113,9,1,1,1257,922,0.74,75,15,0.2,18,92]
["18 June 2014","Arena da Amazônia, Manaus","0–4","Mario Mandžukić","4-3","CMR-CRO",39,0.54,13,8,10,8,4,4,0,0,3,1,0,1,0,1,20,80,10,2,4,850,634,0.75,43,11,0.26,11,68,null,{"$f":"CHOOSE($AL$3,INDEX($AN$2:$BT$34,MATCH($AK$2,$AN$2:$AN$34,0),MATCH($AK$2,$AN$2:$BT$2,0)+2),INDEX($AN$2:$BT$34,MATCH($AK$2,$AN$2:$AN$34,0),MATCH($AK$2,$AN$2:$BT$2,0)+1),INDEX($AN$2:$BT$34,MATCH($AK$2,$AN$2:$AN$34,0),MATCH($AK$2,$AN$2:$BT$2,0)-1),INDEX($AN$2:$BT$34,MATCH($AK$2,$AN$2:$AN$34,0),MATCH($AK$2,$AN$2:$BT$2,0)-2))","v":"Portugal"},null,{"$f":"INDEX(Sheet2!$A$36:$B$67,MATCH(Sheet3!$AN6,CountryFlag,0),1)","v":"CMR"},"Cameroon","Brazil","Mexico","Croatia","","","","","","","","","","","","","","","","","","","","","","","","","","","","","","Germany",null,null,null,null,null,null,null,null,null,null,null,"Algeria",null,null,null,null,"Argentina",null,null,null,null,null,null,null,"Belgium","Argentina",null,"Netherlands",null,null,null,null,null,null,null,null,null,null,null,null,null,null,null,null,null,null,null,null,40,0.73,19,10,6,5,3,3,0,0,3,0,0,2,0,0,31,75,7,2,8,1444,1103,0.77,51,11,0.22,14,90]
["20 June 2014","Arena Fonte Nova, Salvador","2–5","Karim Benzema","17-18","SUI-FRA",39,0.62,13,11,7,8,7,6,1,0,5,2,0,1,0,0,28,72,6,6,3,1020,804,0.79,25,8,0.32,8,58,null,{"$f":"CHOOSE($AL$3,INDEX($AN$2:$BT$34,MATCH($AK$2,$AN$2:$AN$34,0),MATCH($AK$2,$AN$2:$BT$2,0)+3),INDEX($AN$2:$BT$34,MATCH($AK$2,$AN$2:$AN$34,0),MATCH($AK$2,$AN$2:$BT$2,0)+2),INDEX($AN$2:$BT$34,MATCH($AK$2,$AN$2:$AN$34,0),MATCH($AK$2,$AN$2:$BT$2,0)+1),INDEX($AN$2:$BT$34,MATCH($AK$2,$AN$2:$AN$34,0),MATCH($AK$2,$AN$2:$BT$2,0)-1))","v":"United States"},null,{"$f":"INDEX(Sheet2!$A$36:$B$67,MATCH(Sheet3!$AN7,CountryFlag,0),1)","v":"ESP"},"Spain",{"$f":"IFERROR(INDEX($AN$3:$AN$34,IF(AO$2=$AN7,\" \",IF(ISNUMBER(MATCH(AO$2,GrpB,0)),MATCH(AO$2,$AO$2:$BT$2,0),\"\")),1),\"\")","v":""},"","","","","Chile","Australia","Netherlands","","",{"$f":"IFERROR(INDEX($AN$3:$AN$34,IF(AY$2=$AN7,\" \",IF(ISNUMBER(MATCH(AY$2,GrpB,0)),MATCH(AY$2,$AO$2:$BT$2,0),\"\")),1),\"\")","v":""},"","","","","","","","","",{"$f":"IFERROR(INDEX($AN$3:$AN$34,IF(BI$2=$AN7,\" \",IF(ISNUMBER(MATCH(BI$2,GrpB,0)),MATCH(BI$2,$AO$2:$BT$2,0),\"\")),1),\"\")","v":""},"","","","","","","","","","","","Netherlands",null,null,null,null,null,null,null,null,null,null,null,null,"Mexico",null,null,null,"Colombia","Brazil",null,null,null,null,null,null,null,null,null,null,null,null,null,null,null,null,null,null,null,null,null,null,null,null,null,null,null,null,null,null,39,0.54,13,8,10,8,4,4,0,0,3,1,0,1,0,1,20,80,10,2,4,850,634,0.75,43,11,0.26,11,68]
["21 June 2014","Arena Pantanal, Cuiabá","1–0","Peter Odemwingie","24-23","NGA-BIH",38,0.61,12,11,4,11,1,1,0,0,1,0,0,2,0,0,16,98,10,1,5,1020,776,0.77,38,8,0.22,8,59,null,{"$f":"IF(ISNUMBER(MATCH($AK$2,$BV$2:$CK$2,0)),IF(MATCH($AK$2,$BV$2:$CK$2,0)<9,\"Round of 16: \" &INDEX($BU$2:$CK$18,MATCH($AK$2,$BU$2:$BU$18,0),MATCH($AK$2,$BU$2:$CK$2,0)+8),\"Round of 16: \" &INDEX($BU$2:$CK$18,MATCH($AK$2,$BU$2:$BU$18,0),MATCH($AK$2,$BU$2:$CK$2,0)-8)),\"\")","v":"Round of 16: Algeria"},null,{"$f":"INDEX(Sheet2!$A$36:$B$67,MATCH(Sheet3!$AN8,CountryFlag,0),1)","v":"CHI"},"Chile","","","","","Spain","","Australia","Netherlands","","","","","","","","","","","","","","","","","","","","","","","","","Costa Rica",null,null,null,null,null,null,null,null,null,null,null,null,null,"Greece",null,null,"France",null,"Germany",null,null,null,null,null,null,null,null,null,null,null,null,null,null,null,null,null,null,null,null,null,null,null,null,null,null,null,null,null,39,0.62,13,11,7,8,7,6,1,0,5,2,0,1,0,0,28,72,6,6,3,1020,804,0.79,25,8,0.32,8,58]
["26 June 2014","Estádio Nacional Mané Garrincha, Brasília","2–1","Cristiano Ronaldo","27-26","POR-GHA",37,0.43,9,7,9,12,3,2,0,1,3,0,0,4,0,0,37,90,4,1,4,992,703,0.71,46,13,0.28999999999999998,11,84,null,{"$f":"IF(ISNUMBER(MATCH($AK$2,$CL$2:$CT$2,0)),IF(MATCH($AK$2,$CL$2:$CT$2,0)<5,\"Quarter-finals:\" &INDEX($CL$2:$CT$10,MATCH($AK$2,$CL$2:$CL$10,0),MATCH($AK$2,$CL$2:$CT$2,0)+4),\"Quarter-finals:\" &INDEX($CL$2:$CT$10,MATCH($AK$2,$CL$2:$CL$10,0),MATCH($AK$2,$CL$2:$CT$2,0)-4)),\"\")","v":"Quarter-finals:France"},null,{"$f":"INDEX(Sheet2!$A$36:$B$67,MATCH(Sheet3!$AN9,CountryFlag,0),1)","v":"AUS"},"Australia","","","","","Spain","Chile","","Netherlands","","","","","","","","","","","","","","","","","","","","","","","","","Argentina",null,null,null,null,null,null,null,null,null,null,null,null,null,null,"Switzerland",null,"Costa Rica",null,null,"Netherlands",null,null,null,null,null,null,null,null,null,null,null,null,null,null,null,null,null,null,null,null,null,null,null,null,null,null,null,null,38,0.61,12,11,4,11,1,1,0,0,1,0,0,2,0,0,16,98,10,1,5,1020,776,0.77,38,8,0.22,8,59]
["24 June 2014","Arena Pantanal, Cuiabá","1–4","Jackson Martínez","12-9","JPN-COL",36,0.61,11,11,6,8,5,4,1,0,4,1,1,2,0,0,29,78,9,4,2,918,645,0.71,19,6,0.32,11,58,null,{"$f":"IF(ISNUMBER(MATCH($AK$2,$CU$2:$CY$2,0)),IF(MATCH($AK$2,$CU$2:$CY$2,0)<3,\"Semi finals:\" &INDEX($CU$2:$CY$6,MATCH($AK$2,$CU$2:$CU$6,0),MATCH($AK$2,$CU$2:$CY$2,0)+2),\"Semi finals:\" &INDEX($CU$2:$CY$6,MATCH($AK$2,$CU$2:$CU$6,0),MATCH($AK$2,$CU$2:$CY$2,0)-2)),\"\")","v":"Semi finals:Brazil"},null,{"$f":"INDEX(Sheet2!$A$36:$B$67,MATCH(Sheet3!$AN10,CountryFlag,0),1)","v":"NED"},"Netherlands","","","","","Spain","Chile","Australia","","","","","","","","","","","","","","","","","","","","","","","","","","Belgium",null,null,null,null,null,null,null,null,null,null,null,null,null,null,null,"United States","Belgium",null,null,null,"Argentina",null,null,null,null,null,null,null,null,null,null,null,null,null,null,null,null,null,null,null,null,null,null,null,null,null,null,null,37,0.43,9,7,9,12,3,2,0,1,3,0,0,4,0,0,37,90,4,1,4,992,703,0.71,46,13,0.28999999999999998,11,84]
["2014-06-28","Belo Horizonte","1 (3)-1 (2)","Júlio César","1-6","BRA-CHI",36,0.5,12,6,3,15,2,2,0,0,2,0,0,7,0,0,51,115,11,2,5,1167,817,0.71,62,14,0.23,14,87,null,{"$f":"IF($AK$2=$DA$2,\"Finals: \" &$DB$3,IF($AK$2=$DB$2,\"Finals: \" &$DA$2,IF($AK$2=$DD$2,\"3rd place: \"&DE3,IF($AK$2=$DE$2,\"3rd place: \"&$DD$4,\"\"))))","v":"Finals: Argentina"},null,{"$f":"INDEX(Sheet2!$A$36:$B$67,MATCH(Sheet3!$AN11,CountryFlag,0),1)","v":"COL"},"Colombia",{"$f":"IFERROR(INDEX($AN$3:$AN$34,IF(AO$2=$AN11,\" \",IF(ISNUMBER(MATCH(AO$2,GrpC,0)),MATCH(AO$2,$AO$2:$BT$2,0),\"\")),1),\"\")","v":""},"","","","","","","","","Ivory Coast",{"$f":"IFERROR(INDEX($AN$3:$AN$34,IF(AY$2=$AN11,\" \",IF(ISNUMBER(MATCH(AY$2,GrpC,0)),MATCH(AY$2,$AO$2:$BT$2,0),\"\")),1),\"\")","v":"Greece"},"Japan","","","","","","","","",{"$f":"IFERROR(INDEX($AN$3:$AN$34,IF(BI$2=$AN11,\" \",IF(ISNUMBER(MATCH(BI$2,GrpC,0)),MATCH(BI$2,$AO$2:$BT$2,0),\"\")),1),\"\")","v":""},"","","","","","","","","","","","Chile","Brazil",null,null,null,null,null,null,null,null,null,null,null,null,null,null,null,null,null,null,null,null,null,null,null,null,null,null,null,null,null,null,null,null,null,null,null,null,null,null,null,null,null,null,null,null,null,null,null,36,0.61,11,11,6,8,5,4,1,0,4,1,1,2,0,0,29,78,9,4,2,918,645,0.71,19,6,0.32,11,58]
["22 June 2014","Arena da Amazônia, Manaus","2–2","Tim Howard","28-27","USA-POR",35,0.54,10,9,6,10,4,3,1,0,4,0,0,1,0,0,25,80,6,2,5,1135,941,0.83,37,5,0.14000000000000001,10,54,null,null,null,{"$f":"INDEX(Sheet2!$A$36:$B$67,MATCH(Sheet3!$AN12,CountryFlag,0),1)","v":"CIV"},"Ivory Coast","","","","","","","","","Colombia","","Greece","Japan","","","","","","","","","","","","","","","","","","","","","Uruguay",null,"Colombia",null,null,null,null,null,null,null,null,null,null,null,null,null,null,null,null,null,null,null,null,null,null,null,null,null,null,null,null,null,null,null,null,null,null,null,null,null,null,null,null,null,null,null,null,null,null,36,0.5,12,6,3,15,2,2,0,0,2,0,0,7,0,0,51,115,11,2,5,1167,817,0.71,62,14,0.23,14,87]
["26 June 2014","Arena de São Paulo, São Paulo","0–1","Jan Vertonghen","32-29","KOR-BEL",34,0.68,13,10,8,3,1,1,0,0,1,0,0,2,0,1,27,89,6,0,5,924,655,0.71,27,8,0.3,11,72,null,null,null,{"$f":"INDEX(Sheet2!$A$36:$B$67,MATCH(Sheet3!$AN13,CountryFlag,0),1)","v":"GRE"},"Greece","","","","","","","","","Colombia","Ivory Coast","","Japan","","","","","","","","","","","","","","","","","","","","","Nigeria",null,null,"France",null,null,null,null,null,null,null,null,null,null,null,null,null,null,null,null,null,null,null,null,null,null,null,null,null,null,null,null,null,null,null,null,null,null,null,null,null,null,null,null,null,null,null,null,null,35,0.54,10,9,6,10,4,3,1,0,4,0,0,1,0,0,25,80,6,2,5,1135,941,0.83,37,5,0.14000000000000001,10,54]
["2014-07-08","Belo Horizonte","1-7","Toni Kroos","1-25","BRA-GER",32,0.78,16,9,4,3,8,8,0,0,7,1,0,1,0,0,25,89,8,7,3,1139,916,0.81,32,5,0.16,12,53,null,null,null,{"$f":"INDEX(Sheet2!$A$36:$B$67,MATCH(Sheet3!$AN14,CountryFlag,0),1)","v":"JPN"},"Japan","","","","","","","","","Colombia","Ivory Coast","Greece","","","","","","","","","","","","","","","","","","","","","","Algeria",null,null,null,"Germany",null,null,null,null,null,null,null,null,null,null,null,null,null,null,null,null,null,null,null,null,null,null,null,null,null,null,null,null,null,null,null,null,null,null,null,null,null,null,null,null,null,null,null,null,34,0.68,13,10,8,3,1,1,0,0,1,0,0,2,0,1,27,89,6,0,5,924,655,0.71,27,8,0.3,11,72]
["23 June 2014","Estádio Nacional Mané Garrincha, Brasília","1–4","Neymar","4-1","CMR-BRA",31,0.77,15,9,1,6,5,5,0,0,5,0,0,3,0,0,33,69,5,5,4,919,694,0.76,26,7,0.27,13,59,{"$f":"IF(LEN(SelMatch2)-3=0,4,LEN(SelMatch2)-3)","v":2},null,null,{"$f":"INDEX(Sheet2!$A$36:$B$67,MATCH(Sheet3!$AN15,CountryFlag,0),1)","v":"URU"},"Uruguay",{"$f":"IFERROR(INDEX($AN$3:$AN$34,IF(AO$2=$AN15,\" \",IF(ISNUMBER(MATCH(AO$2,GrpD,0)),MATCH(AO$2,$AO$2:$BT$2,0),\"\")),1),\"\")","v":""},"","","","","","","","","",{"$f":"IFERROR(INDEX($AN$3:$AN$34,IF(AY$2=$AN15,\" \",IF(ISNUMBER(MATCH(AY$2,GrpD,0)),MATCH(AY$2,$AO$2:$BT$2,0),\"\")),1),\"\")","v":""},"","","England","Costa Rica","Italy","","","","",{"$f":"IFERROR(INDEX($AN$3:$AN$34,IF(BI$2=$AN15,\" \",IF(ISNUMBER(MATCH(BI$2,GrpD,0)),MATCH(BI$2,$AO$2:$BT$2,0),\"\")),1),\"\")","v":""},"","","","","","","","","","","","Mexico",null,null,null,null,"Netherlands",null,null,null,null,null,null,null,null,null,null,null,null,null,null,null,null,null,null,null,null,null,null,null,null,null,null,null,null,null,null,null,null,null,null,null,null,null,null,null,null,null,null,null,32,0.78,16,9,4,3,8,8,0,0,7,1,0,1,0,0,25,89,8,7,3,1139,916,0.81,32,5,0.16,12,53]
["21 June 2014","Estádio Castelão, Fortaleza","2–2","Mario Götze","25-26","GER-GHA",31,0.52,8,8,4,11,4,4,0,0,4,0,0,1,0,0,28,78,12,4,6,1166,919,0.79,38,8,0.22,10,58,{"$f":"IF(ISNUMBER(MATCH(SelMatch2,$E$3:$E$65,0)),SelMatch2,CHOOSE(AJ15,RIGHT(SelMatch2,LEN(SelMatch2)),RIGHT(SelMatch2,LEN(SelMatch2)-1),RIGHT(SelMatch2,LEN(SelMatch2)),RIGHT(SelMatch2,LEN(SelMatch2)+1)))","v":"18-25"},null,null,{"$f":"INDEX(Sheet2!$A$36:$B$67,MATCH(Sheet3!$AN16,CountryFlag,0),1)","v":"ENG"},"England","","","","","","","","","","","","","Uruguay","","Costa Rica","Italy","","","","","","","","","","","","","","","","","Greece",null,null,null,null,null,"Costa Rica",null,null,null,null,null,null,null,null,null,null,null,null,null,null,null,null,null,null,null,null,null,null,null,null,null,null,null,null,null,null,null,null,null,null,null,null,null,null,null,null,null,null,31,0.77,15,9,1,6,5,5,0,0,5,0,0,3,0,0,33,69,5,5,4,919,694,0.76,26,7,0.27,13,59]
["25 June 2014","Estádio do Maracanã, Rio de Janeiro","0–0","Alexander Domínguez","19-18","ECU-FRA",31,0.65,9,11,4,7,0,0,0,0,0,0,0,1,0,1,23,85,5,0,2,1006,738,0.74,36,9,0.25,8,66,"Selected match",{"$f":"CONCATENATE(AL2,\"-\",MATCH($AL$4,$AN$3:$AN$34,0))","v":"25-18"},null,{"$f":"INDEX(Sheet2!$A$36:$B$67,MATCH(Sheet3!$AN17,CountryFlag,0),1)","v":"CRC"},"Costa Rica","","","","","","","","","","","","","Uruguay","England","","Italy","","","","","","","","","","","","","","","","","Switzerland",null,null,null,null,null,null,"Argentina",null,null,null,null,null,null,null,null,null,null,null,null,null,null,null,null,null,null,null,null,null,null,null,null,null,null,null,null,null,null,null,null,null,null,null,null,null,null,null,null,null,31,0.52,8,8,4,11,4,4,0,0,4,0,0,1,0,0,28,78,12,4,6,1166,919,0.79,38,8,0.22,10,58]
["14 June 2014","Arena da Amazônia, Manaus","1–2","Mario Balotelli","14-16","ENG-ITA",30,0.43,6,7,3,14,3,2,1,0,3,0,0,1,0,0,20,91,5,3,7,1223,1073,0.88,34,6,0.18,11,48,"Selected teams",{"$f":"CONCATENATE(AK2,\" vs.\",AL4)","v":"Germany vs.France"},null,{"$f":"INDEX(Sheet2!$A$36:$B$67,MATCH(Sheet3!$AN18,CountryFlag,0),1)","v":"ITA"},"Italy","","","","","","","","","","","","","Uruguay","England","Costa Rica","","","","","","","","","","","","","","","","","","United States",null,null,null,null,null,null,null,"Belgium",null,null,null,null,null,null,null,null,null,null,null,null,null,null,null,null,null,null,null,null,null,null,null,null,null,null,null,null,null,null,null,null,null,null,null,null,null,null,null,null,31,0.65,9,11,4,7,0,0,0,0,0,0,0,1,0,1,23,85,5,0,2,1006,738,0.74,36,9,0.25,8,66]
["25 June 2014","Estádio Beira-Rio, Porto Alegre","2–3","Lionel Messi","24-21","NGA-ARG",30,0.67,11,9,5,5,5,4,1,0,4,1,0,2,0,0,23,72,5,2,2,1050,787,0.75,28,8,0.28999999999999998,16,51,{"$f":"AJ16","v":"18-25"},{"$f":"IF(ISNUMBER(MATCH(SelMatch1,$E$3:$E$65,0)),SelMatch1,IF(LEN(SelMatch1)=4,CONCATENATE(RIGHT(SelMatch1,LEN(SelMatch1)-SEARCH(\"-\",SelMatch1)),\"-\",LEFT(SelMatch1,LEN(SelMatch1)-SEARCH(\"-\",SelMatch1)+1)),CONCATENATE(RIGHT(SelMatch1,LEN(SelMatch1)-SEARCH(\"-\",SelMatch1)),\"-\",LEFT(SelMatch1,LEN(SelMatch1)-SEARCH(\"-\",SelMatch1)))))","v":"18-25"},null,{"$f":"INDEX(Sheet2!$A$36:$B$67,MATCH(Sheet3!$AN19,CountryFlag,0),1)","v":"SUI"},"Switzerland",{"$f":"IFERROR(INDEX($AN$3:$AN$34,IF(AO$2=$AN19,\" \",IF(ISNUMBER(MATCH(AO$2,GrpE,0)),MATCH(AO$2,$AO$2:$BT$2,0),\"\")),1),\"\")","v":""},"","","","","","","","","",{"$f":"IFERROR(INDEX($AN$3:$AN$34,IF(AY$2=$AN19,\" \",IF(ISNUMBER(MATCH(AY$2,GrpE,0)),MATCH(AY$2,$AO$2:$BT$2,0),\"\")),1),\"\")","v":""},"","","","","","","France","Ecuador","Honduras",{"$f":"IFERROR(INDEX($AN$3:$AN$34,IF(BI$2=$AN19,\" \",IF(ISNUMBER(MATCH(BI$2,GrpE,0)),MATCH(BI$2,$AO$2:$BT$2,0),\"\")),1),\"\")","v":""},"","","","","","","","","","","",null,null,null,null,null,null,null,null,null,null,null,null,null,null,null,null,null,null,null,null,null,null,null,null,null,null,null,null,null,null,null,null,null,null,null,null,null,null,null,null,null,null,null,null,null,null,null,null,null,30,0.43,6,7,3,14,3,2,1,0,3,0,0,1,0,0,20,91,5,3,7,1223,1073,0.88,34,6,0.18,11,48]
["2014-06-29","Recife","1 (5)-1 (3)","Keylor Navas","15-11","CRC-GRE",30,0.5,9,6,10,5,2,1,1,0,2,0,0,6,1,0,38,88,5,1,11,1091,836,0.77,69,13,0.19,14,76,{"$f":"IF(AK20=\"Hide help\", \"Show help\", \"Hide help\")","v":"Show help"},"Hide help",null,{"$f":"INDEX(Sheet2!$A$36:$B$67,MATCH(Sheet3!$AN20,CountryFlag,0),1)","v":"FRA"},"France","","","","","","","","","","","","","","","","","Switzerland","","Ecuador","Honduras","","","","","","","","","","","","",null,null,null,null,null,null,null,null,null,null,null,null,null,null,null,null,null,null,null,null,null,null,null,null,null,null,null,null,null,null,null,null,null,null,null,null,null,null,null,null,null,null,null,null,null,null,null,null,null,30,0.67,11,9,5,5,5,4,1,0,4,1,0,2,0,0,23,72,5,2,2,1050,787,0.75,28,8,0.28999999999999998,16,51]
["25 June 2014","Arena da Amazônia, Manaus","0–3","Xherdan Shaqiri","20-17","HON-SUI",29,0.66,12,7,3,7,3,2,1,0,3,0,0,1,0,0,35,72,8,3,2,981,778,0.8,35,9,0.26,9,55,null,null,null,{"$f":"INDEX(Sheet2!$A$36:$B$67,MATCH(Sheet3!$AN21,CountryFlag,0),1)","v":"ECU"},"Ecuador","","","","","","","","","","","","","","","","","Switzerland","France","","Honduras","","","","","","","","","","","","",null,null,null,null,null,null,null,null,null,null,null,null,null,null,null,null,null,null,null,null,null,null,null,null,null,null,null,null,null,null,null,null,null,null,null,null,null,null,null,null,null,null,null,null,null,null,null,null,null,30,0.5,9,6,10,5,2,1,1,0,2,0,0,6,1,0,38,88,5,1,11,1091,836,0.77,69,13,0.19,14,76]
["16 June 2014","Arena das Dunas, Natal","1–2","Clint Dempsey","26-28","GHA-USA",29,0.52,8,7,5,9,3,3,0,0,2,1,0,2,0,0,22,87,1,2,6,1017,726,0.72,31,11,0.36,10,86,"-",{"$f":"IF(AJ22=\"+\",\"-\",\"+\")","v":"+"},null,{"$f":"INDEX(Sheet2!$A$36:$B$67,MATCH(Sheet3!$AN22,CountryFlag,0),1)","v":"HON"},"Honduras","","","","","","","","","","","","","","","","","Switzerland","France","Ecuador","","","","","","","","","","","","","",null,null,null,null,null,null,null,null,null,null,null,null,null,null,null,null,null,null,null,null,null,null,null,null,null,null,null,null,null,null,null,null,null,null,null,null,null,null,null,null,null,null,null,null,null,null,null,null,null,29,0.66,12,7,3,7,3,2,1,0,3,0,0,1,0,0,35,72,8,3,2,981,778,0.8,35,9,0.26,9,55]
["15 June 2014","Estádio Nacional Mané Garrincha, Brasília","2–1","Xherdan Shaqiri","17-19","SUI-ECU",28,0.64,7,11,3,7,3,3,0,0,1,2,0,2,0,0,24,77,3,3,5,959,734,0.77,40,8,0.2,13,69,"-",{"$f":"IF(AJ23=\"+\",\"-\",\"+\")","v":"+"},null,{"$f":"INDEX(Sheet2!$A$36:$B$67,MATCH(Sheet3!$AN23,CountryFlag,0),1)","v":"ARG"},"Argentina",{"$f":"IFERROR(INDEX($AN$3:$AN$34,IF(AO$2=$AN23,\" \",IF(ISNUMBER(MATCH(AO$2,GrpF,0)),MATCH(AO$2,$AO$2:$BT$2,0),\"\")),1),\"\")","v":""},"","","","","","","","","",{"$f":"IFERROR(INDEX($AN$3:$AN$34,IF(AY$2=$AN23,\" \",IF(ISNUMBER(MATCH(AY$2,GrpF,0)),MATCH(AY$2,$AO$2:$BT$2,0),\"\")),1),\"\")","v":""},"","","","","","","","","",{"$f":"IFERROR(INDEX($AN$3:$AN$34,IF(BI$2=$AN23,\" \",IF(ISNUMBER(MATCH(BI$2,GrpF,0)),MATCH(BI$2,$AO$2:$BT$2,0),\"\")),1),\"\")","v":""},"Iran","Bosnia and Herzegovina","Nigeria","","","","","","","","",null,null,null,null,null,null,null,null,null,null,null,null,null,null,null,null,null,null,null,null,null,null,null,null,null,null,null,null,null,null,null,null,null,null,null,null,null,null,null,null,null,null,null,null,null,null,null,null,null,29,0.52,8,7,5,9,3,3,0,0,2,1,0,2,0,0,22,87,1,2,6,1017,726,0.72,31,11,0.36,10,86]
["17 June 2014","Estádio Castelão, Fortaleza","0–0","Guillermo Ochoa","1-2","BRA-MEX",27,0.41,6,5,3,13,0,0,0,0,0,0,0,4,0,0,31,71,2,0,5,880,651,0.74,42,9,0.22,7,53,"-",{"$f":"IF(AJ24=\"+\",\"-\",\"+\")","v":"+"},null,{"$f":"INDEX(Sheet2!$A$36:$B$67,MATCH(Sheet3!$AN24,CountryFlag,0),1)","v":"IRN"},"Iran","","","","","","","","","","","","","","","","","","","","","Argentina","","Bosnia and Herzegovina","Nigeria","","","","","","","","",null,null,null,null,null,null,null,null,null,null,null,null,null,null,null,null,null,null,null,null,null,null,null,null,null,null,null,null,null,null,null,null,null,null,null,null,null,null,null,null,null,null,null,null,null,null,null,null,null,28,0.64,7,11,3,7,3,3,0,0,1,2,0,2,0,0,24,77,3,3,5,959,734,0.77,40,8,0.2,13,69]
["16 June 2014","Arena Fonte Nova, Salvador","4–0","Thomas Müller","25-27","GER-POR",27,0.67,11,7,5,4,4,4,0,0,2,2,1,1,0,1,19,78,8,2,3,1079,874,0.82,38,7,0.19,10,54,"-",{"$f":"IF(AJ25=\"+\",\"-\",\"+\")","v":"+"},null,{"$f":"INDEX(Sheet2!$A$36:$B$67,MATCH(Sheet3!$AN25,CountryFlag,0),1)","v":"BIH"},"Bosnia and Herzegovina","","","","","","","","","","","","","","","","","","","","","Argentina","Iran","","Nigeria","","","","","","","","",null,null,null,null,null,null,null,null,null,null,null,null,null,null,null,null,null,null,null,null,null,null,null,null,null,null,null,null,null,null,null,null,null,null,null,null,null,null,null,null,null,null,null,null,null,null,null,null,null,27,0.41,6,5,3,13,0,0,0,0,0,0,0,4,0,0,31,71,2,0,5,880,651,0.74,42,9,0.22,7,53]
["15 June 2014","Estádio do Maracanã, Rio de Janeiro","2–1","Lionel Messi","21-23","ARG-BIH",27,0.59,4,12,4,7,3,1,1,1,3,0,0,2,0,0,24,83,5,2,3,1135,928,"82%",35,9,0.26,8,61,"+",{"$f":"IF(AJ26=\"+\",\"-\",\"+\")","v":"-"},null,{"$f":"INDEX(Sheet2!$A$36:$B$67,MATCH(Sheet3!$AN26,CountryFlag,0),1)","v":"NGA"},"Nigeria","","","","","","","","","","","","","","","","","","","","","Argentina","Iran","Bosnia and Herzegovina","","","","","","","","","",null,null,null,null,null,null,null,null,null,null,null,null,null,null,null,null,null,null,null,null,null,null,null,null,null,null,null,null,null,null,null,null,null,null,null,null,null,null,null,null,null,null,null,null,null,null,null,null,null,27,0.67,11,7,5,4,4,4,0,0,2,2,1,1,0,1,19,78,8,2,3,1079,874,0.82,38,7,0.19,10,54]
["21 June 2014","Estádio Mineirão, Belo Horizonte","1–0","Lionel Messi","21-22","ARG-IRN",27,0.48,8,5,7,7,1,0,1,0,1,0,0,2,0,0,22,107,4,1,1,872,646,0.75,57,10,0.18,16,72,null,null,null,{"$f":"INDEX(Sheet2!$A$36:$B$67,MATCH(Sheet3!$AN27,CountryFlag,0),1)","v":"GER"},"Germany",{"$f":"IFERROR(INDEX($AN$3:$AN$34,IF(AO$2=$AN27,\" \",IF(ISNUMBER(MATCH(AO$2,GrpG,0)),MATCH(AO$2,$AO$2:$BT$2,0),\"\")),1),\"\")","v":""},"","","","","","","","","",{"$f":"IFERROR(INDEX($AN$3:$AN$34,IF(AY$2=$AN27,\" \",IF(ISNUMBER(MATCH(AY$2,GrpG,0)),MATCH(AY$2,$AO$2:$BT$2,0),\"\")),1),\"\")","v":""},"","","","","","","","","",{"$f":"IFERROR(INDEX($AN$3:$AN$34,IF(BI$2=$AN27,\" \",IF(ISNUMBER(MATCH(BI$2,GrpG,0)),MATCH(BI$2,$AO$2:$BT$2,0),\"\")),1),\"\")","v":""},"","","","","Ghana","Portugal","United States","","","","",null,null,null,null,null,null,null,null,null,null,null,null,null,null,null,null,null,null,null,null,null,null,null,null,null,null,null,null,null,null,null,null,null,null,null,null,null,null,null,null,null,null,null,null,null,null,null,null,null,27,0.59,4,12,4,7,3,1,1,1,3,0,0,2,0,0,24,83,5,2,3,1135,928,"82%",35,9,0.26,8,61]
["19 June 2014","Estádio Nacional Mané Garrincha, Brasília","2–1","James Rodríguez","9-10","COL-CIV",26,0.77,8,12,3,3,3,2,1,0,2,1,0,2,0,0,25,80,8,2,5,891,669,0.76,40,7,0.18,10,61,null,null,null,{"$f":"INDEX(Sheet2!$A$36:$B$67,MATCH(Sheet3!$AN28,CountryFlag,0),1)","v":"GHA"},"Ghana","","","","","","","","","","","","","","","","","","","","","","","","","Germany","","Portugal","United States","","","","",null,null,null,null,null,null,null,null,null,null,null,null,null,null,null,null,null,null,null,null,null,null,null,null,null,null,null,null,null,null,null,null,null,null,null,null,null,null,null,null,null,null,null,null,null,null,null,null,null,27,0.48,8,5,7,7,1,0,1,0,1,0,0,2,0,0,22,107,4,1,1,872,646,0.75,57,10,0.18,16,72]
["24 June 2014","Estádio Castelão, Fortaleza","2–1","Georgios Samaras","11-10","GRE-CIV",26,0.54,8,6,2,10,3,3,0,0,2,1,1,3,0,0,36,74,9,2,2,829,647,0.79,40,3,0.08,11,54,null,null,null,{"$f":"INDEX(Sheet2!$A$36:$B$67,MATCH(Sheet3!$AN29,CountryFlag,0),1)","v":"POR"},"Portugal","","","","","","","","","","","","","","","","","","","","","","","","","Germany","Ghana","","United States","","","","",null,null,null,null,null,null,null,null,null,null,null,null,null,null,null,null,null,null,null,null,null,null,null,null,null,null,null,null,null,null,null,null,null,null,null,null,null,null,null,null,null,null,null,null,null,null,null,null,null,26,0.77,8,12,3,3,3,2,1,0,2,1,0,2,0,0,25,80,8,2,5,891,669,0.76,40,7,0.18,10,61]
["14 June 2014","Arena Pernambuco, Recife","2–1","Yaya Touré","10-12","CIV-JPN",26,0.5,8,7,5,6,3,3,0,0,3,0,0,4,0,0,25,67,6,3,4,1024,780,0.77,32,10,0.32,13,58,null,null,null,{"$f":"INDEX(Sheet2!$A$36:$B$67,MATCH(Sheet3!$AN30,CountryFlag,0),1)","v":"USA"},"United States","","","","","","","","","","","","","","","","","","","","","","","","","Germany","Ghana","Portugal","","","","","",null,null,null,null,null,null,null,null,null,null,null,null,null,null,null,null,null,null,null,null,null,null,null,null,null,null,null,null,null,null,null,null,null,null,null,null,null,null,null,null,null,null,null,null,null,null,null,null,null,26,0.54,8,6,2,10,3,3,0,0,2,1,1,3,0,0,36,74,9,2,2,829,647,0.79,40,3,0.08,11,54]
["2014-06-29","Fortaleza","2-1","Guillermo Ochoa","8-2","NED-MEX",26,0.57999999999999996,6,9,4,7,3,1,2,0,2,1,1,3,0,0,20,77,5,1,2,999,772,0.78,38,6,0.16,12,63,null,null,null,{"$f":"INDEX(Sheet2!$A$36:$B$67,MATCH(Sheet3!$AN31,CountryFlag,0),1)","v":"BEL"},"Belgium",{"$f":"IFERROR(INDEX($AN$3:$AN$34,IF(AO$2=$AN31,\" \",IF(ISNUMBER(MATCH(AO$2,GrpH,0)),MATCH(AO$2,$AO$2:$BT$2,0),\"\")),1),\"\")","v":""},"","","","","","","","","",{"$f":"IFERROR(INDEX($AN$3:$AN$34,IF(AY$2=$AN31,\" \",IF(ISNUMBER(MATCH(AY$2,GrpH,0)),MATCH(AY$2,$AO$2:$BT$2,0),\"\")),1),\"\")","v":""},"","","","","","","","","",{"$f":"IFERROR(INDEX($AN$3:$AN$34,IF(BI$2=$AN31,\" \",IF(ISNUMBER(MATCH(BI$2,GrpH,0)),MATCH(BI$2,$AO$2:$BT$2,0),\"\")),1),\"\")","v":""},"","","","","","","","","Russia","Algeria","South Korea",null,null,null,null,null,null,null,null,null,null,null,null,null,null,null,null,null,null,null,null,null,null,null,null,null,null,null,null,null,null,null,null,null,null,null,null,null,null,null,null,null,null,null,null,null,null,null,null,null,26,0.5,8,7,5,6,3,3,0,0,3,0,0,4,0,0,25,67,6,3,4,1024,780,0.77,32,10,0.32,13,58]
["2014-07-05","Salvador","0 (4)-0 (3)","Keylor Navas","8-15","NED-CRC",26,0.69,11,7,5,3,0,0,0,0,0,0,0,6,0,0,28,102,12,0,15,1277,977,0.77,42,10,0.24,12,74,null,null,null,{"$f":"INDEX(Sheet2!$A$36:$B$67,MATCH(Sheet3!$AN32,CountryFlag,0),1)","v":"RUS"},"Russia","","","","","","","","","","","","","","","","","","","","","","","","","","","","","Belgium","","Algeria","South Korea",null,null,null,null,null,null,null,null,null,null,null,null,null,null,null,null,null,null,null,null,null,null,null,null,null,null,null,null,null,null,null,null,null,null,null,null,null,null,null,null,null,null,null,null,null,null,null,null,null,26,0.57999999999999996,6,9,4,7,3,1,2,0,2,1,1,3,0,0,20,77,5,1,2,999,772,0.78,38,6,0.16,12,63]
["2014-06-28","Rio de Janeiro","2-0","James Rodríguez","9-13","COL-URU",26,0.65,6,11,5,4,2,1,1,0,2,0,0,3,0,0,36,59,2,2,2,899,668,0.75,34,8,0.24,8,69,null,null,null,{"$f":"INDEX(Sheet2!$A$36:$B$67,MATCH(Sheet3!$AN33,CountryFlag,0),1)","v":"ALG"},"Algeria","","","","","","","","","","","","","","","","","","","","","","","","","","","","","Belgium","Russia","","South Korea",null,null,null,null,null,null,null,null,null,null,null,null,null,null,null,null,null,null,null,null,null,null,null,null,null,null,null,null,null,null,null,null,null,null,null,null,null,null,null,null,null,null,null,null,null,null,null,null,null,26,0.69,11,7,5,3,0,0,0,0,0,0,0,6,0,0,28,102,12,0,15,1277,977,0.77,42,10,0.24,12,74]
["17 June 2014","Arena Pantanal, Cuiabá","1–1","Son Heung-min","30-32","RUS-KOR",26,0.62,3,13,6,4,2,1,1,0,2,0,0,4,0,0,22,82,1,1,0,1092,834,0.77,40,9,0.23,8,64,null,null,null,{"$f":"INDEX(Sheet2!$A$36:$B$67,MATCH(Sheet3!$AN34,CountryFlag,0),1)","v":"KOR"},"South Korea","","","","","","","","","","","","","","","","","","","","","","","","","","","","","Belgium","Russia","Algeria","",null,null,null,null,null,null,null,null,null,null,null,null,null,null,null,null,null,null,null,null,null,null,null,null,null,null,null,null,null,null,null,null,null,null,null,null,null,null,null,null,null,null,null,null,null,null,null,null,null,26,0.65,6,11,5,4,2,1,1,0,2,0,0,3,0,0,36,59,2,2,2,899,668,0.75,34,8,0.24,8,69]
["19 June 2014","Arena das Dunas, Natal","0–0","Keisuke Honda",{"$f":"CONCATENATE(MATCH(LEFT(F35,3),$AM$3:$AM$34,0),\"-\",(MATCH(RIGHT(F35,3),$AM$3:$AM$34,0)))","v":"12-11"},"JPN-GRE",25,0.64,4,12,6,3,0,0,0,0,0,0,0,3,1,0,41,87,5,0,4,905,714,0.79,53,9,0.17,12,47,null,null,null,null,null,null,null,null,null,null,null,null,null,null,null,null,null,null,null,null,null,null,null,null,null,null,null,null,null,null,null,null,null,null,null,null,null,null,null,null,null,null,null,null,null,null,null,null,null,null,null,null,null,null,null,null,null,null,null,null,null,null,null,null,null,null,null,null,null,null,null,null,null,null,null,null,null,null,null,null,null,null,null,null,null,null,26,0.62,3,13,6,4,2,1,1,0,2,0,0,4,0,0,22,82,1,1,0,1092,834,0.77,40,9,0.23,8,64]
["18 June 2014","Estádio Beira-Rio, Porto Alegre","2–3","Arjen Robben","7-8","AUS-NED",25,0.88,13,9,3,0,5,4,1,0,4,1,1,2,0,0,43,70,9,3,2,996,760,0.77,27,5,0.19,5,60,null,null,null,null,null,null,null,null,null,null,null,null,null,null,null,null,null,null,null,null,null,null,null,null,null,null,null,null,null,null,null,null,null,null,null,null,null,null,null,null,null,null,null,null,null,null,null,null,null,null,null,null,null,null,null,null,null,null,null,null,null,null,null,null,null,null,null,null,null,null,null,null,null,null,null,null,null,null,null,null,null,null,null,null,null,null,25,0.64,4,12,6,3,0,0,0,0,0,0,0,3,1,0,41,87,5,0,4,905,714,0.79,53,9,0.17,12,47]
["13 June 2014","Arena Pantanal, Cuiabá","3–1","Alexis Sánchez","6-7","CHI-AUS",24,0.63,12,3,5,4,4,3,1,0,4,0,0,4,0,0,27,74,9,3,2,1163,939,0.81,33,11,0.34,4,69,null,null,null,null,null,null,null,null,null,null,null,null,null,null,null,null,null,null,null,null,null,null,null,null,null,null,null,null,null,null,null,null,null,null,null,null,null,null,null,null,null,null,null,null,null,null,null,null,null,null,null,null,null,null,null,null,null,null,null,null,null,null,null,null,null,null,null,null,null,null,null,null,null,null,null,null,null,null,null,null,null,null,null,null,null,null,25,0.88,13,9,3,0,5,4,1,0,4,1,1,2,0,0,43,70,9,3,2,996,760,0.77,27,5,0.19,5,60]
["14 June 2014","Estádio Mineirão, Belo Horizonte","3–0","James Rodríguez","9-11","COL-GRE",24,0.63,4,11,6,3,3,3,0,0,3,0,0,3,0,0,33,89,5,3,4,931,705,0.76,31,10,0.33,8,61,null,null,null,null,null,null,null,null,null,null,null,null,null,null,null,null,null,null,null,null,null,null,null,null,null,null,null,null,null,null,null,null,null,null,null,null,null,null,null,null,null,null,null,null,null,null,null,null,null,null,null,null,null,null,null,null,null,null,null,null,null,null,null,null,null,null,null,null,null,null,null,null,null,null,null,null,null,null,null,null,null,null,null,null,null,null,24,0.63,12,3,5,4,4,3,1,0,4,0,0,4,0,0,27,74,9,3,2,1163,939,0.81,33,11,0.34,4,69]
["22 June 2014","Estádio do Maracanã, Rio de Janeiro","1–0","Eden Hazard","29-30","BEL-RUS",24,0.54,5,8,6,5,1,1,0,0,1,0,0,3,0,0,23,87,10,1,7,970,684,0.71,42,8,0.2,13,73,null,null,null,null,null,null,null,null,null,null,null,null,null,null,null,null,null,null,null,null,null,null,null,null,null,null,null,null,null,null,null,null,null,null,null,null,null,null,null,null,null,null,null,null,null,null,null,null,null,null,null,null,null,null,null,null,null,null,null,null,null,null,null,null,null,null,null,null,null,null,null,null,null,null,null,null,null,null,null,null,null,null,null,null,null,null,24,0.63,4,11,6,3,3,3,0,0,3,0,0,3,0,0,33,89,5,3,4,931,705,0.76,31,10,0.33,8,61]
["12 June 2014","Arena de São Paulo, São Paulo","3–1","Neymar","1-3","BRA-CRO",24,0.54,5,8,7,4,4,1,2,1,3,1,1,4,0,0,26,86,6,1,1,976,717,0.74,34,9,0.27,10,80,null,null,null,null,null,null,null,null,null,null,null,null,null,null,null,null,null,null,null,null,null,null,null,null,null,null,null,null,null,null,null,null,null,null,null,null,null,null,null,null,null,null,null,null,null,null,null,null,null,null,null,null,null,null,null,null,null,null,null,null,null,null,null,null,null,null,null,null,null,null,null,null,null,null,null,null,null,null,null,null,null,null,null,null,null,null,24,0.54,5,8,6,5,1,1,0,0,1,0,0,3,0,0,23,87,10,1,7,970,684,0.71,42,8,0.2,13,73]
["20 June 2014","Arena da Baixada, Curitiba","1–2","Enner Valencia","20-19","HON-ECU",24,0.57999999999999996,4,10,4,6,3,3,0,0,2,1,0,5,0,0,32,83,5,3,2,868,602,0.7,36,7,0.2,16,61,null,null,null,null,null,null,null,null,null,null,null,null,null,null,null,null,null,null,null,null,null,null,null,null,null,null,null,null,null,null,null,null,null,null,null,null,null,null,null,null,null,null,null,null,null,null,null,null,null,null,null,null,null,null,null,null,null,null,null,null,null,null,null,null,null,null,null,null,null,null,null,null,null,null,null,null,null,null,null,null,null,null,null,null,null,null,24,0.54,5,8,7,4,4,1,2,1,3,1,1,4,0,0,26,86,6,1,1,976,717,0.74,34,9,0.27,10,80]
["22 June 2014","Estádio Beira-Rio, Porto Alegre","2–4","Islam Slimani","32-31","KOR-ALG",24,0.57999999999999996,11,3,7,3,6,6,0,0,5,1,0,3,0,0,29,79,4,6,2,949,687,0.73,46,15,0.33,12,70,null,null,null,null,null,null,null,null,null,null,null,null,null,null,null,null,null,null,null,null,null,null,null,null,null,null,null,null,null,null,null,null,null,null,null,null,null,null,null,null,null,null,null,null,null,null,null,null,null,null,null,null,null,null,null,null,null,null,null,null,null,null,null,null,null,null,null,null,null,null,null,null,null,null,null,null,null,null,null,null,null,null,null,null,null,null,24,0.57999999999999996,4,10,4,6,3,3,0,0,2,1,0,5,0,0,32,83,5,3,2,868,602,0.7,36,7,0.2,16,61]
["15 June 2014","Estádio Beira-Rio, Porto Alegre","3–0","Karim Benzema","18-20","FRA-HON",24,0.5,8,4,7,5,3,2,0,1,2,1,1,5,1,0,27,64,4,0,3,1064,875,0.83,38,10,0.27,8,50,null,null,null,null,null,null,null,null,null,null,null,null,null,null,null,null,null,null,null,null,null,null,null,null,null,null,null,null,null,null,null,null,null,null,null,null,null,null,null,null,null,null,null,null,null,null,null,null,null,null,null,null,null,null,null,null,null,null,null,null,null,null,null,null,null,null,null,null,null,null,null,null,null,null,null,null,null,null,null,null,null,null,null,null,null,null,24,0.57999999999999996,11,3,7,3,6,6,0,0,5,1,0,3,0,0,29,79,4,6,2,949,687,0.73,46,15,0.33,12,70]
["19 June 2014","Arena de São Paulo, São Paulo","2–1","Luis Suárez","13-14","URU-ENG",23,0.61,7,7,5,4,3,3,0,0,3,0,0,2,0,0,29,77,6,2,4,868,600,0.7,49,10,0.21,13,75,null,null,null,null,null,null,null,null,null,null,null,null,null,null,null,null,null,null,null,null,null,null,null,null,null,null,null,null,null,null,null,null,null,null,null,null,null,null,null,null,null,null,null,null,null,null,null,null,null,null,null,null,null,null,null,null,null,null,null,null,null,null,null,null,null,null,null,null,null,null,null,null,null,null,null,null,null,null,null,null,null,null,null,null,null,null,24,0.5,8,4,7,5,3,2,0,1,2,1,1,5,1,0,27,64,4,0,3,1064,875,0.83,38,10,0.27,8,50]
["24 June 2014","Arena das Dunas, Natal","0–1","Gianluigi Buffon","16-13","ITA-URU",23,0.61,4,10,3,6,1,1,0,0,0,1,0,4,0,1,39,73,2,1,4,1014,775,0.77,42,8,0.2,6,67,null,null,null,null,null,null,null,null,null,null,null,null,null,null,null,null,null,null,null,null,null,null,null,null,null,null,null,null,null,null,null,null,null,null,null,null,null,null,null,null,null,null,null,null,null,null,null,null,null,null,null,null,null,null,null,null,null,null,null,null,null,null,null,null,null,null,null,null,null,null,null,null,null,null,null,null,null,null,null,null,null,null,null,null,null,null,23,0.61,7,7,5,4,3,3,0,0,3,0,0,2,0,0,29,77,6,2,4,868,600,0.7,49,10,0.21,13,75]
["2014-07-04","Fortaleza","2-1","David Luiz","1-9","BRA-COL",23,0.48,5,6,5,7,3,2,1,0,0,3,1,4,0,0,54,70,2,1,3,737,518,0.71,33,9,0.28000000000000003,10,56,null,null,null,null,null,null,null,null,null,null,null,null,null,null,null,null,null,null,null,null,null,null,null,null,null,null,null,null,null,null,null,null,null,null,null,null,null,null,null,null,null,null,null,null,null,null,null,null,null,null,null,null,null,null,null,null,null,null,null,null,null,null,null,null,null,null,null,null,null,null,null,null,null,null,null,null,null,null,null,null,null,null,null,null,null,null,23,0.61,4,10,3,6,1,1,0,0,0,1,0,4,0,1,39,73,2,1,4,1014,775,0.77,42,8,0.2,6,67]
["2014-06-30","Brasília","2-0","Paul Pogba","18-24","FRA-NGA",23,0.65,9,6,3,5,2,1,0,1,2,0,0,1,0,0,27,78,2,0,5,869,655,0.76,64,11,0.18,21,55,null,null,null,null,null,null,null,null,null,null,null,null,null,null,null,null,null,null,null,null,null,null,null,null,null,null,null,null,null,null,null,null,null,null,null,null,null,null,null,null,null,null,null,null,null,null,null,null,null,null,null,null,null,null,null,null,null,null,null,null,null,null,null,null,null,null,null,null,null,null,null,null,null,null,null,null,null,null,null,null,null,null,null,null,null,null,23,0.48,5,6,5,7,3,2,1,0,0,3,1,4,0,0,54,70,2,1,3,737,518,0.71,33,9,0.28000000000000003,10,56]
["23 June 2014","Arena Pernambuco, Recife","1–3","Rafael Márquez","3-2","CRO-MEX",22,0.55000000000000004,10,2,4,6,4,4,0,0,3,1,0,3,0,1,30,74,6,4,2,940,675,0.72,47,15,0.32,16,56,null,null,null,null,null,null,null,null,null,null,null,null,null,null,null,null,null,null,null,null,null,null,null,null,null,null,null,null,null,null,null,null,null,null,null,null,null,null,null,null,null,null,null,null,null,null,null,null,null,null,null,null,null,null,null,null,null,null,null,null,null,null,null,null,null,null,null,null,null,null,null,null,null,null,null,null,null,null,null,null,null,null,null,null,null,null,23,0.65,9,6,3,5,2,1,0,1,2,0,0,1,0,0,27,78,2,0,5,869,655,0.76,64,11,0.18,21,55]
["18 June 2014","Estádio do Maracanã, Rio de Janeiro","0–2","Eduardo Vargas","5-6","ESP-CHI",22,0.59,7,6,8,1,2,2,0,0,2,0,0,3,0,0,29,68,6,1,3,1169,911,0.78,31,10,0.33,8,81,null,null,null,null,null,null,null,null,null,null,null,null,null,null,null,null,null,null,null,null,null,null,null,null,null,null,null,null,null,null,null,null,null,null,null,null,null,null,null,null,null,null,null,null,null,null,null,null,null,null,null,null,null,null,null,null,null,null,null,null,null,null,null,null,null,null,null,null,null,null,null,null,null,null,null,null,null,null,null,null,null,null,null,null,null,null,22,0.55000000000000004,10,2,4,6,4,4,0,0,3,1,0,3,0,1,30,74,6,4,2,940,675,0.72,47,15,0.32,16,56]
["13 June 2014","Arena Fonte Nova, Salvador","1–5","Robin van Persie",{"$f":"CONCATENATE(MATCH(LEFT(F50,3),$AM$3:$AM$34,0),\"-\",(MATCH(RIGHT(F50,3),$AM$3:$AM$34,0)))","v":"5-8"},"ESP-NED",22,0.77,11,6,3,2,6,6,0,0,5,1,1,4,0,0,23,73,8,2,10,1105,884,0.8,16,7,0.44,5,52,null,null,null,null,null,null,null,null,null,null,null,null,null,null,null,null,null,null,null,null,null,null,null,null,null,null,null,null,null,null,null,null,null,null,null,null,null,null,null,null,null,null,null,null,null,null,null,null,null,null,null,null,null,null,null,null,null,null,null,null,null,null,null,null,null,null,null,null,null,null,null,null,null,null,null,null,null,null,null,null,null,null,null,null,null,null,22,0.59,7,6,8,1,2,2,0,0,2,0,0,3,0,0,29,68,6,1,3,1169,911,0.78,31,10,0.33,8,81]
["14 June 2014","Estádio Castelão, Fortaleza","1–3","Joel Campbell","13-15","URU-CRC",21,0.43,6,3,6,6,4,3,1,0,2,2,1,3,0,1,38,57,2,3,8,956,700,0.74,32,6,0.19,11,72,null,null,null,null,null,null,null,null,null,null,null,null,null,null,null,null,null,null,null,null,null,null,null,null,null,null,null,null,null,null,null,null,null,null,null,null,null,null,null,null,null,null,null,null,null,null,null,null,null,null,null,null,null,null,null,null,null,null,null,null,null,null,null,null,null,null,null,null,null,null,null,null,null,null,null,null,null,null,null,null,null,null,null,null,null,null,22,0.77,11,6,3,2,6,6,0,0,5,1,1,4,0,0,23,73,8,2,10,1105,884,0.8,16,7,0.44,5,52]
["2014-07-04","Rio de Janeiro","0-1","Mats Hummels","18-25","FRA-GER",21,0.71,14,1,4,2,1,1,0,0,1,0,0,2,0,0,33,57,9,1,3,1028,754,0.74,38,12,0.32,8,78,null,null,null,null,null,null,null,null,null,null,null,null,null,null,null,null,null,null,null,null,null,null,null,null,null,null,null,null,null,null,null,null,null,null,null,null,null,null,null,null,null,null,null,null,null,null,null,null,null,null,null,null,null,null,null,null,null,null,null,null,null,null,null,null,null,null,null,null,null,null,null,null,null,null,null,null,null,null,null,null,null,null,null,null,null,null,21,0.43,6,3,6,6,4,3,1,0,2,2,1,3,0,1,38,57,2,3,8,956,700,0.74,32,6,0.19,11,72]
["23 June 2014","Arena de São Paulo, São Paulo","2–0","Arjen Robben","8-6","NED-CHI",20,0.45,5,4,7,4,2,2,0,0,2,0,0,2,0,0,39,60,5,2,3,926,676,0.74,38,13,0.35,9,71,null,null,null,null,null,null,null,null,null,null,null,null,null,null,null,null,null,null,null,null,null,null,null,null,null,null,null,null,null,null,null,null,null,null,null,null,null,null,null,null,null,null,null,null,null,null,null,null,null,null,null,null,null,null,null,null,null,null,null,null,null,null,null,null,null,null,null,null,null,null,null,null,null,null,null,null,null,null,null,null,null,null,null,null,null,null,21,0.71,14,1,4,2,1,1,0,0,1,0,0,2,0,0,33,57,9,1,3,1028,754,0.74,38,12,0.32,8,78]
["25 June 2014","Arena Fonte Nova, Salvador","3–1","Edin Džeko","23-22","BIH-IRN",20,0.7,9,5,4,2,4,3,1,0,4,0,0,2,0,0,37,68,4,4,9,1069,819,0.77,53,13,0.25,11,50,null,null,null,null,null,null,null,null,null,null,null,null,null,null,null,null,null,null,null,null,null,null,null,null,null,null,null,null,null,null,null,null,null,null,null,null,null,null,null,null,null,null,null,null,null,null,null,null,null,null,null,null,null,null,null,null,null,null,null,null,null,null,null,null,null,null,null,null,null,null,null,null,null,null,null,null,null,null,null,null,null,null,null,null,null,null,20,0.45,5,4,7,4,2,2,0,0,2,0,0,2,0,0,39,60,5,2,3,926,676,0.74,38,13,0.35,9,71]
["20 June 2014","Arena Pernambuco, Recife","0–1","Bryan Ruiz","16-15","ITA-CRC",20,0.6,2,10,5,3,1,1,0,0,1,0,0,2,0,0,34,64,5,1,14,1018,826,0.82,19,7,0.37,9,42,null,null,null,null,null,null,null,null,null,null,null,null,null,null,null,null,null,null,null,null,null,null,null,null,null,null,null,null,null,null,null,null,null,null,null,null,null,null,null,null,null,null,null,null,null,null,null,null,null,null,null,null,null,null,null,null,null,null,null,null,null,null,null,null,null,null,null,null,null,null,null,null,null,null,null,null,null,null,null,null,null,null,null,null,null,null,20,0.7,9,5,4,2,4,3,1,0,4,0,0,2,0,0,37,68,4,4,9,1069,819,0.77,53,13,0.25,11,50]
["2014-07-05","Brasília","1-0","Gonzalo Higuaín","21-29","ARG-BEL",20,0.55000000000000004,5,6,3,6,1,1,0,0,1,0,0,3,0,0,25,79,7,0,7,919,677,0.74,35,9,0.26,7,82,null,null,null,null,null,null,null,null,null,null,null,null,null,null,null,null,null,null,null,null,null,null,null,null,null,null,null,null,null,null,null,null,null,null,null,null,null,null,null,null,null,null,null,null,null,null,null,null,null,null,null,null,null,null,null,null,null,null,null,null,null,null,null,null,null,null,null,null,null,null,null,null,null,null,null,null,null,null,null,null,null,null,null,null,null,null,20,0.6,2,10,5,3,1,1,0,0,1,0,0,2,0,0,34,64,5,1,14,1018,826,0.82,19,7,0.37,9,42]
["13 June 2014","Arena das Dunas, Natal","1–0","Giovani dos Santos","2-4","MEX-CMR",19,0.47,5,4,4,6,1,1,0,0,1,0,0,2,0,0,23,77,4,0,8,989,768,0.78,37,11,0.3,7,69,null,null,null,null,null,null,null,null,null,null,null,null,null,null,null,null,null,null,null,null,null,null,null,null,null,null,null,null,null,null,null,null,null,null,null,null,null,null,null,null,null,null,null,null,null,null,null,null,null,null,null,null,null,null,null,null,null,null,null,null,null,null,null,null,null,null,null,null,null,null,null,null,null,null,null,null,null,null,null,null,null,null,null,null,null,null,20,0.55000000000000004,5,6,3,6,1,1,0,0,1,0,0,3,0,0,25,79,7,0,7,919,677,0.74,35,9,0.26,7,82]
["17 June 2014","Estádio Mineirão, Belo Horizonte","2–1","Kevin De Bruyne","29-31","BEL-ALG",19,0.57999999999999996,5,6,4,4,3,3,0,0,2,1,1,2,0,0,38,56,3,2,3,1001,753,0.76,33,6,0.19,9,59,null,null,null,null,null,null,null,null,null,null,null,null,null,null,null,null,null,null,null,null,null,null,null,null,null,null,null,null,null,null,null,null,null,null,null,null,null,null,null,null,null,null,null,null,null,null,null,null,null,null,null,null,null,null,null,null,null,null,null,null,null,null,null,null,null,null,null,null,null,null,null,null,null,null,null,null,null,null,null,null,null,null,null,null,null,null,19,0.47,5,4,4,6,1,1,0,0,1,0,0,2,0,0,23,77,4,0,8,989,768,0.78,37,11,0.3,7,69]
["26 June 2014","Arena da Baixada, Curitiba","1–1","Islam Slimani","31-30","ALG-RUS",18,0.72,9,4,2,3,2,2,0,0,1,1,0,5,0,0,29,83,6,2,5,1053,762,0.73,40,8,0.2,7,65,null,null,null,null,null,null,null,null,null,null,null,null,null,null,null,null,null,null,null,null,null,null,null,null,null,null,null,null,null,null,null,null,null,null,null,null,null,null,null,null,null,null,null,null,null,null,null,null,null,null,null,null,null,null,null,null,null,null,null,null,null,null,null,null,null,null,null,null,null,null,null,null,null,null,null,null,null,null,null,null,null,null,null,null,null,null,19,0.57999999999999996,5,6,4,4,3,3,0,0,2,1,1,2,0,0,38,56,3,2,3,1001,753,0.76,33,6,0.19,9,59]
["16 June 2014","Arena da Baixada, Curitiba","0–0","John Obi Mikel","22-24","IRN-NGA",17,0.53,2,7,2,6,0,0,0,0,0,0,0,1,0,0,34,68,6,0,1,911,656,0.73,49,12,0.25,9,65,null,null,null,null,null,null,null,null,null,null,null,null,null,null,null,null,null,null,null,null,null,null,null,null,null,null,null,null,null,null,null,null,null,null,null,null,null,null,null,null,null,null,null,null,null,null,null,null,null,null,null,null,null,null,null,null,null,null,null,null,null,null,null,null,null,null,null,null,null,null,null,null,null,null,null,null,null,null,null,null,null,null,null,null,null,null,18,0.72,9,4,2,3,2,2,0,0,1,1,0,5,0,0,29,83,6,2,5,1053,762,0.73,40,8,0.2,7,65]
["26 June 2014","Arena Pernambuco, Recife","0–1","Thomas Müller","28-25","USA-GER",17,0.59,3,7,5,2,1,0,1,0,1,0,0,3,0,0,24,70,1,0,9,1277,1088,0.86,34,8,0.24,5,55,null,null,null,null,null,null,null,null,null,null,null,null,null,null,null,null,null,null,null,null,null,null,null,null,null,null,null,null,null,null,null,null,null,null,null,null,null,null,null,null,null,null,null,null,null,null,null,null,null,null,null,null,null,null,null,null,null,null,null,null,null,null,null,null,null,null,null,null,null,null,null,null,null,null,null,null,null,null,null,null,null,null,null,null,null,null,17,0.53,2,7,2,6,0,0,0,0,0,0,0,1,0,0,34,68,6,0,1,911,656,0.73,49,12,0.25,9,65]
["23 June 2014","Arena da Baixada, Curitiba","0–3","David Villa","7-5","AUS-ESP",15,0.53,7,1,0,7,3,3,0,0,3,0,0,3,0,0,23,63,5,3,7,1211,961,0.8,25,2,0.08,8,61,null,null,null,null,null,null,null,null,null,null,null,null,null,null,null,null,null,null,null,null,null,null,null,null,null,null,null,null,null,null,null,null,null,null,null,null,null,null,null,null,null,null,null,null,null,null,null,null,null,null,null,null,null,null,null,null,null,null,null,null,null,null,null,null,null,null,null,null,null,null,null,null,null,null,null,null,null,null,null,null,null,null,null,null,null,null,17,0.59,3,7,5,2,1,0,1,0,1,0,0,3,0,0,24,70,1,0,9,1277,1088,0.86,34,8,0.24,5,55]
["2014-07-12","Brasília","0–3","Arjen Robben","1-8","BRA-NED",19,0.53,4,6,6,3,3,3,0,0,2,1,1,5,0,0,36,67,10,1,3,1007,795,0.79,30,5,0.17,5,55]
["2014-07-13",null,"1-0","Mario Gotze","25-21","GER-ARG",20,0.45,5,4,6,5,1,1,0,0,1,0,0,4,0,0,36,94,4,1,5,1501,1152,0.77,41,12,0.3,8,91]
["24 June 2014","Estádio Mineirão, Belo Horizonte","0–0","Keylor Navas","15-14","CRC-ENG",12,0.5,1,5,3,3,0,0,0,0,0,0,0,3,0,0,34,47,2,0,4,1020,737,0.73,24,4,0.17,10,59,null,null,null,null,null,null,null,null,null,null,null,null,null,null,null,null,null,null,null,null,null,null,null,null,null,null,null,null,null,null,null,null,null,null,null,null,null,null,null,null,null,null,null,null,null,null,null,null,null,null,null,null,null,null,null,null,null,null,null,null,null,null,null,null,null,null,null,null,null,null,null,null,null,null,null,null,null,null,null,null,null,null,null,null,null,null,15,0.53,7,1,0,7,3,3,0,0,3,0,0,3,0,0,23,63,5,3,7,1211,961,0.8,25,2,0.08,8,61]
[null,null,null,null,null,null,null,null,null,null,null,null,null,null,null,null,null,null,null,null,null,null,null,null,null,null,null,null,null,null,null,null,null,null,null,null,null,null,null,null,null,null,null,null,null,null,null,null,null,null,null,null,null,null,null,null,null,null,null,null,null,null,null,null,null,null,null,null,null,null,null,null,null,null,null,null,null,null,null,null,null,null,null,null,null,null,null,null,null,null,null,null,null,null,null,null,null,null,null,null,null,null,null,null,null,null,null,null,null,null,null,null,null,null,null,null,null,null,null,null,null,12,0.5,1,5,3,3,0,0,0,0,0,0,0,3,0,0,34,47,2,0,4,1020,737,0.73,24,4,0.17,10,59]
[null,null,null,null,null,null,{"$f":"AVERAGE(G3:G65)","v":26.571428571428573},0.59301587301587289,8.3492063492063497,7.5555555555555554,4.9206349206349209,5.746031746031746,2.7142857142857144,2.2857142857142856,0.34920634920634919,7.9365079365079361E-2,2.2380952380952381,0.47619047619047616,0.19047619047619047,2.8253968253968256,4.7619047619047616E-2,0.1111111111111111,30.206349206349206,78.761904761904759,5.9206349206349209,1.9047619047619047,4.4603174603174605,1032.031746031746,785.79365079365084,0.76338709677419347,39.095238095238095,9.1269841269841265,0.24365079365079362,10.476190476190476,65.015873015873012]
[null,null,null,null,null,null,{"$f":"MAX(G3:G65)","v":52},0.88,20,16,11,15,8,8,2,1,7,3,1,7,1,1,54,142,14,7,15,1501,1152,0.88,83,22,0.44,23,92]
[null,null,null,null,null,null,{"$f":"MIN(G3:G65)","v":12},{"$f":"MIN(H3:H65)","v":0.41},1,1,0,0,0,0,0,0,0,0,0,1,0,0,16,47,1,0,0,737,518,0.7,16,2,0.08,4,42]