{"text_format":"1","workbook":"xlsx","n_sheets":4,"sheets":["Dashboard","data dump1","Sheet2","Sheet3"],"not_rendered":{"charts":8,"images":33,"macros":1,"external_links":0,"defined_names":30,"comments":0,"pivot_tables":0},"unopened":[],"bounds":{"document_bytes":16777216,"sheet_cells":100000,"rows_first":2000,"rows_last":500,"rows_between":2000,"halvings":0,"cell_chars":16384,"cell_head_chars":4096},"cells_cut":0,"cells_raw":0,"read":"whole","date_system":"1900"}

{"sheet":"Dashboard","index":0,"n_rows":121,"n_cols":44,"rows_kept":121,"cut":false,"hidden":false,"merged":[[3,1,3,2]]}
[]
[null,null,null,null,null,null,null,null,null,null,null,null,null,null,null,null,null,null,null,null,null,null,null,null,null,null,null,null,null,null,null,null,null,null,null,null,null,null,null,"Select teams to compare"]
[]
[null,null,null,null,"Scoring","Attack","Defense","Passing",null,"Selecet parameter"]
[null,{"$f":"IFERROR(Flag,\"Select country\")","v":"GER"}]
[]
[]
[null,null,null,null,null,null,null,null,null,"Select parameter:"]
{"$rows_left_out":114}
{"sheet":"data dump1","index":1,"n_rows":63,"n_cols":32,"rows_kept":63,"cut":false,"hidden":true,"merged":[]}
["Column1","Column2","Column3","Column4","Column5","Column6","Column7","Column8"]
["12 June 2014","Brazil","3–1","Croatia","Arena de São Paulo, São Paulo",{"$f":"INDEX(Sheet2!$A$36:$B$67,MATCH(Group_A[[#This Row],[Column2]],CountryFlag,0),1)","v":"BRA"},{"$f":"INDEX(Sheet2!$A$36:$B$67,MATCH(Group_A[[#This Row],[Column4]],CountryFlag,0),1)","v":"CRO"},{"$f":"CONCATENATE(Group_A[[#This Row],[Column6]],\"-\",Group_A[[#This Row],[Column7]])","v":"BRA-CRO"},"BEL-USA","2-1","2014-07-01","Salvador",null,null,null,null,"Brazil","Colombia","France","Germany","Netherlands","Costa Rica","Argentina","Belgium","Chile","Uruguay","Nigeria","Algeria","Mexico","Greece","Switzerland","United States"]
["13 June 2014","Mexico","1–0","Cameroon","Arena das Dunas, Natal",{"$f":"INDEX(Sheet2!$A$36:$B$67,MATCH(Group_A[[#This Row],[Column2]],CountryFlag,0),1)","v":"MEX"},{"$f":"INDEX(Sheet2!$A$36:$B$67,MATCH(Group_A[[#This Row],[Column4]],CountryFlag,0),1)","v":"CMR"},{"$f":"CONCATENATE(Group_A[[#This Row],[Column6]],\"-\",Group_A[[#This Row],[Column7]])","v":"MEX-CMR"},"ARG-SUI","1-0","2014-07-01","São Paulo",null,null,null,"Brazil",null,null,null,null,null,null,null,null,"Chile"]
["17 June 2014","Brazil","0–0","Mexico","Estádio Castelão, Fortaleza",{"$f":"INDEX(Sheet2!$A$36:$B$67,MATCH(Group_A[[#This Row],[Column2]],CountryFlag,0),1)","v":"BRA"},{"$f":"INDEX(Sheet2!$A$36:$B$67,MATCH(Group_A[[#This Row],[Column4]],CountryFlag,0),1)","v":"MEX"},{"$f":"CONCATENATE(Group_A[[#This Row],[Column6]],\"-\",Group_A[[#This Row],[Column7]])","v":"BRA-MEX"},"GER-ALG","2-1","2014-06-30","Porto Alegre",null,null,null,"Colombia",null,null,null,null,null,null,null,null,null,"Uruguay"]
["18 June 2014","Cameroon","0–4","Croatia","Arena da Amazônia, Manaus",{"$f":"INDEX(Sheet2!$A$36:$B$67,MATCH(Group_A[[#This Row],[Column2]],CountryFlag,0),1)","v":"CMR"},{"$f":"INDEX(Sheet2!$A$36:$B$67,MATCH(Group_A[[#This Row],[Column4]],CountryFlag,0),1)","v":"CRO"},{"$f":"CONCATENATE(Group_A[[#This Row],[Column6]],\"-\",Group_A[[#This Row],[Column7]])","v":"CMR-CRO"},"CMR-CRO","0–4","18 June 2014","Arena da Amazônia, Manaus",null,null,null,"France",null,null,null,null,null,null,null,null,null,null,"Nigeria"]
["23 June 2014","Cameroon","1–4","Brazil","Estádio Nacional Mané Garrincha, Brasília",{"$f":"INDEX(Sheet2!$A$36:$B$67,MATCH(Group_A[[#This Row],[Column2]],CountryFlag,0),1)","v":"CMR"},{"$f":"INDEX(Sheet2!$A$36:$B$67,MATCH(Group_A[[#This Row],[Column4]],CountryFlag,0),1)","v":"BRA"},{"$f":"CONCATENATE(Group_A[[#This Row],[Column6]],\"-\",Group_A[[#This Row],[Column7]])","v":"CMR-BRA"},"SUI-FRA","2–5","20 June 2014","Arena Fonte Nova, Salvador",null,null,null,"Germany",null,null,null,null,null,null,null,null,null,null,null,"Algeria"]
["23 June 2014","Croatia","1–3","Mexico","Arena Pernambuco, Recife",{"$f":"INDEX(Sheet2!$A$36:$B$67,MATCH(Group_A[[#This Row],[Column2]],CountryFlag,0),1)","v":"CRO"},{"$f":"INDEX(Sheet2!$A$36:$B$67,MATCH(Group_A[[#This Row],[Column4]],CountryFlag,0),1)","v":"MEX"},{"$f":"CONCATENATE(Group_A[[#This Row],[Column6]],\"-\",Group_A[[#This Row],[Column7]])","v":"CRO-MEX"},"NGA-BIH","1–0","21 June 2014","Arena Pantanal, Cuiabá",null,null,null,"Netherlands",null,null,null,null,null,null,null,null,null,null,null,null,"Mexico"]
["13 June 2014","Spain","1–5","Netherlands","Arena Fonte Nova, Salvador",{"$f":"INDEX(Sheet2!$A$36:$B$67,MATCH(Group_A[[#This Row],[Column2]],CountryFlag,0),1)","v":"ESP"},{"$f":"INDEX(Sheet2!$A$36:$B$67,MATCH(Group_A[[#This Row],[Column4]],CountryFlag,0),1)","v":"NED"},{"$f":"CONCATENATE(Group_A[[#This Row],[Column6]],\"-\",Group_A[[#This Row],[Column7]])","v":"ESP-NED"},"POR-GHA","2–1","26 June 2014","Estádio Nacional Mané Garrincha, Brasília",null,null,null,"Costa Rica",null,null,null,null,null,null,null,null,null,null,null,null,null,"Greece"]
{"$rows_left_out":56}
{"sheet":"Sheet2","index":2,"n_rows":67,"n_cols":90,"rows_kept":67,"cut":false,"hidden":false,"merged":[[0,38,0,43],[0,15,0,16],[0,18,0,26],[0,28,0,37]]}
[null,null,null,null,null,null,null,null,null,null,null,null,null,null,null,"Scoring",null,null,"Attack",null,null,null,null,null,null,null,null,null,"Defense",null,null,null,null,null,null,null,null,null,"Passing"]
[null,"Current ranking","Coach",null,null,"Stage","Matches Played","Goals For","Total Goals Scored","Goals Conceded","Penalty Goal","Own Goals For","Open Play Goals","Set Piece Goals","Distance covered","Goal/min","Goal/attempt","Attempts","Shots saved","Attempt off target","Shots blocked","Goals scored","Dribble into penalty area","Deliveries in penalty area","Crosses total","Crosses Completed","Offsides","Total attempts","Tackles","Blocks","Saves","Attempted Clearances","Completed Clearances","Recovered Balls","Tackles","Tackles won","Tackles lost","Offsides given","Short Passes Complete","Medium Passes Complete","Long Passes Complete","Total passes complete","Crosses","Throw ins",null,null,null,"Short Passes Complete",null,null,null,null,null,{"$f":"CHOOSE($AW$16,AU15,AU16,AU17,AU18,AU19,AU20)","v":"Goal/min"},null,{"$f":"$AV$8 & \" \" &BB2","v":"Germany Goal/min"},null,{"$f":"CHOOSE($AW$17,AU15,AU16,AU17,AU18,AU19,AU20)","v":"Set Piece Goals"},null,{"$f":"$AV$8 & \" \" &BF2","v":"Germany Set Piece Goals"},null,{"$f":"CHOOSE($AW$18,AU15,AU16,AU17,AU18,AU19,AU20)","v":"Goals For"},null,{"$f":"$AV$8 & \" \" &BJ2","v":"Germany Goals For"},null,null,null,null,"Top goals","Open play","Set piece","Penalty",null,null,25,null,28,null,null,null,null,null,null,null,"Top goals","Open play","Set piece","Penalty"]
[null,1,"Joachim Löw",1,"Germany","Winners",7,18,18,4,1,0,15,3,"846.8 km",38,5.4,{"$f":"SUM(S3:V3)","v":97},29,27,23,18,28,2,148,40,17,{"$f":"SUM(AC3:AE3)","v":157},110,24,23,104,88,327,110,31,79,20,1017,2763,377,{"$f":"SUM(AM3:AO3)","v":4157},148,221,null,null,"Scoring",{"$f":"parameterSel","v":"Scoring"},{"$f":"MATCH($AV$3,$P$1:$AR$1,0)","v":1},{"$f":"MATCH(AV3,lstParameters,0)","v":1},null,"Germany",2,{"$f":"INDEX($E$2:$AR$34,MATCH($AZ3,$E$2:$E$34,0),MATCH(CHOOSE($AW$16,$AU$15,$AU$16,$AU$17,$AU$18,$AU$19,$AU$20),$E$2:$AR$2,0))","v":38},{"$f":"BB3/MAX($BB$3:$BB$34)","v":0.14074074074074075},{"$f":"IF(linkedCellFlag=$AZ3,$BC3,NA())/MAX($BC$3:$BC$34)","v":0.14074074074074075},5,{"$f":"INDEX($E$2:$AR$34,MATCH($AZ3,$E$2:$E$34,0),MATCH(CHOOSE($AW$17,$AU$15,$AU$16,$AU$17,$AU$18,$AU$19,$AU$20),$E$2:$AR$2,0))","v":3},{"$f":"IF($BF$2=\"Goal/min\",1-BF3/MAX($BF$3:$BF$34),BF3/MAX($BF$3:$BF$34))","v":1},{"$f":"IF(linkedCellFlag=$AZ3,$BG3,NA())/MAX($BG$3:$BG$34)","v":1},8,{"$f":"INDEX($E$2:$AR$34,MATCH($AZ3,$E$2:$E$34,0),MATCH(CHOOSE($AW$18,$AU$15,$AU$16,$AU$17,$AU$18,$AU$19,$AU$20),$E$2:$AR$2,0))","v":18},{"$f":"BJ3/MAX($BJ$3:$BJ$34)","v":1},{"$f":"IF(linkedCellFlag=$AZ3,$BK3,NA())/MAX($BK$3:$BK$34)","v":1},null,846.8,{"$f":"AP3/G3","v":593.85714285714289},1,{"$f":"INDEX($E$3:$N$34,MATCH(LARGE($I$3:$I$34,BP3),$I$3:$I$34,0),1)","v":"Germany"},{"$f":"INDEX($E$3:$N$34,MATCH(BQ3,$E$3:$E$34,0),9)","v":15},{"$f":"INDEX($E$3:$N$34,MATCH(BQ3,$E$3:$E$34,0),10)","v":3},{"$f":"INDEX($E$3:$N$34,MATCH(BQ3,$E$3:$E$34,0),7)","v":1},null,null,{"$f":"INDEX(Sheet3!$AN$3:$AN$34,BW2,1)","v":"Germany"},null,{"$f":"INDEX(Sheet3!$AN$3:$AN$34,BY2,1)","v":"United States"},null,{"$f":"BW3","v":"Germany"},"Tournament average",{"$f":"BY3","v":"United States"},null,null,1,"Germany",15,3,1]
[null,4,"José Pékerman (Argentina)",2,"Colombia",{"$f":"CHOOSE($G4,\"\",\"\",\"Group stage\",\"Round of 16\",\"Quarter finals\",\"Semi finals\", \"Finals\")","v":"Quarter finals"},5,12,12,4,2,0,9,3,"516.6 km",38,4.8,{"$f":"SUM(S4:V4)","v":57},12,19,16,10,11,3,65,19,10,{"$f":"SUM(AC4:AE4)","v":127},85,22,20,56,47,180,85,22,63,6,407,902,168,{"$f":"SUM(AM4:AO4)","v":1477},65,159,null,null,null,null,null,{"$f":"\"Team: \"&linkedCellFlag &\" \" &CHAR(10)\n&\"Stage: \" &INDEX($E$3:$F$34,MATCH(linkedCellFlag,$E$3:$E$34,0),2) &CHAR(10) &\"Current Rank: \" &INDEX($B$3:$E$34,MATCH(linkedCellFlag,$E$3:$E$34,0),1) &CHAR(10) &\"Coach: \" &INDEX($B$3:$E$34,MATCH(linkedCellFlag,$E$3:$E$34,0),2) & CHAR(10) &\"Distance covered by \"&linkedCellFlag&\" in \" &CHAR(10) &INDEX(Sheet2!$E$3:$G$34,MATCH(linkedCellFlag,Sheet2!$E$3:$E$34,0),3)&\" mathces is \" &INDEX(Sheet2!$E$3:$O$34,MATCH(linkedCellFlag,Sheet2!$E$3:$E$34,0),COLUMNS(Sheet2!$E$3:$O$3))","v":"Team: Germany \nStage: Winners\nCurrent Rank: 1\nCoach: Joachim Löw\nDistance covered by Germany in \n7 mathces is 846.8 km"},null,"Colombia",2,{"$f":"INDEX($E$2:$AR$34,MATCH($AZ4,$E$2:$E$34,0),MATCH(CHOOSE($AW$16,$AU$15,$AU$16,$AU$17,$AU$18,$AU$19,$AU$20),$E$2:$AR$2,0))","v":38},{"$f":"BB4/MAX($BB$3:$BB$34)","v":0.14074074074074075},{"$error":"#N/A"},5,3,{"$f":"IF($BF$2=\"Goal/min\",1-BF4/MAX($BF$3:$BF$34),BF4/MAX($BF$3:$BF$34))","v":1},{"$error":"#N/A"},8,12,{"$f":"BJ4/MAX($BJ$3:$BJ$34)","v":0.66666666666666663},{"$error":"#N/A"},null,516.6,{"$f":"AP4/G4","v":295.39999999999998},2,{"$f":"INDEX($E$3:$N$34,MATCH(LARGE($I$3:$I$34,BP4),$I$3:$I$34,0),1)","v":"Netherlands"},{"$f":"INDEX($E$3:$N$34,MATCH(BQ4,$E$3:$E$34,0),9)","v":13},{"$f":"INDEX($E$3:$N$34,MATCH(BQ4,$E$3:$E$34,0),10)","v":1},{"$f":"INDEX($E$3:$N$34,MATCH(BQ4,$E$3:$E$34,0),7)","v":2},null,null,{"$f":"INDEX($E$2:$AR$34,MATCH(BW$3,$E$2:$E$34,0),MATCH($BX4,$E$2:$AR$2,0))","v":7},"Matches played",{"$f":"INDEX($E$2:$AR$34,MATCH(BY$3,$E$2:$E$34,0),MATCH($BX4,$E$2:$AR$2,0))","v":4},{"$f":"7-CA4","v":0},{"$f":"BW4","v":7},0,4,{"$f":"7-CA4","v":0},null,2,"Netherlands",13,1,2]
[null,3,"Louis van Gaal",3,"Netherlands","3rd place",7,15,15,4,2,0,13,1,"826.3 km",46,6,90,26,26,23,15,31,7,121,28,27,123,92,18,13,93,81,308,92,30,57,16,569,2006,425,3000,121,228,null,null,{"$f":"IF($AW$3<3,K2,IF($AW$3<12,U2,IF($AW$3<22,AG2,AO2)))","v":"Penalty Goal"},{"$f":"INDEX($E$2:$AR$34,MATCH(linkedCellFlag,$E$2:$E$34,0),MATCH($AU5,$E$2:$AR$2,0))","v":1},null,null,null,"Netherlands",2,46,0.17037037037037037,{"$error":"#N/A"},5,1,0.33333333333333331,{"$error":"#N/A"},8,15,0.83333333333333337,{"$error":"#N/A"},null,826.3,428.57142857142856,3,{"$f":"INDEX($E$3:$N$34,MATCH(LARGE($I$3:$I$34,BP5),$I$3:$I$34,0),1)","v":"Colombia"},{"$f":"INDEX($E$3:$N$34,MATCH(BQ5,$E$3:$E$34,0),9)","v":9},{"$f":"INDEX($E$3:$N$34,MATCH(BQ5,$E$3:$E$34,0),10)","v":3},{"$f":"INDEX($E$3:$N$34,MATCH(BQ5,$E$3:$E$34,0),7)","v":2},null,5.2,{"$f":"INDEX($E$2:$AR$34,MATCH(BW$3,$E$2:$E$34,0),MATCH($BX5,$E$2:$AR$2,0))","v":18},"Total goals scored",{"$f":"INDEX($E$2:$AR$34,MATCH(BY$3,$E$2:$E$34,0),MATCH($BX5,$E$2:$AR$2,0))","v":5},{"$f":"MAX($H$3:$H$34)-CA5","v":0},18,3,5,{"$f":"MAX($H$3:$H$34)-CC5","v":13},null,3,"Colombia",9,3,2,null,5]
[null,7,"Luiz Felipe Scolari",4,"Brazil","4h place",7,11,11,11,1,0,8,3,"747.6 km",60,10.1,111,33,39,28,11,26,7,155,36,15,168,141,17,10,93,72,300,141,48,93,9,727,1688,316,2731,155,203,null,null,{"$f":"IF($AW$3<3,L2,IF($AW$3<12,V2,IF($AW$3<22,AH2,AN2)))","v":"Own Goals For"},{"$f":"INDEX($E$2:$AR$34,MATCH(linkedCellFlag,$E$2:$E$34,0),MATCH($AU6,$E$2:$AR$2,0))","v":0},null,null,null,"Brazil",2,60,0.22222222222222221,{"$error":"#N/A"},5,3,1,{"$error":"#N/A"},8,11,0.61111111111111116,{"$error":"#N/A"},null,747.6,390.14285714285717,4,{"$f":"INDEX($E$3:$N$34,MATCH(LARGE($I$3:$I$34,BP6),$I$3:$I$34,0),1)","v":"Brazil"},{"$f":"INDEX($E$3:$N$34,MATCH(BQ6,$E$3:$E$34,0),9)","v":8},{"$f":"INDEX($E$3:$N$34,MATCH(BQ6,$E$3:$E$34,0),10)","v":3},{"$f":"INDEX($E$3:$N$34,MATCH(BQ6,$E$3:$E$34,0),7)","v":1},null,1.3,{"$f":"BW5/BW4","v":2.5714285714285716},"Goals/match",{"$f":"BY5/BY4","v":1.25},{"$f":"AVERAGE($H$3:$H$34)-CA6","v":2.34375},3,1,1,{"$f":"AVERAGE($H$3:$H$34)-CC6","v":4.34375},null,4,"Brazil",8,3,1,null,1]
[null,10,"Didier Deschamps ",5,"France","Quarter finals",5,10,8,3,1,2,8,2,"528.4 km",45,9,90,28,33,21,8,13,7,138,43,10,90,65,15,10,50,41,193,65,20,44,6,590,1360,233,2183,138,150,null,null,{"$f":"IF($AW$3<3,M2,IF($AW$3<12,W2,IF($AW$3<22,AI2,AM2)))","v":"Open Play Goals"},{"$f":"INDEX($E$2:$AR$34,MATCH(linkedCellFlag,$E$2:$E$34,0),MATCH($AU7,$E$2:$AR$2,0))","v":15},null,null,null,"France",2,45,0.16666666666666666,{"$error":"#N/A"},5,2,0.66666666666666663,{"$error":"#N/A"},8,10,0.55555555555555558,{"$error":"#N/A"},null,528.4,436.6,5,{"$f":"INDEX($E$3:$N$34,MATCH(LARGE($I$3:$I$34,BP7),$I$3:$I$34,0),1)","v":"France"},{"$f":"INDEX($E$3:$N$34,MATCH(BQ7,$E$3:$E$34,0),9)","v":8},{"$f":"INDEX($E$3:$N$34,MATCH(BQ7,$E$3:$E$34,0),10)","v":2},{"$f":"INDEX($E$3:$N$34,MATCH(BQ7,$E$3:$E$34,0),7)","v":1},null,{"$f":"AVERAGE(P3:P34)/10","v":9.9375},{"$f":"(INDEX($E$2:$AR$34,MATCH(BW$3,$E$2:$E$34,0),MATCH($BX7,$E$2:$AR$2,0)))/10","v":3.8},"Goal/min",{"$f":"(INDEX($E$2:$AR$34,MATCH(BY$3,$E$2:$E$34,0),MATCH($BX7,$E$2:$AR$2,0)))/10","v":7.8},{"$f":"MAX($P$3:$P$34)/10-CA7","v":23},4,3,8,{"$f":"MAX($P$3:$P$34)/10-CC7","v":19},null,5,"France",8,2,1,null,10]
[null,2,"Alejandro Sabella",6,"Argentina","Runner up",7,8,7,3,0,1,7,1,"821.9 km",90,13.1,105,29,42,27,7,32,5,174,33,6,157,118,20,19,98,85,328,118,35,81,19,763,2232,349,3344,174,260,null,null,null,{"$f":"linkedCellFlag&\"\"","v":"Germany"},"Average",null,null,"Argentina",2,90,0.33333333333333331,{"$error":"#N/A"},5,1,0.33333333333333331,{"$error":"#N/A"},8,8,0.44444444444444442,{"$error":"#N/A"},null,821.9,477.71428571428572,null,null,null,null,null,null,{"$f":"AVERAGE(AE3:AE34)","v":12.1875},{"$f":"INDEX($E$2:$AR$34,MATCH(BW$3,$E$2:$E$34,0),MATCH($BX8,$E$2:$AR$2,0))","v":23},"Saves",{"$f":"INDEX($E$2:$AR$34,MATCH(BY$3,$E$2:$E$34,0),MATCH($BX8,$E$2:$AR$2,0))","v":19},{"$f":"MAX($AE$3:$AE$34)-CA8","v":0},23,{"$f":"BV8","v":12.1875},19,{"$f":"MAX($AE$3:$AE$34)-CC8","v":4}]
{"$rows_left_out":60}
{"sheet":"Sheet3","index":3,"n_rows":69,"n_cols":150,"rows_kept":69,"cut":false,"hidden":false,"merged":[[0,12,0,18],[0,6,0,11],[0,19,0,22],[0,23,0,26],[0,27,0,34]]}
[null,null,null,null,null,null,"Shots",null,null,null,null,null,"Goals scored",null,null,null,null,null,null,"Disciplinary",null,null,null,"Attacks",null,null,null,"Passes",null,null,null,null,null,null,null,null,null,null,null,null,null,null,null,null,null,null,null,null,null,null,null,null,null,null,null,null,null,null,null,null,null,null,null,null,null,null,null,null,null,null,null,null,"Round of 16",null,null,null,null,null,null,null,null,null,null,null,null,null,null,null,null,"Quaterfinals",null,null,null,null,null,null,null,null,"Semis",null,null,null,null,"Finals",null,null,"3rd position"]
["Date","Stadium","Score","MOM",null,"Matches","Shots","Shots on target (%)","Attempts on-target from inside the area","Attempts on-target from outside the area","Attempts off-target from inside the area","Attempts off-target from outside the area","Goals for","Goals from inside the area","Goals from outside the area","Own goals For","Open Play Goals","Set Piece Goals","Penalty goal","Yellow Card","Second yellow card and red card","Red Cards","Fouls Committed","Attacks","Solo runs into area","Assists","Offsides","Total Passes","Passes Completed","Passes Completed%","Crosses","Crosses Completed","Crosses Completed%","Corners","Throw-ins",null,{"$f":"INDEX($AN$2:$AN$34,AL2+1,1)","v":"Germany"},25,null,null,"Brazil","Mexico","Croatia","Cameroon","Spain","Chile","Australia","Netherlands","Colombia","Ivory Coast","Greece","Japan","Uruguay","England","Costa Rica","Italy","Switzerland","France","Ecuador","Honduras","Argentina","Iran","Bosnia and Herzegovina","Nigeria","Germany","Ghana","Portugal","United States","Belgium","Russia","Algeria","South Korea",null,"Brazil","Colombia","France","Germany","Netherlands","Costa Rica","Argentina","Belgium","Chile","Uruguay","Nigeria","Algeria","Mexico","Greece","Switzerland","United States",null,"Brazil","Germany","Netherlands","Argentina","Colombia","France","Costa Rica","Belgium",null,"Brazil","Netherlands","Germany","Argentina",null,"Germany","Argentina",null,"Brazil","Netherlands"]
["2014-07-01","Salvador","2-1","Tim Howard",{"$f":"CONCATENATE(MATCH(LEFT(F3,3),$AM$3:$AM$34,0),\"-\",(MATCH(RIGHT(F3,3),$AM$3:$AM$34,0)))","v":"29-28"},"BEL-USA",52,0.67,20,15,11,6,3,3,0,0,3,0,0,2,0,0,38,142,14,2,2,1353,1033,0.77,83,22,0.27,23,83,null,6,{"$f":"IF(MOD($AL$2,4)=0,4,MOD($AL$2,4))","v":1},{"$f":"INDEX(Sheet2!$A$36:$B$67,MATCH(Sheet3!$AN3,CountryFlag,0),1)","v":"BRA"},"Brazil",{"$f":"IFERROR(INDEX($AN$3:$AN$34,IF(AO$2=$AN3,\" \",IF(ISNUMBER(MATCH(AO$2,GrpA,0)),MATCH(AO$2,$AO$2:$BT$2,0),\"\")),1),\"\")","v":""},{"$f":"IFERROR(INDEX($AN$3:$AN$34,IF(AP$2=$AN3,\" \",IF(ISNUMBER(MATCH(AP$2,GrpA,0)),MATCH(AP$2,$AO$2:$BT$2,0),\"\")),1),\"\")","v":"Mexico"},"Croatia","Cameroon","","","","","","",{"$f":"IFERROR(INDEX($AN$3:$AN$34,IF(AY$2=$AN3,\" \",IF(ISNUMBER(MATCH(AY$2,GrpA,0)),MATCH(AY$2,$AO$2:$BT$2,0),\"\")),1),\"\")","v":""},"","","","","","","","","",{"$f":"IFERROR(INDEX($AN$3:$AN$34,IF(BI$2=$AN3,\" \",IF(ISNUMBER(MATCH(BI$2,GrpA,0)),MATCH(BI$2,$AO$2:$BT$2,0),\"\")),1),\"\")","v":""},"","","","","","","","","","","","Brazil",null,null,null,null,null,null,null,null,"Chile",null,null,null,null,null,null,null,"Brazil",null,null,null,null,"Colombia",null,null,null,"Brazil",null,null,"Germany",null,"Germany",null,"Argentina","Brazil",null,"Netherlands"]
["2014-07-01","São Paulo","1-0","Lionel Messi","21-17","ARG-SUI",43,0.67,13,16,6,8,1,1,0,0,1,0,0,5,0,0,47,113,9,1,1,1257,922,0.74,75,15,0.2,18,92,null,null,{"$f":"IFERROR(CHOOSE($AK$3,AK4,AK5,AK6,AK7,RIGHT(AK8,LEN(AK8)-13),RIGHT(AK9,LEN(AK9)-15),RIGHT(AK10,LEN(AK10)-12),IF(LEFT($AK$11,3)=\"Fin\",RIGHT(AK11,LEN(AK11)-8),RIGHT(AK11,LEN(AK11)-11))),\"\")","v":"France"},{"$f":"INDEX(Sheet2!$A$36:$B$67,MATCH(Sheet3!$AN4,CountryFlag,0),1)","v":"MEX"},"Mexico","Brazil","","Croatia","Cameroon","","","","","","","","","","","","","","","","","","","","","","","","","","","","","Colombia",null,null,null,null,null,null,null,null,null,"Uruguay",null,null,null,null,null,null,"Germany",null,null,null,null,null,"France",null,null,"Netherlands",null,null,null,"Argentina","Argentina","Germany",null,"Netherlands","Brazil",null,null,null,null,null,null,null,null,null,null,null,null,null,52,0.67,20,15,11,6,3,3,0,0,3,0,0,2,0,0,38,142,14,2,2,1353,1033,0.77,83,22,0.27,23,83]
["2014-06-30","Porto Alegre","2-1","Raïs M'Bolhi","25-31","GER-ALG",40,0.73,19,10,6,5,3,3,0,0,3,0,0,2,0,0,31,75,7,2,8,1444,1103,0.77,51,11,0.22,14,90,null,{"$f":"CHOOSE($AL$3,INDEX($AN$2:$BT$34,MATCH($AK$2,$AN$2:$AN$34,0),MATCH($AK$2,$AN$2:$BT$2,0)+1),INDEX($AN$2:$BT$34,MATCH($AK$2,$AN$2:$AN$34,0),MATCH($AK$2,$AN$2:$BT$2,0)-1),INDEX($AN$2:$BT$34,MATCH($AK$2,$AN$2:$AN$34,0),MATCH($AK$2,$AN$2:$BT$2,0)-2),INDEX($AN$2:$BT$34,MATCH($AK$2,$AN$2:$AN$34,0),MATCH($AK$2,$AN$2:$BT$2,0)-3))","v":"Ghana"},null,{"$f":"INDEX(Sheet2!$A$36:$B$67,MATCH(Sheet3!$AN5,CountryFlag,0),1)","v":"CRO"},"Croatia","Brazil","Mexico","","Cameroon","","","","","","","","","","","","","","","","","","","","","","","","","","","","","France",null,null,null,null,null,null,null,null,null,null,"Nigeria",null,null,null,null,null,"Netherlands",null,null,null,null,null,null,"Costa Rica",null,"Germany","Brazil",null,null,null,null,null,null,null,null,null,null,null,null,null,null,null,null,null,null,null,null,null,43,0.67,13,16,6,8,1,1,0,0,1,0,0,5,0,0,47,113,9,1,1,1257,922,0.74,75,15,0.2,18,92]
["18 June 2014","Arena da Amazônia, Manaus","0–4","Mario Mandžukić","4-3","CMR-CRO",39,0.54,13,8,10,8,4,4,0,0,3,1,0,1,0,1,20,80,10,2,4,850,634,0.75,43,11,0.26,11,68,null,{"$f":"CHOOSE($AL$3,INDEX($AN$2:$BT$34,MATCH($AK$2,$AN$2:$AN$34,0),MATCH($AK$2,$AN$2:$BT$2,0)+2),INDEX($AN$2:$BT$34,MATCH($AK$2,$AN$2:$AN$34,0),MATCH($AK$2,$AN$2:$BT$2,0)+1),INDEX($AN$2:$BT$34,MATCH($AK$2,$AN$2:$AN$34,0),MATCH($AK$2,$AN$2:$BT$2,0)-1),INDEX($AN$2:$BT$34,MATCH($AK$2,$AN$2:$AN$34,0),MATCH($AK$2,$AN$2:$BT$2,0)-2))","v":"Portugal"},null,{"$f":"INDEX(Sheet2!$A$36:$B$67,MATCH(Sheet3!$AN6,CountryFlag,0),1)","v":"CMR"},"Cameroon","Brazil","Mexico","Croatia","","","","","","","","","","","","","","","","","","","","","","","","","","","","","","Germany",null,null,null,null,null,null,null,null,null,null,null,"Algeria",null,null,null,null,"Argentina",null,null,null,null,null,null,null,"Belgium","Argentina",null,"Netherlands",null,null,null,null,null,null,null,null,null,null,null,null,null,null,null,null,null,null,null,null,40,0.73,19,10,6,5,3,3,0,0,3,0,0,2,0,0,31,75,7,2,8,1444,1103,0.77,51,11,0.22,14,90]
["20 June 2014","Arena Fonte Nova, Salvador","2–5","Karim Benzema","17-18","SUI-FRA",39,0.62,13,11,7,8,7,6,1,0,5,2,0,1,0,0,28,72,6,6,3,1020,804,0.79,25,8,0.32,8,58,null,{"$f":"CHOOSE($AL$3,INDEX($AN$2:$BT$34,MATCH($AK$2,$AN$2:$AN$34,0),MATCH($AK$2,$AN$2:$BT$2,0)+3),INDEX($AN$2:$BT$34,MATCH($AK$2,$AN$2:$AN$34,0),MATCH($AK$2,$AN$2:$BT$2,0)+2),INDEX($AN$2:$BT$34,MATCH($AK$2,$AN$2:$AN$34,0),MATCH($AK$2,$AN$2:$BT$2,0)+1),INDEX($AN$2:$BT$34,MATCH($AK$2,$AN$2:$AN$34,0),MATCH($AK$2,$AN$2:$BT$2,0)-1))","v":"United States"},null,{"$f":"INDEX(Sheet2!$A$36:$B$67,MATCH(Sheet3!$AN7,CountryFlag,0),1)","v":"ESP"},"Spain",{"$f":"IFERROR(INDEX($AN$3:$AN$34,IF(AO$2=$AN7,\" \",IF(ISNUMBER(MATCH(AO$2,GrpB,0)),MATCH(AO$2,$AO$2:$BT$2,0),\"\")),1),\"\")","v":""},"","","","","Chile","Australia","Netherlands","","",{"$f":"IFERROR(INDEX($AN$3:$AN$34,IF(AY$2=$AN7,\" \",IF(ISNUMBER(MATCH(AY$2,GrpB,0)),MATCH(AY$2,$AO$2:$BT$2,0),\"\")),1),\"\")","v":""},"","","","","","","","","",{"$f":"IFERROR(INDEX($AN$3:$AN$34,IF(BI$2=$AN7,\" \",IF(ISNUMBER(MATCH(BI$2,GrpB,0)),MATCH(BI$2,$AO$2:$BT$2,0),\"\")),1),\"\")","v":""},"","","","","","","","","","","","Netherlands",null,null,null,null,null,null,null,null,null,null,null,null,"Mexico",null,null,null,"Colombia","Brazil",null,null,null,null,null,null,null,null,null,null,null,null,null,null,null,null,null,null,null,null,null,null,null,null,null,null,null,null,null,null,39,0.54,13,8,10,8,4,4,0,0,3,1,0,1,0,1,20,80,10,2,4,850,634,0.75,43,11,0.26,11,68]
["21 June 2014","Arena Pantanal, Cuiabá","1–0","Peter Odemwingie","24-23","NGA-BIH",38,0.61,12,11,4,11,1,1,0,0,1,0,0,2,0,0,16,98,10,1,5,1020,776,0.77,38,8,0.22,8,59,null,{"$f":"IF(ISNUMBER(MATCH($AK$2,$BV$2:$CK$2,0)),IF(MATCH($AK$2,$BV$2:$CK$2,0)<9,\"Round of 16: \" &INDEX($BU$2:$CK$18,MATCH($AK$2,$BU$2:$BU$18,0),MATCH($AK$2,$BU$2:$CK$2,0)+8),\"Round of 16: \" &INDEX($BU$2:$CK$18,MATCH($AK$2,$BU$2:$BU$18,0),MATCH($AK$2,$BU$2:$CK$2,0)-8)),\"\")","v":"Round of 16: Algeria"},null,{"$f":"INDEX(Sheet2!$A$36:$B$67,MATCH(Sheet3!$AN8,CountryFlag,0),1)","v":"CHI"},"Chile","","","","","Spain","","Australia","Netherlands","","","","","","","","","","","","","","","","","","","","","","","","","Costa Rica",null,null,null,null,null,null,null,null,null,null,null,null,null,"Greece",null,null,"France",null,"Germany",null,null,null,null,null,null,null,null,null,null,null,null,null,null,null,null,null,null,null,null,null,null,null,null,null,null,null,null,null,39,0.62,13,11,7,8,7,6,1,0,5,2,0,1,0,0,28,72,6,6,3,1020,804,0.79,25,8,0.32,8,58]
{"$rows_left_out":61}