{"text_format":"1","workbook":"xlsx","n_sheets":4,"sheets":["Pivot Calendar","pivot2","pivot1","Calcs"],"not_rendered":{"charts":0,"images":0,"macros":1,"external_links":0,"defined_names":9,"comments":0,"pivot_tables":4},"unopened":[],"bounds":{"document_bytes":16777216,"sheet_cells":100000,"rows_first":2000,"rows_last":500,"rows_between":2000,"halvings":0,"cell_chars":16384,"cell_head_chars":4096},"cells_cut":0,"cells_raw":0,"read":"whole","date_system":"1900"}

{"sheet":"Pivot Calendar","index":0,"n_rows":39,"n_cols":16,"rows_kept":39,"cut":false,"hidden":false,"merged":[[24,9,24,13],[25,9,25,13],[26,9,26,13],[27,9,27,13],[5,1,5,7],[2,1,2,4],[0,1,0,7],[15,1,15,7],[23,9,23,13]]}
[null,"Pivot Calendar"]
[]
[null,"Select an year and month",null,null,null,null,2012]
[]
[]
[null,{"$f":"pivot1!B1","v":"Sep"}]
[null,"Sun","Mon","Tue","Wed","Thu","Fri","Sat"]
[null,{"$f":"IF(pivot1!B5=\"\",\"\",pivot1!B5)","v":""},{"$f":"IF(pivot1!C5=\"\",\"\",pivot1!C5)","v":""},{"$f":"IF(pivot1!D5=\"\",\"\",pivot1!D5)","v":""},{"$f":"IF(pivot1!E5=\"\",\"\",pivot1!E5)","v":""},{"$f":"IF(pivot1!F5=\"\",\"\",pivot1!F5)","v":""},{"$f":"IF(pivot1!G5=\"\",\"\",pivot1!G5)","v":""},{"$f":"IF(pivot1!H5=\"\",\"\",pivot1!H5)","v":1}]
[null,{"$f":"IF(pivot1!B6=\"\",\"\",pivot1!B6)","v":2},{"$f":"IF(pivot1!C6=\"\",\"\",pivot1!C6)","v":3},{"$f":"IF(pivot1!D6=\"\",\"\",pivot1!D6)","v":4},{"$f":"IF(pivot1!E6=\"\",\"\",pivot1!E6)","v":5},{"$f":"IF(pivot1!F6=\"\",\"\",pivot1!F6)","v":6},{"$f":"IF(pivot1!G6=\"\",\"\",pivot1!G6)","v":7},{"$f":"IF(pivot1!H6=\"\",\"\",pivot1!H6)","v":8}]
[null,{"$f":"IF(pivot1!B7=\"\",\"\",pivot1!B7)","v":9},{"$f":"IF(pivot1!C7=\"\",\"\",pivot1!C7)","v":10},{"$f":"IF(pivot1!D7=\"\",\"\",pivot1!D7)","v":11},{"$f":"IF(pivot1!E7=\"\",\"\",pivot1!E7)","v":12},{"$f":"IF(pivot1!F7=\"\",\"\",pivot1!F7)","v":13},{"$f":"IF(pivot1!G7=\"\",\"\",pivot1!G7)","v":14},{"$f":"IF(pivot1!H7=\"\",\"\",pivot1!H7)","v":15}]
[null,{"$f":"IF(pivot1!B8=\"\",\"\",pivot1!B8)","v":16},{"$f":"IF(pivot1!C8=\"\",\"\",pivot1!C8)","v":17},{"$f":"IF(pivot1!D8=\"\",\"\",pivot1!D8)","v":18},{"$f":"IF(pivot1!E8=\"\",\"\",pivot1!E8)","v":19},{"$f":"IF(pivot1!F8=\"\",\"\",pivot1!F8)","v":20},{"$f":"IF(pivot1!G8=\"\",\"\",pivot1!G8)","v":21},{"$f":"IF(pivot1!H8=\"\",\"\",pivot1!H8)","v":22}]
[null,{"$f":"IF(pivot1!B9=\"\",\"\",pivot1!B9)","v":23},{"$f":"IF(pivot1!C9=\"\",\"\",pivot1!C9)","v":24},{"$f":"IF(pivot1!D9=\"\",\"\",pivot1!D9)","v":25},{"$f":"IF(pivot1!E9=\"\",\"\",pivot1!E9)","v":26},{"$f":"IF(pivot1!F9=\"\",\"\",pivot1!F9)","v":27},{"$f":"IF(pivot1!G9=\"\",\"\",pivot1!G9)","v":28},{"$f":"IF(pivot1!H9=\"\",\"\",pivot1!H9)","v":29}]
[null,{"$f":"IF(pivot1!B10=\"\",\"\",pivot1!B10)","v":30},{"$f":"IF(pivot1!C10=\"\",\"\",pivot1!C10)","v":""},{"$f":"IF(pivot1!D10=\"\",\"\",pivot1!D10)","v":""},{"$f":"IF(pivot1!E10=\"\",\"\",pivot1!E10)","v":""},{"$f":"IF(pivot1!F10=\"\",\"\",pivot1!F10)","v":""},{"$f":"IF(pivot1!G10=\"\",\"\",pivot1!G10)","v":""},{"$f":"IF(pivot1!H10=\"\",\"\",pivot1!H10)","v":""}]
[]
[]
[null,{"$f":"B6","v":"Sep"}]
[null,{"$f":"B7","v":"Sun"},{"$f":"C7","v":"Mon"},"Tue","Wed","Thu","Fri","Sat"]
[null,{"$f":"B8","v":""},"","","","","",1,null,null,null,null,null,null,null,1]
[null,{"$f":"INDEX(tblChosen,$P18,B$39)","v":""},{"$f":"INDEX(tblChosen,$P18,C$39)","v":""},{"$f":"INDEX(tblChosen,$P18,D$39)","v":""},{"$f":"INDEX(tblChosen,$P18,E$39)","v":""},{"$f":"INDEX(tblChosen,$P18,F$39)","v":""},{"$f":"INDEX(tblChosen,$P18,G$39)","v":""},{"$f":"INDEX(tblChosen,$P18,H$39)","v":0.82}]
[null,{"$f":"B9","v":2},3,4,5,6,7,8,null,null,null,null,null,null,null,2]
[null,{"$f":"INDEX(tblChosen,$P20,B$39)","v":0.81},{"$f":"INDEX(tblChosen,$P20,C$39)","v":0.82},{"$f":"INDEX(tblChosen,$P20,D$39)","v":0.86},{"$f":"INDEX(tblChosen,$P20,E$39)","v":0.89},{"$f":"INDEX(tblChosen,$P20,F$39)","v":0.93},{"$f":"INDEX(tblChosen,$P20,G$39)","v":0.84},{"$f":"INDEX(tblChosen,$P20,H$39)","v":0.91}]
[null,{"$f":"B10","v":9},10,11,12,13,14,15,null,null,null,null,null,null,null,3]
[null,{"$f":"INDEX(tblChosen,$P22,B$39)","v":0.84},{"$f":"INDEX(tblChosen,$P22,C$39)","v":0.93},{"$f":"INDEX(tblChosen,$P22,D$39)","v":0.88},{"$f":"INDEX(tblChosen,$P22,E$39)","v":0.84},{"$f":"INDEX(tblChosen,$P22,F$39)","v":0.84},{"$f":"INDEX(tblChosen,$P22,G$39)","v":0.83},{"$f":"INDEX(tblChosen,$P22,H$39)","v":0.78}]
[null,{"$f":"B11","v":16},17,18,19,20,21,22,null,"References:",null,null,null,null,null,4]
[null,{"$f":"INDEX(tblChosen,$P24,B$39)","v":0.78},{"$f":"INDEX(tblChosen,$P24,C$39)","v":0.81},{"$f":"INDEX(tblChosen,$P24,D$39)","v":0.86},{"$f":"INDEX(tblChosen,$P24,E$39)","v":0.91},{"$f":"INDEX(tblChosen,$P24,F$39)","v":0.77},{"$f":"INDEX(tblChosen,$P24,G$39)","v":0.87},{"$f":"INDEX(tblChosen,$P24,H$39)","v":0.84}]
[null,{"$f":"B12","v":23},24,25,26,27,28,29,null,"Rob's Calendar Chart",null,null,null,null,null,5]
[null,{"$f":"INDEX(tblChosen,$P26,B$39)","v":0.93},{"$f":"INDEX(tblChosen,$P26,C$39)","v":0.92},{"$f":"INDEX(tblChosen,$P26,D$39)","v":0.89},{"$f":"INDEX(tblChosen,$P26,E$39)","v":0.84},{"$f":"INDEX(tblChosen,$P26,F$39)","v":0.79},{"$f":"INDEX(tblChosen,$P26,G$39)","v":0.87},{"$f":"INDEX(tblChosen,$P26,H$39)","v":0.8}]
[null,{"$f":"B13","v":30},"","","","","","",null,"Learn how this is made: Video",null,null,null,null,null,6]
[null,{"$f":"INDEX(tblChosen,$P28,B$39)","v":0.98},{"$f":"INDEX(tblChosen,$P28,C$39)","v":""},{"$f":"INDEX(tblChosen,$P28,D$39)","v":""},{"$f":"INDEX(tblChosen,$P28,E$39)","v":""},{"$f":"INDEX(tblChosen,$P28,F$39)","v":""},{"$f":"INDEX(tblChosen,$P28,G$39)","v":""},{"$f":"INDEX(tblChosen,$P28,H$39)","v":""}]
[]
[null,"Legend:"]
[]
[null,{"$f":"TEXT(MIN(tblChosen),IF(valMetric<3,\"0%\",\"0\"))","v":"77%"},null,null,{"$f":"TEXT(PERCENTILE(tblChosen,0.5),IF(valMetric<3,\"0%\",\"0\"))","v":"84%"},null,null,{"$f":"TEXT(MAX(tblChosen),IF(valMetric<3,\"0%\",\"0\"))","v":"98%"}]
[]
[]
[]
[]
[]
[null,1,2,3,4,5,6,7]

{"sheet":"pivot2","index":1,"n_rows":44,"n_cols":25,"rows_kept":44,"cut":false,"hidden":false,"merged":[]}
[]
[]
["Sum of Employee Attendance","Column Labels"]
["Row Labels",1,2,3,4,5,6,7]
[1,null,null,null,null,null,null,0.82,null,null,null,null,null,null,null,null,null,null,{"$f":"IF(B5=\"\",\"\",B5)","v":""},{"$f":"IF(C5=\"\",\"\",C5)","v":""},{"$f":"IF(D5=\"\",\"\",D5)","v":""},{"$f":"IF(E5=\"\",\"\",E5)","v":""},{"$f":"IF(F5=\"\",\"\",F5)","v":""},{"$f":"IF(G5=\"\",\"\",G5)","v":""},{"$f":"IF(H5=\"\",\"\",H5)","v":0.82}]
[2,0.81,0.82,0.86,0.89,0.93,0.84,0.91,null,null,null,null,null,null,null,null,null,null,{"$f":"IF(B6=\"\",\"\",B6)","v":0.81},0.82,0.86,0.89,0.93,0.84,0.91]
[3,0.84,0.93,0.88,0.84,0.84,0.83,0.78,null,null,null,null,null,null,null,null,null,null,0.84,0.93,0.88,0.84,0.84,0.83,0.78]
[4,0.78,0.81,0.86,0.91,0.77,0.87,0.84,null,null,null,null,null,null,null,null,null,null,0.78,0.81,0.86,0.91,0.77,0.87,0.84]
[5,0.93,0.92,0.89,0.84,0.79,0.87,0.8,null,null,null,null,null,null,null,null,null,null,0.93,0.92,0.89,0.84,0.79,0.87,0.8]
[6,0.98,null,null,null,null,null,null,null,null,null,null,null,null,null,null,null,null,0.98,"","","","","",""]
[]
[]
[]
["Sum of Productivity","Column Labels"]
["Row Labels",1,2,3,4,5,6,7]
[1,null,null,null,null,null,null,0.88,null,null,null,null,null,null,null,null,null,null,{"$f":"IF(B16=\"\",\"\",B16)","v":""},{"$f":"IF(C16=\"\",\"\",C16)","v":""},{"$f":"IF(D16=\"\",\"\",D16)","v":""},{"$f":"IF(E16=\"\",\"\",E16)","v":""},{"$f":"IF(F16=\"\",\"\",F16)","v":""},{"$f":"IF(G16=\"\",\"\",G16)","v":""},{"$f":"IF(H16=\"\",\"\",H16)","v":0.88}]
[2,0.97,0.91,0.75,0.96,0.9,0.81,0.98,null,null,null,null,null,null,null,null,null,null,0.97,0.91,0.75,0.96,0.9,0.81,0.98]
[3,0.91,0.84,0.79,1,0.75,0.93,0.86,null,null,null,null,null,null,null,null,null,null,0.91,0.84,0.79,1,0.75,0.93,0.86]
[4,0.87,0.89,0.99,0.97,0.97,0.88,1,null,null,null,null,null,null,null,null,null,null,0.87,0.89,0.99,0.97,0.97,0.88,1]
[5,1,0.86,0.81,0.79,0.79,0.84,0.79,null,null,null,null,null,null,null,null,null,null,1,0.86,0.81,0.79,0.79,0.84,0.79]
[6,0.81,null,null,null,null,null,null,null,null,null,null,null,null,null,null,null,null,0.81,"","","","","",""]
[]
[]
[]
["Sum of Defects per million","Column Labels"]
["Row Labels",1,2,3,4,5,6,7]
[1,null,null,null,null,null,null,0,null,null,null,null,null,null,null,null,null,null,{"$f":"IF(B27=\"\",\"\",B27)","v":""},{"$f":"IF(C27=\"\",\"\",C27)","v":""},{"$f":"IF(D27=\"\",\"\",D27)","v":""},{"$f":"IF(E27=\"\",\"\",E27)","v":""},{"$f":"IF(F27=\"\",\"\",F27)","v":""},{"$f":"IF(G27=\"\",\"\",G27)","v":""},{"$f":"IF(H27=\"\",\"\",H27)","v":0}]
[2,4,3,1,2,2,0,2,null,null,null,null,null,null,null,null,null,null,4,3,1,2,2,0,2]
[3,3,0,0,2,1,2,3,null,null,null,null,null,null,null,null,null,null,3,0,0,2,1,2,3]
[4,3,2,3,1,3,3,4,null,null,null,null,null,null,null,null,null,null,3,2,3,1,3,3,4]
[5,2,3,3,0,0,1,3,null,null,null,null,null,null,null,null,null,null,2,3,3,0,0,1,3]
[6,3,null,null,null,null,null,null,null,null,null,null,null,null,null,null,null,null,3,"","","","","",""]
[]
[]
[]
[null,null,null,null,null,null,null,null,null,null,null,null,null,null,null,null,null,null,"Calendar for Chosen metric"]
[null,null,null,null,null,null,null,null,null,null,null,null,null,null,null,null,null,null,{"$f":"INDEX(lstMetrics,Calcs!$G$3)","v":"Attendance"}]
[null,null,null,null,null,null,null,null,null,null,null,null,null,null,null,null,null,null,1,2,3,4,5,6,7]
[null,null,null,null,null,null,null,null,null,null,null,null,null,null,null,null,null,1,{"$f":"INDEX(tblChosen,$R39,S$38)","v":""},{"$f":"INDEX(tblChosen,$R39,T$38)","v":""},{"$f":"INDEX(tblChosen,$R39,U$38)","v":""},{"$f":"INDEX(tblChosen,$R39,V$38)","v":""},{"$f":"INDEX(tblChosen,$R39,W$38)","v":""},{"$f":"INDEX(tblChosen,$R39,X$38)","v":""},{"$f":"INDEX(tblChosen,$R39,Y$38)","v":0.82}]
[null,null,null,null,null,null,null,null,null,null,null,null,null,null,null,null,null,2,{"$f":"INDEX(tblChosen,$R40,S$38)","v":0.81},{"$f":"INDEX(tblChosen,$R40,T$38)","v":0.82},{"$f":"INDEX(tblChosen,$R40,U$38)","v":0.86},{"$f":"INDEX(tblChosen,$R40,V$38)","v":0.89},{"$f":"INDEX(tblChosen,$R40,W$38)","v":0.93},{"$f":"INDEX(tblChosen,$R40,X$38)","v":0.84},{"$f":"INDEX(tblChosen,$R40,Y$38)","v":0.91}]
[null,null,null,null,null,null,null,null,null,null,null,null,null,null,null,null,null,3,{"$f":"INDEX(tblChosen,$R41,S$38)","v":0.84},{"$f":"INDEX(tblChosen,$R41,T$38)","v":0.93},{"$f":"INDEX(tblChosen,$R41,U$38)","v":0.88},{"$f":"INDEX(tblChosen,$R41,V$38)","v":0.84},{"$f":"INDEX(tblChosen,$R41,W$38)","v":0.84},{"$f":"INDEX(tblChosen,$R41,X$38)","v":0.83},{"$f":"INDEX(tblChosen,$R41,Y$38)","v":0.78}]
[null,null,null,null,null,null,null,null,null,null,null,null,null,null,null,null,null,4,{"$f":"INDEX(tblChosen,$R42,S$38)","v":0.78},{"$f":"INDEX(tblChosen,$R42,T$38)","v":0.81},{"$f":"INDEX(tblChosen,$R42,U$38)","v":0.86},{"$f":"INDEX(tblChosen,$R42,V$38)","v":0.91},{"$f":"INDEX(tblChosen,$R42,W$38)","v":0.77},{"$f":"INDEX(tblChosen,$R42,X$38)","v":0.87},{"$f":"INDEX(tblChosen,$R42,Y$38)","v":0.84}]
[null,null,null,null,null,null,null,null,null,null,null,null,null,null,null,null,null,5,{"$f":"INDEX(tblChosen,$R43,S$38)","v":0.93},{"$f":"INDEX(tblChosen,$R43,T$38)","v":0.92},{"$f":"INDEX(tblChosen,$R43,U$38)","v":0.89},{"$f":"INDEX(tblChosen,$R43,V$38)","v":0.84},{"$f":"INDEX(tblChosen,$R43,W$38)","v":0.79},{"$f":"INDEX(tblChosen,$R43,X$38)","v":0.87},{"$f":"INDEX(tblChosen,$R43,Y$38)","v":0.8}]
[null,null,null,null,null,null,null,null,null,null,null,null,null,null,null,null,null,6,{"$f":"INDEX(tblChosen,$R44,S$38)","v":0.98},{"$f":"INDEX(tblChosen,$R44,T$38)","v":""},{"$f":"INDEX(tblChosen,$R44,U$38)","v":""},{"$f":"INDEX(tblChosen,$R44,V$38)","v":""},{"$f":"INDEX(tblChosen,$R44,W$38)","v":""},{"$f":"INDEX(tblChosen,$R44,X$38)","v":""},{"$f":"INDEX(tblChosen,$R44,Y$38)","v":""}]

{"sheet":"pivot1","index":2,"n_rows":10,"n_cols":8,"rows_kept":10,"cut":false,"hidden":false,"merged":[]}
["Month","Sep"]
[]
["Sum of Day","Column Labels"]
["Row Labels",1,2,3,4,5,6,7]
[1,null,null,null,null,null,null,1]
[2,2,3,4,5,6,7,8]
[3,9,10,11,12,13,14,15]
[4,16,17,18,19,20,21,22]
[5,23,24,25,26,27,28,29]
[6,30]

{"sheet":"Calcs","index":3,"n_rows":371,"n_cols":13,"rows_kept":371,"cut":false,"hidden":false,"merged":[]}
[]
[null,"Selected Year",null,{"$f":"'Pivot Calendar'!G3","v":2012},null,"Weekstart",1,null,null,null,null,null,"Attendance"]
[null,"Leap Year?",null,{"$f":"DATE(D2+1,1,1)-$B$6=366","v":true},null,"Chosen metric",1,null,null,null,null,null,"Productivity"]
[null,null,null,null,null,null,null,null,null,null,null,null,"Defects (per Mn)"]
[null,"Date","Day","Month","Year","Weekday","Weeknum","Employee Attendance","Productivity","Defects per million"]
[null,{"$f":"DATE($D$2,1,1)","v":"2012-01-01"},{"$f":"DAY(B6)","v":1},{"$f":"TEXT(B6,\"mmm\")","v":"Jan"},{"$f":"YEAR(B6)","v":2012},{"$f":"WEEKDAY(B6,$G$2)","v":1},1,0.82,0.9,0]
[null,{"$f":"B6+1","v":"2012-01-02"},{"$f":"DAY(B7)","v":2},{"$f":"TEXT(B7,\"mmm\")","v":"Jan"},{"$f":"YEAR(B7)","v":2012},{"$f":"WEEKDAY(B7,$G$2)","v":2},{"$f":"IF(D7=D6,IF(F7=1,G6+1,G6),1)","v":1},0.8,0.91,4]
[null,{"$f":"B7+1","v":"2012-01-03"},3,"Jan",2012,3,{"$f":"IF(D8=D7,IF(F8=1,G7+1,G7),1)","v":1},0.93,0.83,2]
[null,"2012-01-04",4,"Jan",2012,4,1,0.98,0.87,1]
[null,"2012-01-05",5,"Jan",2012,5,1,0.88,0.8,2]
[null,"2012-01-06",6,"Jan",2012,6,1,0.86,0.82,2]
[null,"2012-01-07",7,"Jan",2012,7,1,0.98,0.88,1]
[null,"2012-01-08",8,"Jan",2012,1,2,0.85,0.98,1]
[null,"2012-01-09",9,"Jan",2012,2,2,0.91,0.86,2]
[null,"2012-01-10",10,"Jan",2012,3,2,0.91,0.8,3]
[null,"2012-01-11",11,"Jan",2012,4,2,0.78,0.85,3]
[null,"2012-01-12",12,"Jan",2012,5,2,0.81,0.99,3]
[null,"2012-01-13",13,"Jan",2012,6,2,0.88,0.82,4]
[null,"2012-01-14",14,"Jan",2012,7,2,0.95,0.92,1]
[null,"2012-01-15",15,"Jan",2012,1,3,1,0.92,0]
[null,"2012-01-16",16,"Jan",2012,2,3,0.85,0.86,1]
[null,"2012-01-17",17,"Jan",2012,3,3,0.76,0.81,3]
[null,"2012-01-18",18,"Jan",2012,4,3,0.9,0.91,3]
[null,"2012-01-19",19,"Jan",2012,5,3,0.88,0.77,2]
[null,"2012-01-20",20,"Jan",2012,6,3,0.96,0.86,4]
[null,"2012-01-21",21,"Jan",2012,7,3,0.78,0.75,0]
[null,"2012-01-22",22,"Jan",2012,1,4,0.97,0.75,0]
[null,"2012-01-23",23,"Jan",2012,2,4,0.81,1,1]
[null,"2012-01-24",24,"Jan",2012,3,4,0.76,0.93,4]
[null,"2012-01-25",25,"Jan",2012,4,4,0.87,0.93,4]
[null,"2012-01-26",26,"Jan",2012,5,4,0.93,0.89,1]
[null,"2012-01-27",27,"Jan",2012,6,4,0.81,0.92,3]
[null,"2012-01-28",28,"Jan",2012,7,4,0.89,0.97,3]
[null,"2012-01-29",29,"Jan",2012,1,5,0.87,0.94,1]
[null,"2012-01-30",30,"Jan",2012,2,5,0.88,0.84,3]
[null,"2012-01-31",31,"Jan",2012,3,5,0.86,0.85,2]
[null,"2012-02-01",1,"Feb",2012,4,1,0.99,0.88,1]
[null,"2012-02-02",2,"Feb",2012,5,1,0.92,0.81,0]
[null,"2012-02-03",3,"Feb",2012,6,1,0.8,0.77,3]
[null,"2012-02-04",4,"Feb",2012,7,1,0.75,0.94,0]
[null,"2012-02-05",5,"Feb",2012,1,2,0.94,0.97,3]
[null,"2012-02-06",6,"Feb",2012,2,2,0.82,0.88,0]
[null,"2012-02-07",7,"Feb",2012,3,2,0.98,0.96,3]
[null,"2012-02-08",8,"Feb",2012,4,2,0.94,0.8,4]
[null,"2012-02-09",9,"Feb",2012,5,2,0.78,0.85,3]
[null,"2012-02-10",10,"Feb",2012,6,2,0.99,0.92,0]
[null,"2012-02-11",11,"Feb",2012,7,2,0.9,0.92,4]
[null,"2012-02-12",12,"Feb",2012,1,3,0.89,0.85,3]
[null,"2012-02-13",13,"Feb",2012,2,3,0.92,1,1]
[null,"2012-02-14",14,"Feb",2012,3,3,0.83,0.92,1]
[null,"2012-02-15",15,"Feb",2012,4,3,0.93,0.75,1]
[null,"2012-02-16",16,"Feb",2012,5,3,0.82,0.84,4]
[null,"2012-02-17",17,"Feb",2012,6,3,0.81,0.97,4]
[null,"2012-02-18",18,"Feb",2012,7,3,0.75,0.96,4]
[null,"2012-02-19",19,"Feb",2012,1,4,0.98,0.83,0]
[null,"2012-02-20",20,"Feb",2012,2,4,0.9,0.76,1]
[null,"2012-02-21",21,"Feb",2012,3,4,0.87,0.85,3]
[null,"2012-02-22",22,"Feb",2012,4,4,0.8,0.9,2]
[null,"2012-02-23",23,"Feb",2012,5,4,0.78,0.91,0]
[null,"2012-02-24",24,"Feb",2012,6,4,0.87,0.85,3]
[null,"2012-02-25",25,"Feb",2012,7,4,0.96,0.79,0]
[null,"2012-02-26",26,"Feb",2012,1,5,0.86,0.82,4]
[null,"2012-02-27",27,"Feb",2012,2,5,1,0.81,4]
[null,"2012-02-28",28,"Feb",2012,3,5,0.95,0.85,3]
[null,"2012-02-29",29,"Feb",2012,4,5,0.78,0.98,2]
[null,"2012-03-01",1,"Mar",2012,5,1,0.95,0.95,4]
[null,"2012-03-02",2,"Mar",2012,6,1,0.93,0.93,1]
[null,"2012-03-03",3,"Mar",2012,7,1,0.98,0.9,0]
[null,"2012-03-04",4,"Mar",2012,1,2,0.81,0.99,4]
[null,"2012-03-05",5,"Mar",2012,2,2,0.84,0.9,0]
[null,"2012-03-06",{"$f":"DAY(B71)","v":6},{"$f":"TEXT(B71,\"mmm\")","v":"Mar"},{"$f":"YEAR(B71)","v":2012},{"$f":"WEEKDAY(B71,$G$2)","v":3},2,1,0.87,0]
[null,{"$f":"B71+1","v":"2012-03-07"},7,"Mar",2012,4,{"$f":"IF(D72=D71,IF(F72=1,G71+1,G71),1)","v":2},0.84,0.96,3]
[null,"2012-03-08",8,"Mar",2012,5,2,1,0.92,4]
[null,"2012-03-09",9,"Mar",2012,6,2,0.83,0.88,2]
[null,"2012-03-10",10,"Mar",2012,7,2,0.93,0.87,2]
[null,"2012-03-11",11,"Mar",2012,1,3,0.86,0.94,4]
[null,"2012-03-12",12,"Mar",2012,2,3,0.99,0.97,2]
[null,"2012-03-13",13,"Mar",2012,3,3,0.82,0.78,2]
[null,"2012-03-14",14,"Mar",2012,4,3,0.9,0.87,0]
[null,"2012-03-15",15,"Mar",2012,5,3,0.78,0.83,3]
[null,"2012-03-16",16,"Mar",2012,6,3,0.94,0.75,2]
[null,"2012-03-17",17,"Mar",2012,7,3,0.91,0.93,3]
[null,"2012-03-18",18,"Mar",2012,1,4,0.95,0.95,4]
[null,"2012-03-19",19,"Mar",2012,2,4,0.84,0.77,1]
[null,"2012-03-20",20,"Mar",2012,3,4,0.77,0.92,0]
[null,"2012-03-21",21,"Mar",2012,4,4,0.94,0.98,3]
[null,"2012-03-22",22,"Mar",2012,5,4,0.76,0.96,1]
[null,"2012-03-23",23,"Mar",2012,6,4,0.82,0.98,2]
[null,"2012-03-24",24,"Mar",2012,7,4,0.95,0.75,2]
[null,"2012-03-25",25,"Mar",2012,1,5,0.86,0.81,1]
[null,"2012-03-26",26,"Mar",2012,2,5,0.93,0.79,1]
[null,"2012-03-27",27,"Mar",2012,3,5,0.94,0.78,1]
[null,"2012-03-28",28,"Mar",2012,4,5,0.78,1,0]
[null,"2012-03-29",29,"Mar",2012,5,5,0.97,0.76,3]
[null,"2012-03-30",30,"Mar",2012,6,5,0.88,0.93,3]
[null,"2012-03-31",31,"Mar",2012,7,5,0.8,0.79,2]
[null,"2012-04-01",1,"Apr",2012,1,1,0.86,0.85,1]
[null,"2012-04-02",2,"Apr",2012,2,1,0.92,0.95,2]
[null,"2012-04-03",3,"Apr",2012,3,1,0.82,0.8,2]
[null,"2012-04-04",4,"Apr",2012,4,1,0.93,0.97,2]
[null,"2012-04-05",5,"Apr",2012,5,1,0.93,0.97,2]
[null,"2012-04-06",6,"Apr",2012,6,1,0.96,0.75,0]
[null,"2012-04-07",7,"Apr",2012,7,1,0.85,0.97,3]
[null,"2012-04-08",8,"Apr",2012,1,2,0.96,0.81,3]
[null,"2012-04-09",9,"Apr",2012,2,2,0.91,0.85,4]
[null,"2012-04-10",10,"Apr",2012,3,2,0.88,0.78,2]
[null,"2012-04-11",11,"Apr",2012,4,2,0.92,0.85,0]
[null,"2012-04-12",12,"Apr",2012,5,2,0.8,0.89,3]
[null,"2012-04-13",13,"Apr",2012,6,2,0.79,0.83,2]
[null,"2012-04-14",14,"Apr",2012,7,2,0.89,0.89,1]
[null,"2012-04-15",15,"Apr",2012,1,3,0.81,0.96,2]
[null,"2012-04-16",16,"Apr",2012,2,3,0.89,0.85,1]
[null,"2012-04-17",17,"Apr",2012,3,3,0.96,0.98,0]
[null,"2012-04-18",18,"Apr",2012,4,3,0.75,0.8,0]
[null,"2012-04-19",19,"Apr",2012,5,3,0.88,0.89,4]
[null,"2012-04-20",20,"Apr",2012,6,3,0.87,0.89,1]
[null,"2012-04-21",21,"Apr",2012,7,3,0.75,0.89,3]
[null,"2012-04-22",22,"Apr",2012,1,4,0.9,0.97,4]
[null,"2012-04-23",23,"Apr",2012,2,4,0.85,0.75,0]
[null,"2012-04-24",24,"Apr",2012,3,4,0.96,0.9,1]
[null,"2012-04-25",25,"Apr",2012,4,4,0.93,0.95,1]
[null,"2012-04-26",26,"Apr",2012,5,4,0.76,0.8,0]
[null,"2012-04-27",27,"Apr",2012,6,4,0.94,0.81,4]
[null,"2012-04-28",28,"Apr",2012,7,4,0.76,0.91,0]
[null,"2012-04-29",29,"Apr",2012,1,5,0.93,0.87,4]
[null,"2012-04-30",30,"Apr",2012,2,5,0.9,0.87,1]
[null,"2012-05-01",1,"May",2012,3,1,0.84,0.86,1]
[null,"2012-05-02",2,"May",2012,4,1,0.97,0.87,1]
[null,"2012-05-03",3,"May",2012,5,1,0.92,0.77,0]
[null,"2012-05-04",4,"May",2012,6,1,0.78,0.86,4]
[null,"2012-05-05",5,"May",2012,7,1,0.99,0.92,1]
[null,"2012-05-06",6,"May",2012,1,2,0.85,0.97,1]
[null,"2012-05-07",7,"May",2012,2,2,0.94,0.79,3]
[null,"2012-05-08",8,"May",2012,3,2,0.8,0.76,0]
[null,"2012-05-09",{"$f":"DAY(B135)","v":9},{"$f":"TEXT(B135,\"mmm\")","v":"May"},{"$f":"YEAR(B135)","v":2012},{"$f":"WEEKDAY(B135,$G$2)","v":4},2,0.96,0.92,1]
[null,{"$f":"B135+1","v":"2012-05-10"},10,"May",2012,5,{"$f":"IF(D136=D135,IF(F136=1,G135+1,G135),1)","v":2},0.91,0.92,1]
[null,"2012-05-11",11,"May",2012,6,2,0.94,0.75,3]
[null,"2012-05-12",12,"May",2012,7,2,0.94,1,3]
[null,"2012-05-13",13,"May",2012,1,3,0.89,0.81,2]
[null,"2012-05-14",14,"May",2012,2,3,0.76,0.96,3]
[null,"2012-05-15",15,"May",2012,3,3,0.8,0.86,0]
[null,"2012-05-16",16,"May",2012,4,3,0.87,0.85,4]
[null,"2012-05-17",17,"May",2012,5,3,0.79,0.85,3]
[null,"2012-05-18",18,"May",2012,6,3,0.89,0.8,1]
[null,"2012-05-19",19,"May",2012,7,3,0.75,0.91,1]
[null,"2012-05-20",20,"May",2012,1,4,0.91,0.92,2]
[null,"2012-05-21",21,"May",2012,2,4,0.97,0.8,1]
[null,"2012-05-22",22,"May",2012,3,4,0.87,0.88,1]
[null,"2012-05-23",23,"May",2012,4,4,0.91,0.9,1]
[null,"2012-05-24",24,"May",2012,5,4,0.99,0.93,3]
[null,"2012-05-25",25,"May",2012,6,4,0.8,0.98,1]
[null,"2012-05-26",26,"May",2012,7,4,0.89,0.98,2]
[null,"2012-05-27",27,"May",2012,1,5,0.93,0.98,2]
[null,"2012-05-28",28,"May",2012,2,5,0.94,0.87,2]
[null,"2012-05-29",29,"May",2012,3,5,0.83,0.9,4]
[null,"2012-05-30",30,"May",2012,4,5,0.97,0.8,3]
[null,"2012-05-31",31,"May",2012,5,5,0.76,0.91,2]
[null,"2012-06-01",1,"Jun",2012,6,1,0.77,1,0]
[null,"2012-06-02",2,"Jun",2012,7,1,0.95,0.86,4]
[null,"2012-06-03",3,"Jun",2012,1,2,0.91,0.76,3]
[null,"2012-06-04",4,"Jun",2012,2,2,0.97,0.99,4]
[null,"2012-06-05",5,"Jun",2012,3,2,0.94,0.84,3]
[null,"2012-06-06",6,"Jun",2012,4,2,0.8,0.81,1]
[null,"2012-06-07",7,"Jun",2012,5,2,0.92,0.76,0]
[null,"2012-06-08",8,"Jun",2012,6,2,0.81,0.82,4]
[null,"2012-06-09",9,"Jun",2012,7,2,0.78,0.92,0]
[null,"2012-06-10",10,"Jun",2012,1,3,0.89,0.78,4]
[null,"2012-06-11",11,"Jun",2012,2,3,0.97,0.81,2]
[null,"2012-06-12",12,"Jun",2012,3,3,0.76,0.87,1]
[null,"2012-06-13",13,"Jun",2012,4,3,0.88,0.99,0]
[null,"2012-06-14",14,"Jun",2012,5,3,0.84,0.75,0]
[null,"2012-06-15",15,"Jun",2012,6,3,1,0.81,2]
[null,"2012-06-16",16,"Jun",2012,7,3,0.75,0.89,2]
[null,"2012-06-17",17,"Jun",2012,1,4,0.88,0.83,1]
[null,"2012-06-18",18,"Jun",2012,2,4,0.76,0.76,2]
[null,"2012-06-19",19,"Jun",2012,3,4,0.84,0.88,0]
[null,"2012-06-20",20,"Jun",2012,4,4,0.98,1,2]
[null,"2012-06-21",21,"Jun",2012,5,4,0.85,0.95,0]
[null,"2012-06-22",22,"Jun",2012,6,4,0.77,0.93,0]
[null,"2012-06-23",23,"Jun",2012,7,4,0.9,0.98,2]
[null,"2012-06-24",24,"Jun",2012,1,5,0.76,0.95,2]
[null,"2012-06-25",25,"Jun",2012,2,5,0.93,0.97,4]
[null,"2012-06-26",26,"Jun",2012,3,5,0.95,0.91,3]
[null,"2012-06-27",27,"Jun",2012,4,5,1,0.77,1]
[null,"2012-06-28",28,"Jun",2012,5,5,0.82,0.83,4]
[null,"2012-06-29",29,"Jun",2012,6,5,0.79,0.89,4]
[null,"2012-06-30",30,"Jun",2012,7,5,0.99,0.84,1]
[null,"2012-07-01",1,"Jul",2012,1,1,0.97,0.97,1]
[null,"2012-07-02",2,"Jul",2012,2,1,0.81,0.95,2]
[null,"2012-07-03",3,"Jul",2012,3,1,0.97,0.96,1]
[null,"2012-07-04",4,"Jul",2012,4,1,0.75,0.97,0]
[null,"2012-07-05",5,"Jul",2012,5,1,0.79,0.94,1]
[null,"2012-07-06",6,"Jul",2012,6,1,0.83,0.95,2]
[null,"2012-07-07",7,"Jul",2012,7,1,0.83,0.75,3]
[null,"2012-07-08",8,"Jul",2012,1,2,0.8,0.79,1]
[null,"2012-07-09",9,"Jul",2012,2,2,0.82,0.76,3]
[null,"2012-07-10",10,"Jul",2012,3,2,0.99,0.79,1]
[null,"2012-07-11",11,"Jul",2012,4,2,0.97,0.83,1]
[null,"2012-07-12",{"$f":"DAY(B199)","v":12},{"$f":"TEXT(B199,\"mmm\")","v":"Jul"},{"$f":"YEAR(B199)","v":2012},{"$f":"WEEKDAY(B199,$G$2)","v":5},2,0.88,0.98,2]
[null,{"$f":"B199+1","v":"2012-07-13"},13,"Jul",2012,6,{"$f":"IF(D200=D199,IF(F200=1,G199+1,G199),1)","v":2},1,0.97,3]
{"$rows_left_out":171}