{"text_format":"1","workbook":"xlsx","n_sheets":3,"sheets":["Excel Salary dashboard","Data","calcs"],"not_rendered":{"charts":3,"images":3,"macros":1,"external_links":1,"defined_names":14,"comments":0,"pivot_tables":0},"unopened":[],"bounds":{"document_bytes":16777216,"sheet_cells":100000,"rows_first":2000,"rows_last":500,"rows_between":2000,"halvings":0,"cell_chars":16384,"cell_head_chars":4096},"cells_cut":0,"cells_raw":0,"read":"whole","date_system":"1900"}

{"sheet":"Excel Salary dashboard","index":0,"n_rows":0,"n_cols":0,"rows_kept":0,"cut":false,"hidden":false,"merged":[]}

{"sheet":"Data","index":1,"n_rows":1884,"n_cols":24,"rows_kept":1884,"cut":false,"hidden":false,"merged":[]}
[null,"Unique ID","Salary in USD","Job Type","clean Country","How many hours of a day you work on Excel","Years of Experience","Clean Years of experience",null,null,null,null,null,null,null,null,null,null,null,"Countries with sample big enough",null,null,"Job Type"]
[null,"ID0001",5846,"Analyst","India","4 to 6 hours a day",null,{"$f":"IF(ISBLANK(G2),NA(),VLOOKUP(G2,experienceCode,2,1))","v":{"$error":"#N/A"}},null,null,null,null,null,null,null,null,null,null,null,"USA",{"$f":"COUNTIF($E$2:$E$1884,T2)","v":617},null,"Analyst",{"$f":"COUNTIF($D$2:$D$1884,W2)","v":743}]
[null,"ID0002",15000,"Controller","Croatia","All the 8 hours baby, all the 8!",null,{"$error":"#N/A"},null,null,null,null,null,null,null,null,null,null,null,"India",565,null,"Manager",558]
[null,"ID0003",58000,"Analyst","USA","All the 8 hours baby, all the 8!",null,{"$error":"#N/A"},null,null,null,null,null,null,null,null,null,null,null,"UK",154,null,"Accountant",135]
[null,"ID0004",48000,"Controller","Pakistan","2 to 3 hours per day",null,{"$error":"#N/A"},null,null,null,null,null,null,null,null,null,null,null,"Australia",81,null,"Consultant",90]
[null,"ID0005",54000,"Engineer","USA","All the 8 hours baby, all the 8!",null,{"$error":"#N/A"},null,null,null,null,"Excel ?!? What Excel?",1,"I don't work with excel",null,null,null,null,"Canada",58,null,"Reporting",83]
[null,"ID0006",41731,"Analyst","Iceland","All the 8 hours baby, all the 8!",null,{"$error":"#N/A"},null,null,null,null,"1 or 2 hours a day",2,"1 - 2 hours a day",null,null,null,null,"Pakistan",29,null,"CXO or Top Mgmt.",75]
[null,"ID0007",184207.91865378313,"Manager","Germany","1 or 2 hours a day",null,{"$error":"#N/A"},null,null,null,null,"2 to 3 hours per day",3,"2 - 3 hours a day",null,null,null,null,"Netherlands",23,null,"Engineer",74]
[null,"ID0008",12000,"Analyst","Ukraine","All the 8 hours baby, all the 8!",null,{"$error":"#N/A"},null,null,null,null,"4 to 6 hours a day",4,"4 - 6 hours a day",null,null,null,null,"South Africa",19,null,"Controller",67]
[null,"ID0009",44000,"CXO or Top Mgmt.","Portugal","1 or 2 hours a day",null,{"$error":"#N/A"},null,null,null,null,"All the 8 hours baby, all the 8!",5,"8 hours a day",null,null,null,null,"UAE",19,null,"Specialist",51]
[null,"ID0010",12227.430201752599,"Accountant","Pakistan","All the 8 hours baby, all the 8!",null,{"$error":"#N/A"},null,null,null,null,null,null,null,null,null,null,null,"Brazil",{"$f":"COUNTIF($E$2:$E$1884,T11)","v":17},null,"Misc.",7]
[null,"ID0011",65616.131023916547,"Specialist","Ireland","2 to 3 hours per day",null,{"$error":"#N/A"},null,null,null,null,"Experience","lower","code",null,null,null,null,"Germany",17]
[null,"ID0012",14000,"Engineer","Hungary","4 to 6 hours a day",null,{"$error":"#N/A"},null,null,null,null,"0-2 years",0,"less than 2 years",null,null,null,null,"New Zealand",15]
[null,"ID0013",13338.129598894484,"Analyst","India","All the 8 hours baby, all the 8!",null,{"$error":"#N/A"},null,null,null,null,"2-5",2,"2 - 5 years",null,null,null,null,"Singapore",13]
[null,"ID0014",49000,"Analyst","USA","All the 8 hours baby, all the 8!",null,{"$error":"#N/A"},null,null,null,null,"5-10",5,"5 - 10 years",null,null,null,null,"Philippines",11]
[null,"ID0015",85000,"Engineer","USA","1 or 2 hours a day",null,{"$error":"#N/A"},null,null,null,null,"10+",10,"more than 10 years",null,null,null,null,"Saudi Arabia",11]
[null,"ID0016",75000,"Engineer","USA","All the 8 hours baby, all the 8!",null,{"$error":"#N/A"},null,null,null,null,null,null,null,null,null,null,null,"Mexico",10]
[null,"ID0017",107000,"Manager","Switzerland","4 to 6 hours a day",null,{"$error":"#N/A"},null,null,null,null,null,null,null,null,null,null,null,"Portugal",10]
[null,"ID0018",45000,"Reporting","South Africa","All the 8 hours baby, all the 8!",null,{"$error":"#N/A"},null,null,null,null,null,null,null,null,null,null,null,"Spain",10]
[null,"ID0019",9794.354178093412,"Manager","India","2 to 3 hours per day",null,{"$error":"#N/A"},null,null,null,null,null,null,null,null,null,null,null,"Russia",9]
[null,"ID0020",50000,"Manager","India","1 or 2 hours a day",null,{"$error":"#N/A"},null,null,null,null,null,null,null,null,null,null,null,"Indonesia",8]
[null,"ID0021",13500,"Manager","India","4 to 6 hours a day",null,{"$error":"#N/A"},null,null,null,null,null,null,null,null,null,null,null,"malaysia",7]
[null,"ID0022",96000,"Analyst","USA","2 to 3 hours per day",null,{"$f":"IF(ISBLANK(G23),NA(),VLOOKUP(G23,experienceCode,2,1))","v":{"$error":"#N/A"}},null,null,null,null,null,null,null,null,null,null,null,"Norway",7]
[null,"ID0023",17807.916687442568,"Manager","India","4 to 6 hours a day",null,{"$error":"#N/A"},null,null,null,null,null,null,null,null,null,null,null,"Denmark",6]
[null,"ID0024",75000,"CXO or Top Mgmt.","USA","4 to 6 hours a day",null,{"$error":"#N/A"},null,null,null,null,null,null,null,null,null,null,null,"France",6]
[null,"ID0025",40000,"Manager","USA","2 to 3 hours per day",null,{"$error":"#N/A"},null,null,null,null,null,null,null,null,null,null,null,"italy",6]
[null,"ID0026",60000,"Analyst","USA","All the 8 hours baby, all the 8!",null,{"$error":"#N/A"},null,null,null,null,null,null,null,null,null,null,null,"Poland",6]
[null,"ID0028",41160.941823328096,"Manager","Belgium","4 to 6 hours a day",null,{"$error":"#N/A"},null,null,null,null,null,null,null,null,null,null,null,"Romania",6]
[null,"ID0029",16027.125018698311,"Engineer","India","1 or 2 hours a day",null,{"$error":"#N/A"},null,null,null,null,null,null,null,null,null,null,null,"Colombia",5]
[null,"ID0030",10684.750012465542,"Manager","India","4 to 6 hours a day",null,{"$error":"#N/A"},null,null,null,null,null,null,null,null,null,null,null,"Europe",5]
[null,"ID0031",41000,"Manager","Russia","All the 8 hours baby, all the 8!",null,{"$error":"#N/A"},null,null,null,null,null,null,null,null,null,null,null,"Hungary",5]
[null,"ID0032",6410.8500074793246,"Specialist","India","4 to 6 hours a day",null,{"$error":"#N/A"},null,null,null,null,null,null,null,null,null,null,null,"Ireland",5]
[null,"ID0033",55166.239522354947,"Analyst","UK","All the 8 hours baby, all the 8!",null,{"$error":"#N/A"},null,null,null,null,null,null,null,null,null,null,null,"Israel",5]
[null,"ID0035",19200,"Analyst","Poland","2 to 3 hours per day",null,{"$error":"#N/A"},null,null,null,null,null,null,null,null,null,null,null,"Sri Lanka",{"$f":"COUNTIF($E$2:$E$1884,T34)","v":5}]
[null,"ID0036",8903.9583437212841,"Consultant","India","All the 8 hours baby, all the 8!",null,{"$error":"#N/A"},null,null,null,null,null,null,null,null,null,null,null,"Belgium",4]
[null,"ID0037",150000,"Manager","USA","2 to 3 hours per day",null,{"$error":"#N/A"},null,null,null,null,null,null,null,null,null,null,null,"Dubai",4]
[null,"ID0038",69000,"Engineer","USA","4 to 6 hours a day",null,{"$error":"#N/A"},null,null,null,null,null,null,null,null,null,null,null,"Switzerland",4]
[null,"ID0039",30000,"Consultant","USA","2 to 3 hours per day",null,{"$error":"#N/A"},null,null,null,null,null,null,null,null,null,null,null,"Ukraine",4]
[null,"ID0040",7123.1666749770275,"Manager","India","4 to 6 hours a day",null,{"$error":"#N/A"},null,null,null,null,null,null,null,null,null,null,null,"Brasil",3]
[null,"ID0041",71393.675948184507,"Consultant","Australia","2 to 3 hours per day",null,{"$error":"#N/A"},null,null,null,null,null,null,null,null,null,null,null,"Croatia",3]
[null,"ID0042",14500,"Analyst","India","4 to 6 hours a day",null,{"$error":"#N/A"},null,null,null,null,null,null,null,null,null,null,null,"Finland",3]
[null,"ID0043",68835.306612122877,"Engineer","Canada","2 to 3 hours per day",null,{"$error":"#N/A"},null,null,null,null,null,null,null,null,null,null,null,"Greece",3]
[null,"ID0044",58000,"Accountant","USA","4 to 6 hours a day",null,{"$error":"#N/A"},null,null,null,null,null,null,null,null,null,null,null,"iran",3]
[null,"ID0045",90000,"Misc.","USA","1 or 2 hours a day",null,{"$error":"#N/A"},null,null,null,null,null,null,null,null,null,null,null,"Japan",3]
[null,"ID0046",14246.333349954055,"Manager","India","2 to 3 hours per day",null,{"$error":"#N/A"},null,null,null,null,null,null,null,null,null,null,null,"Kuwait",3]
[null,"ID0047",50437.70470615309,"Analyst","UK","4 to 6 hours a day",null,{"$error":"#N/A"},null,null,null,null,null,null,null,null,null,null,null,"Nigeria",3]
[null,"ID0048",12000,"Consultant","USA","1 or 2 hours a day",null,{"$error":"#N/A"},null,null,null,null,null,null,null,null,null,null,null,"Qatar",3]
[null,"ID0049",57167.974754622352,"Manager","Netherlands","4 to 6 hours a day",null,{"$error":"#N/A"},null,null,null,null,null,null,null,null,null,null,null,"Bangladesh",2]
[null,"ID0050",100000,"Analyst","Germany","All the 8 hours baby, all the 8!",null,{"$error":"#N/A"},null,null,null,null,null,null,null,null,null,null,null,"CEE",2]
[null,"ID0051",57000,"Accountant","USA","2 to 3 hours per day",null,{"$error":"#N/A"},null,null,null,null,null,null,null,null,null,null,null,"china",2]
[null,"ID0052",63047.130882691366,"Accountant","UK","4 to 6 hours a day",null,{"$error":"#N/A"},null,null,null,null,null,null,null,null,null,null,null,"Myanmar",2]
[null,"ID0053",30489.586535798586,"Manager","Germany","All the 8 hours baby, all the 8!",null,{"$error":"#N/A"},null,null,null,null,null,null,null,null,null,null,null,"Panama",2]
[null,"ID0054",4320,"Accountant","India","2 to 3 hours per day",null,{"$error":"#N/A"},null,null,null,null,null,null,null,null,null,null,null,"Sweden",2]
[null,"ID0055",62000,"Analyst","USA","4 to 6 hours a day",null,{"$error":"#N/A"},null,null,null,null,null,null,null,null,null,null,null,"Thailand",2]
[null,"ID0056",7500,"Analyst","India","4 to 6 hours a day",null,{"$error":"#N/A"},null,null,null,null,null,null,null,null,null,null,null,"Turkey",2]
[null,"ID0057",28371.208897211112,"Manager","UK","1 or 2 hours a day",null,{"$error":"#N/A"},null,null,null,null,null,null,null,null,null,null,null,"Zambia",2]
[null,"ID0058",62249.572510588783,"Manager","France","2 to 3 hours per day",null,{"$error":"#N/A"},null,null,null,null,null,null,null,null,null,null,null,"Albania",1]
[null,"ID0059",38000,"Analyst","USA","4 to 6 hours a day",null,{"$error":"#N/A"},null,null,null,null,null,null,null,null,null,null,null,"arabian Gulf",1]
[null,"ID0060",41000,"Specialist","USA","4 to 6 hours a day",null,{"$error":"#N/A"},null,null,null,null,null,null,null,null,null,null,null,"Argentina",1]
[null,"ID0061",68000,"Analyst","USA","All the 8 hours baby, all the 8!",null,{"$error":"#N/A"},null,null,null,null,null,null,null,null,null,null,null,"Armenia",1]
[null,"ID0062",55068.245289698301,"Analyst","Canada","All the 8 hours baby, all the 8!",null,{"$error":"#N/A"},null,null,null,null,null,null,null,null,null,null,null,"Aruba",1]
[null,"ID0063",61000,"Manager","Brasil","All the 8 hours baby, all the 8!",null,{"$error":"#N/A"},null,null,null,null,null,null,null,null,null,null,null,"Asia",1]
[null,"ID0064",54627.175876639136,"Consultant","France","4 to 6 hours a day",null,{"$error":"#N/A"},null,null,null,null,null,null,null,null,null,null,null,"Austria",1]
[null,"ID0065",85000,"Manager","USA","4 to 6 hours a day",null,{"$error":"#N/A"},null,null,null,null,null,null,null,null,null,null,null,"Azerbaijan",1]
[null,"ID0066",48275.178681681093,"Analyst","Netherlands","1 or 2 hours a day",null,{"$error":"#N/A"},null,null,null,null,null,null,null,null,null,null,null,"Baltic",1]
[null,"ID0067",86692.320794224041,"CXO or Top Mgmt.","Australia","4 to 6 hours a day",null,{"$f":"IF(ISBLANK(G66),NA(),VLOOKUP(G66,experienceCode,2,1))","v":{"$error":"#N/A"}},null,null,null,null,null,null,null,null,null,null,null,"Bermuda",{"$f":"COUNTIF($E$2:$E$1884,T66)","v":1}]
[null,"ID0068",85087,"Analyst","USA","2 to 3 hours per day",null,{"$error":"#N/A"},null,null,null,null,null,null,null,null,null,null,null,"Bhutan",1]
[null,"ID0069",50000,"Analyst","USA","All the 8 hours baby, all the 8!",null,{"$error":"#N/A"},null,null,null,null,null,null,null,null,null,null,null,"Bolivia",1]
[null,"ID0070",100000,"Manager","South Africa","4 to 6 hours a day",null,{"$error":"#N/A"},null,null,null,null,null,null,null,null,null,null,null,"Bulgaria",1]
[null,"ID0071",57000,"Analyst","USA","4 to 6 hours a day",null,{"$error":"#N/A"},null,null,null,null,null,null,null,null,null,null,null,"Cambodia",1]
[null,"ID0072",75000,"Manager","USA","All the 8 hours baby, all the 8!",null,{"$error":"#N/A"},null,null,null,null,null,null,null,null,null,null,null,"Central America",1]
[null,"ID0073",101990.96564026357,"Manager","Australia","4 to 6 hours a day",null,{"$error":"#N/A"},null,null,null,null,null,null,null,null,null,null,null,"Costa Rica",1]
[null,"ID0074",33420,"Manager","UAE","All the 8 hours baby, all the 8!",null,{"$error":"#N/A"},null,null,null,null,null,null,null,null,null,null,null,"Czech Republic",1]
[null,"ID0075",58460.842544152933,"Specialist","Canada","All the 8 hours baby, all the 8!",null,{"$error":"#N/A"},null,null,null,null,null,null,null,null,null,null,null,"Dominican Republic",1]
[null,"ID0076",15000,"Consultant","USA","All the 8 hours baby, all the 8!",null,{"$error":"#N/A"},null,null,null,null,null,null,null,null,null,null,null,"Egypt",1]
[null,"ID0077",60000,"Analyst","Canada","1 or 2 hours a day",null,{"$error":"#N/A"},null,null,null,null,null,null,null,null,null,null,null,"Estonia",1]
[null,"ID0078",157617.8272067284,"Analyst","UK","2 to 3 hours per day",null,{"$error":"#N/A"},null,null,null,null,null,null,null,null,null,null,null,"Ethiopia",1]
[null,"ID0079",18000,"Analyst","Saudi Arabia","All the 8 hours baby, all the 8!",null,{"$error":"#N/A"},null,null,null,null,null,null,null,null,null,null,null,"Ghana",1]
[null,"ID0080",50000,"Manager","USA","2 to 3 hours per day",null,{"$error":"#N/A"},null,null,null,null,null,null,null,null,null,null,null,"Guyana",1]
[null,"ID0081",26000,"Analyst","Panama","All the 8 hours baby, all the 8!",null,{"$error":"#N/A"},null,null,null,null,null,null,null,null,null,null,null,"Hong Kong",1]
[null,"ID0082",47285.348162018527,"Manager","UK","4 to 6 hours a day",null,{"$error":"#N/A"},null,null,null,null,null,null,null,null,null,null,null,"Iceland",1]
[null,"ID0083",150000,"CXO or Top Mgmt.","USA","All the 8 hours baby, all the 8!",null,{"$error":"#N/A"},null,null,null,null,null,null,null,null,null,null,null,"Kenya",1]
[null,"ID0084",120000,"Manager","USA","4 to 6 hours a day",null,{"$error":"#N/A"},null,null,null,null,null,null,null,null,null,null,null,"Kuwait ",1]
[null,"ID0085",8903.9583437212841,"Consultant","India","All the 8 hours baby, all the 8!",null,{"$error":"#N/A"},null,null,null,null,null,null,null,null,null,null,null,"Latin America",1]
[null,"ID0086",31330,"Analyst","Brazil","All the 8 hours baby, all the 8!",null,{"$error":"#N/A"},null,null,null,null,null,null,null,null,null,null,null,"Lesotho",1]
[null,"ID0087",110000,"Engineer","USA","2 to 3 hours per day",null,{"$error":"#N/A"},null,null,null,null,null,null,null,null,null,null,null,"Libya",1]
[null,"ID0088",81000,"Consultant","UK","4 to 6 hours a day",null,{"$error":"#N/A"},null,null,null,null,null,null,null,null,null,null,null,"Lithuania",1]
[null,"ID0089",40000,"Analyst","USA","4 to 6 hours a day",null,{"$error":"#N/A"},null,null,null,null,null,null,null,null,null,null,null,"Mauritius",1]
[null,"ID0090",41301.183967273726,"Analyst","Canada","4 to 6 hours a day",null,{"$error":"#N/A"},null,null,null,null,null,null,null,null,null,null,null,"Mongolia",1]
[null,"ID0091",125000,"CXO or Top Mgmt.","USA","4 to 6 hours a day",null,{"$error":"#N/A"},null,null,null,null,null,null,null,null,null,null,null,"Montenegro",1]
[null,"ID0092",36000,"Manager","USA","2 to 3 hours per day",null,{"$error":"#N/A"},null,null,null,null,null,null,null,null,null,null,null,"Morocco",1]
[null,"ID0093",2564.3400029917298,"Consultant","India","1 or 2 hours a day",null,{"$error":"#N/A"},null,null,null,null,null,null,null,null,null,null,null,"mozambique",1]
[null,"ID0094",75000,"Analyst","USA","1 or 2 hours a day",null,{"$error":"#N/A"},null,null,null,null,null,null,null,null,null,null,null,"MYS",1]
[null,"ID0095",95000,"CXO or Top Mgmt.","USA","4 to 6 hours a day",null,{"$error":"#N/A"},null,null,null,null,null,null,null,null,null,null,null,"Oman",1]
[null,"ID0096",24000,"Manager","USA","2 to 3 hours per day",null,{"$error":"#N/A"},null,null,null,null,null,null,null,null,null,null,null,"Paraguay",1]
[null,"ID0097",91000,"Manager","USA","1 or 2 hours a day",null,{"$error":"#N/A"},null,null,null,null,null,null,null,null,null,null,null,"Peru",1]
[null,"ID0098",40000,"Analyst","USA","4 to 6 hours a day",null,{"$error":"#N/A"},null,null,null,null,null,null,null,null,null,null,null,"Republic of Georgia",1]
[null,"ID0099",57000,"Manager","USA","4 to 6 hours a day",null,{"$error":"#N/A"},null,null,null,null,null,null,null,null,null,null,null,"Republica Dominicana",{"$f":"COUNTIF($E$2:$E$1884,T98)","v":1}]
[null,"ID0100",74000,"Consultant","USA","4 to 6 hours a day",null,{"$error":"#N/A"},null,null,null,null,null,null,null,null,null,null,null,"self-employed",1]
[null,"ID0101",80000,"Analyst","USA","4 to 6 hours a day",null,{"$error":"#N/A"},null,null,null,null,null,null,null,null,null,null,null,"Slovakia",1]
[null,"ID0102",90000,"Specialist","USA","4 to 6 hours a day",null,{"$error":"#N/A"},null,null,null,null,null,null,null,null,null,null,null,"Slovenia",1]
[null,"ID0103",21000,"Analyst","arabian Gulf","1 or 2 hours a day",null,{"$error":"#N/A"},null,null,null,null,null,null,null,null,null,null,null,"Somalia",1]
[null,"ID0104",52000,"Manager","USA","4 to 6 hours a day",null,{"$error":"#N/A"},null,null,null,null,null,null,null,null,null,null,null,"Tunisia",1]
[null,"ID0105",19200,"Analyst","Mexico","4 to 6 hours a day",null,{"$error":"#N/A"},null,null,null,null,null,null,null,null,null,null,null,"Uganda",1]
[null,"ID0106",36000,"Analyst","USA","4 to 6 hours a day",null,{"$error":"#N/A"},null,null,null,null,null,null,null,null,null,null,null,"Uruguay",1]
[null,"ID0107",57400,"Analyst","USA","4 to 6 hours a day",null,{"$error":"#N/A"},null,null,null,null,null,null,null,null,null,null,null,"Viet Nam",1]
[null,"ID0108",66000,"Analyst","USA","2 to 3 hours per day",null,{"$error":"#N/A"},null,null,null,null,null,null,null,null,null,null,null,"Vietnam",1]
[null,"ID0109",44463.980364706273,"Manager","Greece","4 to 6 hours a day",null,{"$error":"#N/A"},null,null,null,null,null,null,null,null,null,null,null,"Zimbabwe",1]
[null,"ID0111",85000,"Analyst","USA","4 to 6 hours a day",null,{"$error":"#N/A"}]
[null,"ID0112",50000,"Specialist","USA","4 to 6 hours a day",null,{"$error":"#N/A"}]
[null,"ID0113",58000,"Manager","USA","4 to 6 hours a day",null,{"$error":"#N/A"}]
[null,"ID0114",37900,"Accountant","USA","All the 8 hours baby, all the 8!",null,{"$error":"#N/A"}]
[null,"ID0115",48000,"Manager","UAE","2 to 3 hours per day",null,{"$error":"#N/A"}]
[null,"ID0116",67000,"Analyst","USA","4 to 6 hours a day",null,{"$error":"#N/A"}]
[null,"ID0117",85000,"Controller","UAE","4 to 6 hours a day",null,{"$error":"#N/A"}]
[null,"ID0118",56160,"Analyst","USA","4 to 6 hours a day",null,{"$error":"#N/A"}]
[null,"ID0119",24000,"Manager","Colombia","All the 8 hours baby, all the 8!",null,{"$error":"#N/A"}]
[null,"ID0120",52000,"Analyst","USA","Excel ?!? What Excel?",null,{"$error":"#N/A"}]
[null,"ID0121",59001.691381819612,"Analyst","Canada","Excel ?!? What Excel?",null,{"$error":"#N/A"}]
[null,"ID0122",70000,"Accountant","USA","All the 8 hours baby, all the 8!",null,{"$error":"#N/A"}]
[null,"ID0123",50000,"Specialist","USA","4 to 6 hours a day",null,{"$error":"#N/A"}]
[null,"ID0124",40958.208381117904,"Analyst","India","1 or 2 hours a day",null,{"$error":"#N/A"}]
[null,"ID0125",80000,"Analyst","USA","4 to 6 hours a day",null,{"$error":"#N/A"}]
[null,"ID0126",128000,"Manager","USA","All the 8 hours baby, all the 8!",null,{"$error":"#N/A"}]
[null,"ID0127",44000,"Manager","USA","1 or 2 hours a day",null,{"$error":"#N/A"}]
[null,"ID0128",65000,"Accountant","USA","All the 8 hours baby, all the 8!",null,{"$error":"#N/A"}]
[null,"ID0129",36000,"Accountant","Turkey","4 to 6 hours a day",null,{"$error":"#N/A"}]
[null,"ID0130",12000,"Consultant","Pakistan","1 or 2 hours a day",null,{"$error":"#N/A"}]
[null,"ID0131",44383.603963142654,"Analyst","UK","All the 8 hours baby, all the 8!",null,{"$error":"#N/A"}]
[null,"ID0132",45000,"Analyst","USA","4 to 6 hours a day",null,{"$f":"IF(ISBLANK(G130),NA(),VLOOKUP(G130,experienceCode,2,1))","v":{"$error":"#N/A"}}]
[null,"ID0133",54000,"Analyst","USA","2 to 3 hours per day",null,{"$error":"#N/A"}]
[null,"ID0134",110332.47904470989,"Manager","UK","2 to 3 hours per day",null,{"$error":"#N/A"}]
[null,"ID0135",71000,"Analyst","USA","4 to 6 hours a day",null,{"$error":"#N/A"}]
[null,"ID0136",14246.333349954055,"Manager","India","2 to 3 hours per day",null,{"$error":"#N/A"}]
[null,"ID0137",68835.306612122877,"Manager","Canada","4 to 6 hours a day",null,{"$error":"#N/A"}]
[null,"ID0138",49168.076151516347,"Manager","Canada","4 to 6 hours a day",null,{"$error":"#N/A"}]
[null,"ID0139",40000,"Analyst","USA","4 to 6 hours a day",null,{"$error":"#N/A"}]
[null,"ID0140",60968.414427880263,"Analyst","Canada","2 to 3 hours per day",null,{"$error":"#N/A"}]
[null,"ID0141",5983.4600069807029,"Reporting","India","4 to 6 hours a day",null,{"$error":"#N/A"}]
[null,"ID0142",53000,"Analyst","USA","4 to 6 hours a day",null,{"$error":"#N/A"}]
[null,"ID0143",104000,"CXO or Top Mgmt.","USA","2 to 3 hours per day",null,{"$error":"#N/A"}]
[null,"ID0144",57000,"Engineer","USA","4 to 6 hours a day",null,{"$error":"#N/A"}]
[null,"ID0145",45000,"Analyst","USA","2 to 3 hours per day",null,{"$error":"#N/A"}]
[null,"ID0146",92000,"Analyst","USA","4 to 6 hours a day",null,{"$error":"#N/A"}]
[null,"ID0147",88000,"Manager","USA","4 to 6 hours a day",null,{"$error":"#N/A"}]
[null,"ID0148",80000,"Analyst","USA","2 to 3 hours per day",null,{"$error":"#N/A"}]
[null,"ID0149",69000,"Consultant","USA","4 to 6 hours a day",null,{"$error":"#N/A"}]
[null,"ID0150",50000,"Analyst","Mexico","All the 8 hours baby, all the 8!",null,{"$error":"#N/A"}]
[null,"ID0151",35000,"Manager","USA","2 to 3 hours per day",null,{"$error":"#N/A"}]
[null,"ID0152",96000,"Analyst","USA","4 to 6 hours a day",null,{"$error":"#N/A"}]
[null,"ID0153",65000,"Accountant","USA","All the 8 hours baby, all the 8!",null,{"$error":"#N/A"}]
[null,"ID0154",37440,"Analyst","USA","All the 8 hours baby, all the 8!",null,{"$error":"#N/A"}]
[null,"ID0155",15500,"Accountant","Mexico","All the 8 hours baby, all the 8!",null,{"$error":"#N/A"}]
[null,"ID0156",90000,"Analyst","USA","2 to 3 hours per day",null,{"$error":"#N/A"}]
[null,"ID0157",66500,"Analyst","USA","All the 8 hours baby, all the 8!",null,{"$error":"#N/A"}]
[null,"ID0158",100000,"Accountant","USA","All the 8 hours baby, all the 8!",null,{"$error":"#N/A"}]
[null,"ID0159",50831.74927416991,"Manager","UK","4 to 6 hours a day",null,{"$error":"#N/A"}]
[null,"ID0160",7479.3250087258784,"Manager","India","1 or 2 hours a day",null,{"$error":"#N/A"}]
[null,"ID0161",75000,"Analyst","USA","1 or 2 hours a day",null,{"$error":"#N/A"}]
[null,"ID0162",58000,"Manager","Canada","1 or 2 hours a day",null,{"$error":"#N/A"}]
[null,"ID0163",55000,"Manager","USA","2 to 3 hours per day",null,{"$error":"#N/A"}]
[null,"ID0164",60000,"Analyst","USA","4 to 6 hours a day",null,{"$error":"#N/A"}]
[null,"ID0165",23150.291693675339,"Manager","India","4 to 6 hours a day",null,{"$error":"#N/A"}]
[null,"ID0166",105219.68296424497,"Manager","Canada","2 to 3 hours per day",null,{"$error":"#N/A"}]
[null,"ID0167",145000,"Controller","Switzerland","All the 8 hours baby, all the 8!",null,{"$error":"#N/A"}]
[null,"ID0168",22880,"Accountant","USA","4 to 6 hours a day",null,{"$error":"#N/A"}]
[null,"ID0169",80000,"Consultant","USA","4 to 6 hours a day",null,{"$error":"#N/A"}]
[null,"ID0170",8903.9583437212841,"Analyst","India","2 to 3 hours per day",null,{"$error":"#N/A"}]
[null,"ID0171",88502.537072729421,"Analyst","Canada","4 to 6 hours a day",null,{"$error":"#N/A"}]
[null,"ID0172",3205.4250037396623,"Analyst","India","4 to 6 hours a day",null,{"$error":"#N/A"}]
[null,"ID0173",46584,"Analyst","USA","4 to 6 hours a day",null,{"$error":"#N/A"}]
[null,"ID0174",67000,"Analyst","USA","4 to 6 hours a day",null,{"$error":"#N/A"}]
[null,"ID0175",19588.708356186824,"Manager","India","4 to 6 hours a day",null,{"$error":"#N/A"}]
[null,"ID0176",92000,"Engineer","USA","4 to 6 hours a day",null,{"$error":"#N/A"}]
[null,"ID0177",75000,"Specialist","USA","All the 8 hours baby, all the 8!",null,{"$error":"#N/A"}]
[null,"ID0178",3205.4250037396623,"Analyst","India","4 to 6 hours a day",null,{"$error":"#N/A"}]
[null,"ID0179",29159.298033244755,"Manager","UK","All the 8 hours baby, all the 8!",null,{"$error":"#N/A"}]
[null,"ID0180",40000,"Analyst","USA","All the 8 hours baby, all the 8!",null,{"$error":"#N/A"}]
[null,"ID0181",111680,"Analyst","USA","2 to 3 hours per day",null,{"$error":"#N/A"}]
[null,"ID0182",41406,"Analyst","Canada","1 or 2 hours a day",null,{"$error":"#N/A"}]
[null,"ID0183",70000,"Manager","USA","4 to 6 hours a day",null,{"$error":"#N/A"}]
[null,"ID0184",40700,"Analyst","USA","1 or 2 hours a day",null,{"$error":"#N/A"}]
[null,"ID0185",40000,"Analyst","USA","4 to 6 hours a day",null,{"$error":"#N/A"}]
[null,"ID0186",60000,"Accountant","USA","4 to 6 hours a day",null,{"$error":"#N/A"}]
[null,"ID0187",90469.260118790073,"Consultant","Canada","All the 8 hours baby, all the 8!",null,{"$error":"#N/A"}]
[null,"ID0188",13636,"Manager","India","All the 8 hours baby, all the 8!",null,{"$error":"#N/A"}]
[null,"ID0189",80000,"Manager","USA","2 to 3 hours per day",null,{"$error":"#N/A"}]
[null,"ID0190",59001.691381819612,"Analyst","Canada","2 to 3 hours per day",null,{"$error":"#N/A"}]
[null,"ID0192",28000,"Analyst","USA","4 to 6 hours a day",null,{"$error":"#N/A"}]
[null,"ID0193",60000,"Analyst","USA","4 to 6 hours a day",null,{"$error":"#N/A"}]
[null,"ID0194",96000,"Specialist","USA","2 to 3 hours per day",null,{"$error":"#N/A"}]
[null,"ID0195",67000,"Analyst","USA","4 to 6 hours a day",null,{"$error":"#N/A"}]
[null,"ID0196",70000,"Analyst","USA","4 to 6 hours a day",null,{"$error":"#N/A"}]
[null,"ID0197",4149.2445881741187,"Manager","India","All the 8 hours baby, all the 8!",null,{"$f":"IF(ISBLANK(G194),NA(),VLOOKUP(G194,experienceCode,2,1))","v":{"$error":"#N/A"}}]
[null,"ID0198",99000,"Controller","USA","4 to 6 hours a day",null,{"$error":"#N/A"}]
[null,"ID0200",90000,"Manager","USA","2 to 3 hours per day",null,{"$error":"#N/A"}]
[null,"ID0201",4897.177089046706,"Analyst","India","2 to 3 hours per day",null,{"$error":"#N/A"}]
[null,"ID0202",3419.1200039889732,"Analyst","India","All the 8 hours baby, all the 8!",null,{"$error":"#N/A"}]
[null,"ID0203",51000,"Manager","USA","4 to 6 hours a day",null,{"$error":"#N/A"}]
[null,"ID0204",100000,"Manager","USA","All the 8 hours baby, all the 8!",null,{"$error":"#N/A"}]
[null,"ID0205",32054.250037396621,"Manager","India","1 or 2 hours a day",null,{"$error":"#N/A"}]
[null,"ID0207",47285.348162018527,"Analyst","UK","2 to 3 hours per day",null,{"$error":"#N/A"}]
[null,"ID0208",63519.971949580387,"Analyst","Ireland","4 to 6 hours a day",null,{"$error":"#N/A"}]
[null,"ID0209",108160,"Analyst","USA","4 to 6 hours a day",null,{"$error":"#N/A"}]
[null,"ID0210",50000,"Manager","USA","4 to 6 hours a day",null,{"$error":"#N/A"}]
[null,"ID0211",400000,"Manager","USA","1 or 2 hours a day",null,{"$error":"#N/A"}]
[null,"ID0212",43000,"Analyst","USA","All the 8 hours baby, all the 8!",null,{"$error":"#N/A"}]
[null,"ID0213",27000,"Analyst","Singapore","All the 8 hours baby, all the 8!",null,{"$error":"#N/A"}]
[null,"ID0214",41000,"Manager","USA","All the 8 hours baby, all the 8!",null,{"$error":"#N/A"}]
[null,"ID0215",100000,"CXO or Top Mgmt.","USA","4 to 6 hours a day",null,{"$error":"#N/A"}]
[null,"ID0216",42140,"Analyst","USA","4 to 6 hours a day",null,{"$error":"#N/A"}]
[null,"ID0217",80000,"Analyst","USA","4 to 6 hours a day",null,{"$error":"#N/A"}]
[null,"ID0218",41600,"Manager","USA","4 to 6 hours a day",null,{"$error":"#N/A"}]
[null,"ID0219",45000,"Accountant","USA","2 to 3 hours per day",null,{"$error":"#N/A"}]
[null,"ID0220",78000,"Accountant","Bermuda","4 to 6 hours a day",null,{"$error":"#N/A"}]
[null,"ID0221",8903.9583437212841,"Manager","India","4 to 6 hours a day",null,{"$error":"#N/A"}]
[null,"ID0222",6232.7708406048987,"Accountant","India","4 to 6 hours a day",null,{"$error":"#N/A"}]
[null,"ID0223",72500,"Controller","USA","4 to 6 hours a day",null,{"$error":"#N/A"}]
[null,"ID0224",138000,"Engineer","Thailand","4 to 6 hours a day",null,{"$error":"#N/A"}]
[null,"ID0225",8547.8000099724322,"Manager","India","4 to 6 hours a day",null,{"$error":"#N/A"}]
[null,"ID0226",80000,"Analyst","USA","4 to 6 hours a day",null,{"$error":"#N/A"}]
[null,"ID0227",50000,"Manager","USA","4 to 6 hours a day",null,{"$error":"#N/A"}]
[null,"ID0228",44251.268536364711,"Specialist","Canada","1 or 2 hours a day",null,{"$error":"#N/A"}]
[null,"ID0229",67775.665698893223,"Manager","UK","2 to 3 hours per day",null,{"$error":"#N/A"}]
[null,"ID0230",3561.5833374885137,"Analyst","India","1 or 2 hours a day",null,{"$error":"#N/A"}]
[null,"ID0231",65000,"Specialist","USA","2 to 3 hours per day",null,{"$error":"#N/A"}]
[null,"ID0232",114000,"CXO or Top Mgmt.","USA","2 to 3 hours per day",null,{"$error":"#N/A"}]
[null,"ID0233",95000,"CXO or Top Mgmt.","USA","4 to 6 hours a day",null,{"$error":"#N/A"}]
[null,"ID0234",52500,"Analyst","USA","4 to 6 hours a day",null,{"$error":"#N/A"}]
[null,"ID0235",70928.022243027779,"Manager","UK","2 to 3 hours per day",null,{"$error":"#N/A"}]
[null,"ID0236",60000,"Analyst","USA","4 to 6 hours a day",null,{"$error":"#N/A"}]
[null,"ID0237",65250,"Accountant","USA","4 to 6 hours a day",null,{"$error":"#N/A"}]
[null,"ID0238",21369.500024931083,"Manager","India","2 to 3 hours per day",null,{"$error":"#N/A"}]
[null,"ID0239",98336.152303032693,"Manager","Canada","2 to 3 hours per day",null,{"$error":"#N/A"}]
[null,"ID0240",15244.793267899293,"Specialist","Portugal","All the 8 hours baby, all the 8!",null,{"$error":"#N/A"}]
[null,"ID0241",73000,"Analyst","USA","4 to 6 hours a day",null,{"$error":"#N/A"}]
[null,"ID0242",50000,"Analyst","USA","All the 8 hours baby, all the 8!",null,{"$error":"#N/A"}]
[null,"ID0243",79000,"Accountant","USA","2 to 3 hours per day",null,{"$error":"#N/A"}]
[null,"ID0244",90000,"Manager","USA","4 to 6 hours a day",null,{"$error":"#N/A"}]
[null,"ID0245",70000,"Manager","USA","2 to 3 hours per day",null,{"$error":"#N/A"}]
[null,"ID0246",63918.498996971248,"Manager","Canada","4 to 6 hours a day",null,{"$error":"#N/A"}]
[null,"ID0247",80000,"Analyst","USA","4 to 6 hours a day",null,{"$error":"#N/A"}]
[null,"ID0248",140000,"Manager","USA","4 to 6 hours a day",null,{"$error":"#N/A"}]
[null,"ID0249",96000,"Consultant","Poland","2 to 3 hours per day",null,{"$error":"#N/A"}]
[null,"ID0250",20000,"Manager","India","4 to 6 hours a day",null,{"$error":"#N/A"}]
[null,"ID0251",47700,"Analyst","USA","4 to 6 hours a day",null,{"$error":"#N/A"}]
[null,"ID0252",25000,"Manager","India","1 or 2 hours a day",null,{"$error":"#N/A"}]
[null,"ID0253",52500,"Analyst","USA","4 to 6 hours a day",null,{"$error":"#N/A"}]
[null,"ID0254",40000,"Analyst","USA","All the 8 hours baby, all the 8!",null,{"$error":"#N/A"}]
[null,"ID0255",31000,"Analyst","USA","4 to 6 hours a day",null,{"$error":"#N/A"}]
[null,"ID0256",83033.071372504521,"Consultant","UK","All the 8 hours baby, all the 8!",null,{"$error":"#N/A"}]
[null,"ID0257",130000,"Manager","USA","4 to 6 hours a day",null,{"$error":"#N/A"}]
[null,"ID0258",8369.7208430980063,"Analyst","India","All the 8 hours baby, all the 8!",null,{"$error":"#N/A"}]
[null,"ID0259",51000,"Analyst","USA","2 to 3 hours per day",null,{"$error":"#N/A"}]
[null,"ID0260",94570.696324037053,"Analyst","UK","All the 8 hours baby, all the 8!",null,{"$error":"#N/A"}]
[null,"ID0261",34191.200039889729,"Manager","India","2 to 3 hours per day",null,{"$error":"#N/A"}]
[null,"ID0262",44132.991617883956,"Analyst","UK","All the 8 hours baby, all the 8!",null,{"$error":"#N/A"}]
[null,"ID0263",73000,"Specialist","USA","4 to 6 hours a day",null,{"$f":"IF(ISBLANK(G258),NA(),VLOOKUP(G258,experienceCode,2,1))","v":{"$error":"#N/A"}}]
[null,"ID0264",62400,"Accountant","USA","All the 8 hours baby, all the 8!",null,{"$error":"#N/A"}]
[null,"ID0265",27600,"Consultant","Singapore","All the 8 hours baby, all the 8!",null,{"$error":"#N/A"}]
[null,"ID0266",54000,"Manager","USA","All the 8 hours baby, all the 8!",null,{"$error":"#N/A"}]
[null,"ID0267",4914.9850057341491,"Analyst","India","All the 8 hours baby, all the 8!",null,{"$error":"#N/A"}]
[null,"ID0268",77000,"Accountant","USA","4 to 6 hours a day",null,{"$error":"#N/A"}]
[null,"ID0269",76000,"Manager","USA","All the 8 hours baby, all the 8!",null,{"$error":"#N/A"}]
[null,"ID0270",103000,"CXO or Top Mgmt.","USA","2 to 3 hours per day",null,{"$error":"#N/A"}]
[null,"ID0271",7600,"Specialist","Ukraine","1 or 2 hours a day",null,{"$error":"#N/A"}]
[null,"ID0272",40000,"Analyst","USA","4 to 6 hours a day",null,{"$error":"#N/A"}]
[null,"ID0273",80000,"CXO or Top Mgmt.","USA","2 to 3 hours per day",null,{"$error":"#N/A"}]
[null,"ID0274",55000,"Analyst","USA","All the 8 hours baby, all the 8!",null,{"$error":"#N/A"}]
[null,"ID0275",99000,"Analyst","USA","2 to 3 hours per day",null,{"$error":"#N/A"}]
[null,"ID0276",9956.1219482708348,"Manager","Philippines","4 to 6 hours a day",null,{"$error":"#N/A"}]
[null,"ID0277",75000,"Analyst","USA","4 to 6 hours a day",null,{"$error":"#N/A"}]
[null,"ID0278",80000,"Manager","USA","2 to 3 hours per day",null,{"$error":"#N/A"}]
[null,"ID0279",20000,"Analyst","India","All the 8 hours baby, all the 8!",null,{"$error":"#N/A"}]
[null,"ID0280",40000,"Analyst","USA","All the 8 hours baby, all the 8!",null,{"$error":"#N/A"}]
[null,"ID0281",46000,"Analyst","USA","All the 8 hours baby, all the 8!",null,{"$error":"#N/A"}]
[null,"ID0282",14000,"Analyst","Brazil","1 or 2 hours a day",null,{"$error":"#N/A"}]
[null,"ID0283",70000,"Engineer","USA","All the 8 hours baby, all the 8!",null,{"$error":"#N/A"}]
[null,"ID0284",36000,"Specialist","Russia","4 to 6 hours a day",null,{"$error":"#N/A"}]
[null,"ID0285",15000,"Manager","USA","2 to 3 hours per day",null,{"$error":"#N/A"}]
[null,"ID0286",26711.875031163851,"Consultant","India","All the 8 hours baby, all the 8!",null,{"$error":"#N/A"}]
[null,"ID0287",27221.92126875931,"Accountant","Dubai","4 to 6 hours a day",null,{"$error":"#N/A"}]
[null,"ID0288",22000,"Reporting","India","All the 8 hours baby, all the 8!",null,{"$error":"#N/A"}]
[null,"ID0289",68000,"Manager","USA","All the 8 hours baby, all the 8!",null,{"$error":"#N/A"}]
[null,"ID0290",97000,"Analyst","USA","All the 8 hours baby, all the 8!",null,{"$error":"#N/A"}]
[null,"ID0291",48861.526434085805,"Engineer","UK","2 to 3 hours per day",null,{"$error":"#N/A"}]
[null,"ID0292",65000,"Analyst","USA","4 to 6 hours a day",null,{"$error":"#N/A"}]
[null,"ID0293",43200,"Manager","Saudi Arabia","4 to 6 hours a day",null,{"$error":"#N/A"}]
[null,"ID0294",8013.5625093491553,"Analyst","India","4 to 6 hours a day",null,{"$error":"#N/A"}]
[null,"ID0295",50000,"Analyst","USA","All the 8 hours baby, all the 8!",null,{"$error":"#N/A"}]
[null,"ID0296",45000,"Analyst","USA","4 to 6 hours a day",null,{"$error":"#N/A"}]
[null,"ID0297",3205.4250037396623,"Manager","India","4 to 6 hours a day",null,{"$error":"#N/A"}]
[null,"ID0298",60000,"Manager","USA","All the 8 hours baby, all the 8!",null,{"$error":"#N/A"}]
[null,"ID0299",31000,"Specialist","USA","2 to 3 hours per day",null,{"$error":"#N/A"}]
[null,"ID0300",75000,"Analyst","USA","4 to 6 hours a day",null,{"$error":"#N/A"}]
[null,"ID0301",16000,"CXO or Top Mgmt.","USA","1 or 2 hours a day",null,{"$error":"#N/A"}]
[null,"ID0302",36000,"Analyst","USA","All the 8 hours baby, all the 8!",null,{"$error":"#N/A"}]
[null,"ID0303",41301.183967273726,"Analyst","Canada","All the 8 hours baby, all the 8!",null,{"$error":"#N/A"}]
[null,"ID0304",53000,"Analyst","USA","4 to 6 hours a day",null,{"$error":"#N/A"}]
[null,"ID0305",82575.963534454509,"Controller","Germany","All the 8 hours baby, all the 8!",null,{"$error":"#N/A"}]
[null,"ID0306",67000,"Analyst","USA","4 to 6 hours a day",null,{"$error":"#N/A"}]
[null,"ID0307",12000,"Analyst","India","All the 8 hours baby, all the 8!",null,{"$error":"#N/A"}]
[null,"ID0308",85000,"Controller","USA","All the 8 hours baby, all the 8!",null,{"$error":"#N/A"}]
[null,"ID0309",254079.88779832155,"Reporting","Netherlands","All the 8 hours baby, all the 8!",null,{"$error":"#N/A"}]
[null,"ID0310",40000,"Manager","USA","4 to 6 hours a day",null,{"$error":"#N/A"}]
[null,"ID0311",31523.565441345683,"Engineer","UK","1 or 2 hours a day",null,{"$error":"#N/A"}]
[null,"ID0312",41000,"Analyst","USA","4 to 6 hours a day",null,{"$error":"#N/A"}]
[null,"ID0313",24931.083362419595,"Manager","India","1 or 2 hours a day",null,{"$error":"#N/A"}]
[null,"ID0314",125000,"Manager","USA","4 to 6 hours a day",null,{"$error":"#N/A"}]
[null,"ID0315",59001.691381819612,"Analyst","Canada","All the 8 hours baby, all the 8!",null,{"$error":"#N/A"}]
[null,"ID0316",10956.982885192734,"Analyst","Mexico","All the 8 hours baby, all the 8!",null,{"$error":"#N/A"}]
[null,"ID0317",70000,"Analyst","USA","2 to 3 hours per day",null,{"$error":"#N/A"}]
[null,"ID0318",400000,"Specialist","USA","All the 8 hours baby, all the 8!",null,{"$error":"#N/A"}]
[null,"ID0319",55000,"Analyst","USA","4 to 6 hours a day",null,{"$error":"#N/A"}]
[null,"ID0320",60000,"Analyst","USA","4 to 6 hours a day",null,{"$error":"#N/A"}]
[null,"ID0321",17807.916687442568,"Manager","India","4 to 6 hours a day",null,{"$error":"#N/A"}]
[null,"ID0322",40000,"Manager","Hungary","4 to 6 hours a day",null,{"$error":"#N/A"}]
[null,"ID0323",137500,"Analyst","USA","4 to 6 hours a day",null,{"$error":"#N/A"}]
[null,"ID0324",4545,"Analyst","Brasil","All the 8 hours baby, all the 8!",null,{"$error":"#N/A"}]
[null,"ID0325",45709.169889951241,"Analyst","UK","4 to 6 hours a day",null,{"$error":"#N/A"}]
[null,"ID0326",47000,"Specialist","USA","4 to 6 hours a day",null,{"$error":"#N/A"}]
[null,"ID0327",65000,"Analyst","USA","All the 8 hours baby, all the 8!",null,{"$f":"IF(ISBLANK(G322),NA(),VLOOKUP(G322,experienceCode,2,1))","v":{"$error":"#N/A"}}]
[null,"ID0328",10809.503829551191,"Reporting","Philippines","4 to 6 hours a day",null,{"$error":"#N/A"}]
[null,"ID0329",92000,"Manager","USA","4 to 6 hours a day",null,{"$error":"#N/A"}]
[null,"ID0330",22000,"Manager","Mexico","4 to 6 hours a day",null,{"$error":"#N/A"}]
[null,"ID0331",108000,"Manager","USA","2 to 3 hours per day",null,{"$error":"#N/A"}]
[null,"ID0332",61000,"Analyst","USA","1 or 2 hours a day",null,{"$error":"#N/A"}]
[null,"ID0333",63918.498996971248,"Manager","Canada","2 to 3 hours per day",null,{"$error":"#N/A"}]
[null,"ID0334",50000,"Analyst","USA","All the 8 hours baby, all the 8!",null,{"$error":"#N/A"}]
[null,"ID0335",150000,"Accountant","USA","All the 8 hours baby, all the 8!",null,{"$error":"#N/A"}]
[null,"ID0336",7123.1666749770275,"Analyst","India","4 to 6 hours a day",null,{"$error":"#N/A"}]
[null,"ID0337",150000,"Manager","Israel","4 to 6 hours a day",null,{"$error":"#N/A"}]
[null,"ID0338",45000,"Specialist","USA","4 to 6 hours a day",null,{"$error":"#N/A"}]
[null,"ID0339",135000,"Manager","USA","All the 8 hours baby, all the 8!",null,{"$error":"#N/A"}]
[null,"ID0340",6410.8500074793246,"Analyst","India","2 to 3 hours per day",null,{"$error":"#N/A"}]
[null,"ID0341",29000,"Manager","USA","4 to 6 hours a day",null,{"$error":"#N/A"}]
[null,"ID0342",13000,"Manager","India","All the 8 hours baby, all the 8!",null,{"$error":"#N/A"}]
[null,"ID0343",63000,"Analyst","USA","All the 8 hours baby, all the 8!",null,{"$error":"#N/A"}]
[null,"ID0344",95000,"Analyst","USA","4 to 6 hours a day",null,{"$error":"#N/A"}]
[null,"ID0346",100000,"Analyst","UK","4 to 6 hours a day",null,{"$error":"#N/A"}]
[null,"ID0347",3800,"Reporting","India","4 to 6 hours a day",null,{"$error":"#N/A"}]
[null,"ID0348",11400,"Consultant","Brazil","4 to 6 hours a day",null,{"$error":"#N/A"}]
[null,"ID0349",55068.245289698301,"Analyst","Canada","4 to 6 hours a day",null,{"$error":"#N/A"}]
[null,"ID0350",53000,"Manager","USA","2 to 3 hours per day",null,{"$error":"#N/A"}]
[null,"ID0351",130000,"Engineer","USA","4 to 6 hours a day",null,{"$error":"#N/A"}]
[null,"ID0352",6588.9291743537506,"Analyst","India","All the 8 hours baby, all the 8!",null,{"$error":"#N/A"}]
[null,"ID0353",157337.8436848523,"Consultant","Canada","2 to 3 hours per day",null,{"$error":"#N/A"}]
[null,"ID0354",44200,"Analyst","USA","All the 8 hours baby, all the 8!",null,{"$error":"#N/A"}]
[null,"ID0355",56000,"Manager","USA","2 to 3 hours per day",null,{"$error":"#N/A"}]
[null,"ID0356",72500,"Engineer","USA","2 to 3 hours per day",null,{"$error":"#N/A"}]
[null,"ID0357",73752.11422727452,"Analyst","Canada","4 to 6 hours a day",null,{"$error":"#N/A"}]
[null,"ID0358",170000,"Analyst","UK","Excel ?!? What Excel?",null,{"$error":"#N/A"}]
[null,"ID0359",68000,"Manager","USA","2 to 3 hours per day",null,{"$error":"#N/A"}]
[null,"ID0360",75000,"Analyst","USA","All the 8 hours baby, all the 8!",null,{"$error":"#N/A"}]
[null,"ID0361",62500,"CXO or Top Mgmt.","USA","All the 8 hours baby, all the 8!",null,{"$error":"#N/A"}]
[null,"ID0362",25000,"Manager","India","4 to 6 hours a day",null,{"$error":"#N/A"}]
[null,"ID0363",68954.520184280962,"Consultant","Sweden","1 or 2 hours a day",null,{"$error":"#N/A"}]
[null,"ID0365",85000,"Analyst","USA","4 to 6 hours a day",null,{"$error":"#N/A"}]
[null,"ID0366",67775.665698893223,"Manager","UK","4 to 6 hours a day",null,{"$error":"#N/A"}]
[null,"ID0367",89000,"Manager","USA","4 to 6 hours a day",null,{"$error":"#N/A"}]
[null,"ID0368",35000,"Analyst","Brasil","All the 8 hours baby, all the 8!",null,{"$error":"#N/A"}]
[null,"ID0369",47500,"Manager","USA","All the 8 hours baby, all the 8!",null,{"$error":"#N/A"}]
[null,"ID0370",130000,"Manager","USA","2 to 3 hours per day",null,{"$error":"#N/A"}]
[null,"ID0371",18000,"CXO or Top Mgmt.","India","2 to 3 hours per day",null,{"$error":"#N/A"}]
[null,"ID0372",8547.8000099724322,"Manager","India","1 or 2 hours a day",null,{"$error":"#N/A"}]
[null,"ID0373",41932,"Manager","USA","2 to 3 hours per day",null,{"$error":"#N/A"}]
[null,"ID0374",220700,"Consultant","Brazil","All the 8 hours baby, all the 8!",null,{"$error":"#N/A"}]
[null,"ID0375",194000,"CXO or Top Mgmt.","USA","2 to 3 hours per day",null,{"$error":"#N/A"}]
[null,"ID0376",160271.25018698312,"Analyst","India","4 to 6 hours a day",null,{"$error":"#N/A"}]
[null,"ID0377",8903.9583437212841,"Manager","India","2 to 3 hours per day",null,{"$error":"#N/A"}]
[null,"ID0378",78668.921842426149,"Analyst","Canada","4 to 6 hours a day",null,{"$error":"#N/A"}]
[null,"ID0379",22867.189901848938,"Manager","Portugal","2 to 3 hours per day",null,{"$error":"#N/A"}]
[null,"ID0380",94570.696324037053,"CXO or Top Mgmt.","UK","2 to 3 hours per day",null,{"$error":"#N/A"}]
[null,"ID0381",95000,"Analyst","USA","All the 8 hours baby, all the 8!",null,{"$error":"#N/A"}]
[null,"ID0382",9616.275011218986,"Engineer","India","4 to 6 hours a day",null,{"$error":"#N/A"}]
[null,"ID0383",48000,"Analyst","USA","1 or 2 hours a day",null,{"$error":"#N/A"}]
[null,"ID0384",46000,"Analyst","USA","4 to 6 hours a day",null,{"$error":"#N/A"}]
[null,"ID0385",15000,"Reporting","Ukraine","2 to 3 hours per day",null,{"$error":"#N/A"}]
[null,"ID0386",11040.908346214392,"Manager","India","1 or 2 hours a day",null,{"$error":"#N/A"}]
[null,"ID0387",44132.991617883956,"Manager","UK","2 to 3 hours per day",null,{"$error":"#N/A"}]
[null,"ID0388",47000,"Manager","USA","2 to 3 hours per day",null,{"$error":"#N/A"}]
[null,"ID0389",44000,"Analyst","USA","2 to 3 hours per day",null,{"$error":"#N/A"}]
[null,"ID0390",55000,"Accountant","USA","4 to 6 hours a day",null,{"$error":"#N/A"}]
[null,"ID0391",12000,"Reporting","South Africa","4 to 6 hours a day",null,{"$error":"#N/A"}]
[null,"ID0392",50000,"Manager","USA","2 to 3 hours per day",null,{"$error":"#N/A"}]
[null,"ID0393",13355.937515581925,"Analyst","India","1 or 2 hours a day",null,{"$f":"IF(ISBLANK(G386),NA(),VLOOKUP(G386,experienceCode,2,1))","v":{"$error":"#N/A"}}]
[null,"ID0394",99147,"Specialist","Russia","4 to 6 hours a day",null,{"$error":"#N/A"}]
[null,"ID0395",45880,"Manager","USA","All the 8 hours baby, all the 8!",null,{"$error":"#N/A"}]
[null,"ID0396",70000,"Manager","USA","4 to 6 hours a day",null,{"$error":"#N/A"}]
[null,"ID0397",100000,"Analyst","USA","All the 8 hours baby, all the 8!",null,{"$error":"#N/A"}]
[null,"ID0398",17598.017290051986,"Analyst","Bangladesh","2 to 3 hours per day",null,{"$error":"#N/A"}]
[null,"ID0399",85000,"Engineer","USA","2 to 3 hours per day",null,{"$error":"#N/A"}]
[null,"ID0400",47000,"Manager","USA","4 to 6 hours a day",null,{"$error":"#N/A"}]
[null,"ID0401",40000,"Manager","USA","2 to 3 hours per day",null,{"$error":"#N/A"}]
[null,"ID0402",30000,"CXO or Top Mgmt.","India","2 to 3 hours per day",null,{"$error":"#N/A"}]
[null,"ID0403",70802.029658183528,"Controller","Canada","4 to 6 hours a day",null,{"$error":"#N/A"}]
[null,"ID0404",34000,"Analyst","USA","4 to 6 hours a day",null,{"$error":"#N/A"}]
[null,"ID0405",52000,"Analyst","USA","4 to 6 hours a day",null,{"$error":"#N/A"}]
[null,"ID0406",5342.3750062327708,"Engineer","India","1 or 2 hours a day",null,{"$error":"#N/A"}]
[null,"ID0407",7123.1666749770275,"Analyst","India","4 to 6 hours a day",null,{"$error":"#N/A"}]
[null,"ID0408",63586,"Manager","UAE","2 to 3 hours per day",null,{"$error":"#N/A"}]
[null,"ID0409",55166.239522354947,"Accountant","UK","4 to 6 hours a day",null,{"$error":"#N/A"}]
[null,"ID0410",60000,"Analyst","USA","4 to 6 hours a day",null,{"$error":"#N/A"}]
[null,"ID0411",19200,"Manager","Romania","All the 8 hours baby, all the 8!",null,{"$error":"#N/A"}]
[null,"ID0412",28109.627547434993,"Analyst","Costa Rica","All the 8 hours baby, all the 8!",null,{"$error":"#N/A"}]
[null,"ID0413",56000,"Analyst","USA","4 to 6 hours a day",null,{"$error":"#N/A"}]
[null,"ID0414",52000,"Accountant","USA","4 to 6 hours a day",null,{"$error":"#N/A"}]
[null,"ID0415",51613,"Analyst","USA","All the 8 hours baby, all the 8!",null,{"$error":"#N/A"}]
[null,"ID0416",35000,"Analyst","Russia","4 to 6 hours a day",null,{"$error":"#N/A"}]
[null,"ID0417",56000,"Manager","USA","All the 8 hours baby, all the 8!",null,{"$error":"#N/A"}]
[null,"ID0418",115000,"Consultant","USA","2 to 3 hours per day",null,{"$error":"#N/A"}]
[null,"ID0419",104027.76595644075,"Manager","UK","1 or 2 hours a day",null,{"$error":"#N/A"}]
[null,"ID0420",3561.5833374885137,"Consultant","India","1 or 2 hours a day",null,{"$error":"#N/A"}]
[null,"ID0421",72000,"CXO or Top Mgmt.","USA","4 to 6 hours a day",null,{"$error":"#N/A"}]
[null,"ID0422",90000,"Analyst","USA","All the 8 hours baby, all the 8!",null,{"$error":"#N/A"}]
[null,"ID0423",8500,"Accountant","Romania","2 to 3 hours per day",null,{"$error":"#N/A"}]
[null,"ID0424",12000,"Analyst","iran","2 to 3 hours per day",null,{"$error":"#N/A"}]
[null,"ID0425",250000,"Consultant","USA","All the 8 hours baby, all the 8!",null,{"$error":"#N/A"}]
[null,"ID0426",89944.280280605832,"Analyst","Finland","All the 8 hours baby, all the 8!",null,{"$error":"#N/A"}]
[null,"ID0427",4273.9000049862161,"Manager","India","All the 8 hours baby, all the 8!",null,{"$error":"#N/A"}]
[null,"ID0428",30000,"Manager","USA","2 to 3 hours per day",null,{"$error":"#N/A"}]
[null,"ID0429",30000,"Reporting","Romania","1 or 2 hours a day",null,{"$error":"#N/A"}]
[null,"ID0430",24000,"Engineer","USA","1 or 2 hours a day",null,{"$error":"#N/A"}]
[null,"ID0431",60000,"Manager","USA","4 to 6 hours a day",null,{"$error":"#N/A"}]
[null,"ID0432",76600,"Analyst","USA","2 to 3 hours per day",null,{"$error":"#N/A"}]
[null,"ID0433",102451.58768437347,"Controller","UK","2 to 3 hours per day",null,{"$error":"#N/A"}]
[null,"ID0434",6629,"Engineer","Dominican Republic","All the 8 hours baby, all the 8!",null,{"$error":"#N/A"}]
[null,"ID0435",90000,"Analyst","USA","1 or 2 hours a day",null,{"$error":"#N/A"}]
[null,"ID0436",8500,"Analyst","Colombia","1 or 2 hours a day",null,{"$error":"#N/A"}]
[null,"ID0437",75000,"Analyst","USA","4 to 6 hours a day",null,{"$error":"#N/A"}]
[null,"ID0438",72000,"Analyst","USA","2 to 3 hours per day",null,{"$error":"#N/A"}]
[null,"ID0439",65000,"Analyst","USA","4 to 6 hours a day",null,{"$error":"#N/A"}]
[null,"ID0440",120000,"CXO or Top Mgmt.","USA","1 or 2 hours a day",null,{"$error":"#N/A"}]
[null,"ID0441",71231.666749770273,"Accountant","India","All the 8 hours baby, all the 8!",null,{"$error":"#N/A"}]
[null,"ID0442",5342.3750062327708,"Manager","India","4 to 6 hours a day",null,{"$error":"#N/A"}]
[null,"ID0443",19588.708356186824,"Manager","India","4 to 6 hours a day",null,{"$error":"#N/A"}]
[null,"ID0444",80000,"Analyst","USA","4 to 6 hours a day",null,{"$error":"#N/A"}]
[null,"ID0445",53423.750062327701,"Manager","India","4 to 6 hours a day",null,{"$error":"#N/A"}]
[null,"ID0446",108169.76753333595,"Controller","Canada","2 to 3 hours per day",null,{"$error":"#N/A"}]
[null,"ID0447",51000,"Manager","USA","2 to 3 hours per day",null,{"$error":"#N/A"}]
[null,"ID0448",5000,"Reporting","India","4 to 6 hours a day",null,{"$error":"#N/A"}]
[null,"ID0449",74000,"Engineer","USA","4 to 6 hours a day",null,{"$error":"#N/A"}]
[null,"ID0450",94570.696324037053,"Consultant","UK","4 to 6 hours a day",null,{"$error":"#N/A"}]
[null,"ID0451",50000,"Analyst","USA","4 to 6 hours a day",null,{"$error":"#N/A"}]
[null,"ID0452",8903.9583437212841,"Analyst","India","4 to 6 hours a day",null,{"$error":"#N/A"}]
[null,"ID0453",78000,"Manager","Somalia","4 to 6 hours a day",null,{"$error":"#N/A"}]
[null,"ID0454",16027.125018698311,"Manager","India","1 or 2 hours a day",null,{"$error":"#N/A"}]
[null,"ID0455",7500,"Analyst","Romania","All the 8 hours baby, all the 8!",null,{"$error":"#N/A"}]
[null,"ID0456",60000,"Analyst","USA","All the 8 hours baby, all the 8!",null,{"$error":"#N/A"}]
[null,"ID0457",14246.333349954055,"CXO or Top Mgmt.","India","All the 8 hours baby, all the 8!",null,{"$f":"IF(ISBLANK(G450),NA(),VLOOKUP(G450,experienceCode,2,1))","v":{"$error":"#N/A"}}]
[null,"ID0458",80000,"Manager","USA","1 or 2 hours a day",null,{"$error":"#N/A"}]
[null,"ID0459",59894.774338556796,"Accountant","UK","4 to 6 hours a day",null,{"$error":"#N/A"}]
[null,"ID0460",51134.799197576998,"Manager","Canada","4 to 6 hours a day",null,{"$error":"#N/A"}]
[null,"ID0461",125000,"Manager","USA","2 to 3 hours per day",null,{"$error":"#N/A"}]
[null,"ID0462",52000,"Analyst","USA","2 to 3 hours per day",null,{"$error":"#N/A"}]
[null,"ID0463",45000,"Analyst","USA","4 to 6 hours a day",null,{"$error":"#N/A"}]
[null,"ID0464",39404.456801682099,"Analyst","UK","4 to 6 hours a day",null,{"$error":"#N/A"}]
[null,"ID0465",60000,"Manager","USA","All the 8 hours baby, all the 8!",null,{"$error":"#N/A"}]
[null,"ID0466",68835.306612122877,"Manager","Canada","1 or 2 hours a day",null,{"$error":"#N/A"}]
[null,"ID0467",5250,"Specialist","Republic of Georgia","4 to 6 hours a day",null,{"$error":"#N/A"}]
[null,"ID0468",85552.452503638444,"Manager","Canada","4 to 6 hours a day",null,{"$error":"#N/A"}]
[null,"ID0469",2225.989585930321,"Analyst","India","4 to 6 hours a day",null,{"$error":"#N/A"}]
[null,"ID0470",150000,"CXO or Top Mgmt.","USA","2 to 3 hours per day",null,{"$error":"#N/A"}]
[null,"ID0471",50000,"Analyst","USA","4 to 6 hours a day",null,{"$error":"#N/A"}]
[null,"ID0472",70000,"Analyst","USA","4 to 6 hours a day",null,{"$error":"#N/A"}]
[null,"ID0473",44921.080753917595,"Manager","UK","2 to 3 hours per day",null,{"$error":"#N/A"}]
[null,"ID0474",20000,"Specialist","India","4 to 6 hours a day",null,{"$error":"#N/A"}]
[null,"ID0476",12000,"Analyst","Estonia","All the 8 hours baby, all the 8!",null,{"$error":"#N/A"}]
[null,"ID0477",1229201.9037879086,"Accountant","Canada","4 to 6 hours a day",null,{"$error":"#N/A"}]
[null,"ID0478",30000,"Analyst","USA","Excel ?!? What Excel?",null,{"$error":"#N/A"}]
[null,"ID0479",24000,"Engineer","mozambique","2 to 3 hours per day",null,{"$error":"#N/A"}]
[null,"ID0480",92000,"Engineer","USA","1 or 2 hours a day",null,{"$error":"#N/A"}]
[null,"ID0481",52000,"Analyst","USA","4 to 6 hours a day",null,{"$error":"#N/A"}]
[null,"ID0482",169000,"CXO or Top Mgmt.","USA","2 to 3 hours per day",null,{"$error":"#N/A"}]
[null,"ID0484",110000,"Accountant","Norway","2 to 3 hours per day",null,{"$error":"#N/A"}]
[null,"ID0485",131675.52225194403,"Manager","South Africa","2 to 3 hours per day",null,{"$error":"#N/A"}]
[null,"ID0486",92994.518051969761,"Consultant","UK","2 to 3 hours per day",null,{"$error":"#N/A"}]
[null,"ID0487",50000,"Analyst","USA","4 to 6 hours a day",null,{"$error":"#N/A"}]
[null,"ID0488",65000,"Analyst","USA","2 to 3 hours per day",null,{"$error":"#N/A"}]
[null,"ID0489",45234.630059395036,"Analyst","Canada","All the 8 hours baby, all the 8!",null,{"$error":"#N/A"}]
[null,"ID0490",55000,"Analyst","USA","2 to 3 hours per day",null,{"$error":"#N/A"}]
[null,"ID0491",20000,"Consultant","India","2 to 3 hours per day",null,{"$error":"#N/A"}]
[null,"ID0492",6000,"Reporting","India","All the 8 hours baby, all the 8!",null,{"$error":"#N/A"}]
[null,"ID0493",299473.87169278396,"CXO or Top Mgmt.","UK","4 to 6 hours a day",null,{"$error":"#N/A"}]
[null,"ID0494",44391.484854502989,"Manager","UK","4 to 6 hours a day",null,{"$error":"#N/A"}]
[null,"ID0495",40000,"Analyst","USA","2 to 3 hours per day",null,{"$error":"#N/A"}]
[null,"ID0496",108000,"Manager","Norway","4 to 6 hours a day",null,{"$error":"#N/A"}]
[null,"ID0497",3561.5833374885137,"Analyst","India","2 to 3 hours per day",null,{"$error":"#N/A"}]
[null,"ID0498",84000,"Analyst","USA","All the 8 hours baby, all the 8!",null,{"$error":"#N/A"}]
[null,"ID0499",52013.882978220376,"Manager","UK","4 to 6 hours a day",null,{"$error":"#N/A"}]
[null,"ID0500",12821.700014958649,"Manager","India","2 to 3 hours per day",null,{"$error":"#N/A"}]
[null,"ID0501",67360.264327577388,"Analyst","Canada","4 to 6 hours a day",null,{"$error":"#N/A"}]
[null,"ID0502",23000,"Manager","Hungary","4 to 6 hours a day",null,{"$error":"#N/A"}]
[null,"ID0503",91418.339779902482,"Manager","UK","All the 8 hours baby, all the 8!",null,{"$error":"#N/A"}]
[null,"ID0504",77000,"Analyst","USA","All the 8 hours baby, all the 8!",null,{"$error":"#N/A"}]
[null,"ID0505",100000,"Analyst","USA","4 to 6 hours a day",null,{"$error":"#N/A"}]
[null,"ID0506",55500,"Controller","UAE","4 to 6 hours a day",null,{"$error":"#N/A"}]
[null,"ID0507",19055.991584874118,"Analyst","Spain","All the 8 hours baby, all the 8!",null,{"$error":"#N/A"}]
[null,"ID0508",10684.750012465542,"Manager","India","4 to 6 hours a day",null,{"$error":"#N/A"}]
[null,"ID0509",8400,"Manager","India","4 to 6 hours a day",null,{"$error":"#N/A"}]
[null,"ID0510",8903.9583437212841,"Manager","India","2 to 3 hours per day",null,{"$error":"#N/A"}]
[null,"ID0511",12000,"Analyst","Brazil","All the 8 hours baby, all the 8!",null,{"$error":"#N/A"}]
[null,"ID0512",65000,"Manager","USA","All the 8 hours baby, all the 8!",null,{"$error":"#N/A"}]
[null,"ID0513",25849.323661903458,"Analyst","UK","4 to 6 hours a day",null,{"$error":"#N/A"}]
[null,"ID0514",122941.90522124816,"Analyst","UK","1 or 2 hours a day",null,{"$error":"#N/A"}]
[null,"ID0515",76000,"Manager","USA","2 to 3 hours per day",null,{"$error":"#N/A"}]
[null,"ID0516",150000,"Consultant","USA","All the 8 hours baby, all the 8!",null,{"$error":"#N/A"}]
[null,"ID0517",54000,"Analyst","USA","4 to 6 hours a day",null,{"$error":"#N/A"}]
[null,"ID0518",57000,"Manager","Israel","4 to 6 hours a day",null,{"$error":"#N/A"}]
[null,"ID0519",61000,"Accountant","USA","4 to 6 hours a day",null,{"$error":"#N/A"}]
[null,"ID0520",70000,"Analyst","USA","All the 8 hours baby, all the 8!",null,{"$error":"#N/A"}]
[null,"ID0521",15000,"Manager","India","4 to 6 hours a day",null,{"$error":"#N/A"}]
[null,"ID0522",86093.301341305123,"Manager","Canada","4 to 6 hours a day",null,{"$error":"#N/A"}]
[null,"ID0523",72600,"Manager","USA","2 to 3 hours per day",null,{"$f":"IF(ISBLANK(G514),NA(),VLOOKUP(G514,experienceCode,2,1))","v":{"$error":"#N/A"}}]
[null,"ID0524",100000,"CXO or Top Mgmt.","USA","2 to 3 hours per day",null,{"$error":"#N/A"}]
[null,"ID0525",104000,"Analyst","USA","4 to 6 hours a day",null,{"$error":"#N/A"}]
[null,"ID0526",10684.750012465542,"Manager","India","4 to 6 hours a day",null,{"$error":"#N/A"}]
[null,"ID0527",200000,"CXO or Top Mgmt.","USA","2 to 3 hours per day",null,{"$error":"#N/A"}]
[null,"ID0528",62564.631571458704,"Accountant","Netherlands","All the 8 hours baby, all the 8!",null,{"$error":"#N/A"}]
[null,"ID0529",57530.506930455871,"Manager","UK","2 to 3 hours per day",null,{"$error":"#N/A"}]
[null,"ID0530",82300,"Manager","USA","2 to 3 hours per day",null,{"$error":"#N/A"}]
[null,"ID0531",95000,"Consultant","USA","4 to 6 hours a day",null,{"$error":"#N/A"}]
[null,"ID0532",220664.95808941979,"Specialist","UK","All the 8 hours baby, all the 8!",null,{"$error":"#N/A"}]
[null,"ID0533",72000,"Analyst","Russia","2 to 3 hours per day",null,{"$error":"#N/A"}]
[null,"ID0534",61194.579384158147,"Analyst","Australia","2 to 3 hours per day",null,{"$error":"#N/A"}]
[null,"ID0535",120000,"Manager","New Zealand","2 to 3 hours per day",null,{"$error":"#N/A"}]
[null,"ID0536",95000,"CXO or Top Mgmt.","Central America","2 to 3 hours per day",null,{"$error":"#N/A"}]
[null,"ID0537",50000,"Analyst","USA","2 to 3 hours per day",null,{"$error":"#N/A"}]
[null,"ID0538",115061.01386091174,"Manager","UK","4 to 6 hours a day",null,{"$error":"#N/A"}]
[null,"ID0539",50000,"Analyst","self-employed","4 to 6 hours a day",null,{"$error":"#N/A"}]
[null,"ID0540",46000,"Analyst","USA","2 to 3 hours per day",null,{"$error":"#N/A"}]
[null,"ID0541",6368.453230079479,"Consultant","Pakistan","4 to 6 hours a day",null,{"$error":"#N/A"}]
[null,"ID0543",86692.320794224041,"Analyst","Australia","4 to 6 hours a day",null,{"$error":"#N/A"}]
[null,"ID0544",8013.5625093491553,"Manager","India","All the 8 hours baby, all the 8!",null,{"$error":"#N/A"}]
[null,"ID0545",43000,"Accountant","USA","All the 8 hours baby, all the 8!",null,{"$error":"#N/A"}]
[null,"ID0546",18000,"Engineer","Brazil","4 to 6 hours a day",null,{"$error":"#N/A"}]
[null,"ID0547",55000,"Analyst","USA","2 to 3 hours per day",null,{"$error":"#N/A"}]
[null,"ID0548",8903.9583437212841,"Analyst","India","All the 8 hours baby, all the 8!",null,{"$error":"#N/A"}]
[null,"ID0549",45000,"Reporting","USA","All the 8 hours baby, all the 8!",null,{"$error":"#N/A"}]
[null,"ID0550",50000,"Manager","USA","4 to 6 hours a day",null,{"$error":"#N/A"}]
[null,"ID0551",80000,"Analyst","USA","All the 8 hours baby, all the 8!",null,{"$error":"#N/A"}]
[null,"ID0552",67000,"Analyst","USA","4 to 6 hours a day",null,{"$error":"#N/A"}]
[null,"ID0553",111000,"Analyst","Japan","All the 8 hours baby, all the 8!",null,{"$error":"#N/A"}]
[null,"ID0554",120000,"CXO or Top Mgmt.","USA","4 to 6 hours a day",null,{"$error":"#N/A"}]
[null,"ID0555",31523.565441345683,"Consultant","UK","4 to 6 hours a day",null,{"$error":"#N/A"}]
[null,"ID0556",78533.043543002947,"Analyst","Australia","2 to 3 hours per day",null,{"$error":"#N/A"}]
[null,"ID0557",60000,"Specialist","USA","1 or 2 hours a day",null,{"$error":"#N/A"}]
[null,"ID0558",35000,"Analyst","USA","2 to 3 hours per day",null,{"$error":"#N/A"}]
[null,"ID0559",63519.971949580387,"Manager","Panama","2 to 3 hours per day",null,{"$error":"#N/A"}]
[null,"ID0560",54000,"Specialist","USA","All the 8 hours baby, all the 8!",5,"5 - 10 years"]
[null,"ID0561",15600,"Controller","Brazil","4 to 6 hours a day",20,"more than 10 years"]
[null,"ID0562",35000,"Analyst","USA","1 or 2 hours a day",7,"5 - 10 years"]
[null,"ID0563",188000,"CXO or Top Mgmt.","USA","1 or 2 hours a day",20,"more than 10 years"]
[null,"ID0564",27500,"Analyst","USA","All the 8 hours baby, all the 8!",1,"less than 2 years"]
[null,"ID0565",140000,"Controller","USA","2 to 3 hours per day",10,"more than 10 years"]
[null,"ID0566",69871.969144538423,"Analyst","Netherlands","All the 8 hours baby, all the 8!",6,"5 - 10 years"]
[null,"ID0567",45000,"Analyst","USA","4 to 6 hours a day",2,"2 - 5 years"]
[null,"ID0568",95000,"Analyst","Australia","2 to 3 hours per day",11,"more than 10 years"]
[null,"ID0569",158085.99674240855,"Manager","Australia","4 to 6 hours a day",20,"more than 10 years"]
[null,"ID0570",63807.047488395103,"Analyst","New Zealand","4 to 6 hours a day",23,"more than 10 years"]
[null,"ID0572",38000,"Analyst","USA","All the 8 hours baby, all the 8!",11,"more than 10 years"]
[null,"ID0573",90000,"Manager","USA","4 to 6 hours a day",6,"5 - 10 years"]
[null,"ID0574",45393.934235537781,"Manager","UK","4 to 6 hours a day",27,"more than 10 years"]
[null,"ID0575",33099.743713412965,"Analyst","UK","All the 8 hours baby, all the 8!",10,"more than 10 years"]
[null,"ID0576",4285,"Analyst","India","All the 8 hours baby, all the 8!",6,"5 - 10 years"]
[null,"ID0577",6000,"Manager","Guyana","1 or 2 hours a day",20,"more than 10 years"]
[null,"ID0578",22438.012440857987,"Analyst","Australia","4 to 6 hours a day",8,"5 - 10 years"]
[null,"ID0579",90000,"Manager","USA","2 to 3 hours per day",15,"more than 10 years"]
[null,"ID0580",150000,"CXO or Top Mgmt.","USA","4 to 6 hours a day",22,"more than 10 years"]
[null,"ID0581",132588.25533234264,"Accountant","Australia","2 to 3 hours per day",27,"more than 10 years"]
[null,"ID0582",45000,"Analyst","USA","4 to 6 hours a day",3,"2 - 5 years"]
[null,"ID0583",50000,"Specialist","USA","2 to 3 hours per day",10,"more than 10 years"]
[null,"ID0584",300000,"CXO or Top Mgmt.","USA","2 to 3 hours per day",30,"more than 10 years"]
[null,"ID0585",104030.78495306884,"Manager","Australia","1 or 2 hours a day",10,"more than 10 years"]
[null,"ID0586",115000,"Manager","USA","4 to 6 hours a day",15,"more than 10 years"]
[null,"ID0587",70000,"Analyst","USA","4 to 6 hours a day",3,"2 - 5 years"]
[null,"ID0588",108110.42357867939,"Specialist","Australia","4 to 6 hours a day",16,"more than 10 years"]
[null,"ID0589",75000,"Analyst","USA","2 to 3 hours per day",25,{"$f":"IF(ISBLANK(G578),NA(),VLOOKUP(G578,experienceCode,2,1))","v":"more than 10 years"}]
[null,"ID0590",40414,"Analyst","USA","4 to 6 hours a day",8,"5 - 10 years"]
[null,"ID0591",65000,"Analyst","USA","4 to 6 hours a day",3,"2 - 5 years"]
[null,"ID0592",120000,"Analyst","USA","All the 8 hours baby, all the 8!",7,"5 - 10 years"]
[null,"ID0593",15092.18020692008,"Accountant","china","4 to 6 hours a day",10,"more than 10 years"]
[null,"ID0594",36000,"Consultant","Russia","All the 8 hours baby, all the 8!",10,"more than 10 years"]
[null,"ID0595",63519.971949580387,"Analyst","Germany","2 to 3 hours per day",4,"2 - 5 years"]
[null,"ID0596",108000,"Consultant","USA","2 to 3 hours per day",7,"5 - 10 years"]
[null,"ID0597",75000,"Analyst","USA","4 to 6 hours a day",5,"5 - 10 years"]
[null,"ID0598",7123.1666749770275,"Manager","India","1 or 2 hours a day",3,"2 - 5 years"]
[null,"ID0599",50000,"Manager","India","1 or 2 hours a day",25,"more than 10 years"]
[null,"ID0600",45000,"Analyst","USA","4 to 6 hours a day",15,"more than 10 years"]
[null,"ID0601",45000,"Accountant","USA","4 to 6 hours a day",7,"5 - 10 years"]
[null,"ID0602",90000,"Manager","USA","2 to 3 hours per day",20,"more than 10 years"]
[null,"ID0603",4273.9000049862161,"Analyst","India","2 to 3 hours per day",5,"5 - 10 years"]
[null,"ID0604",50000,"Manager","India","1 or 2 hours a day",10,"more than 10 years"]
[null,"ID0605",65000,"Analyst","USA","2 to 3 hours per day",17,"more than 10 years"]
[null,"ID0606",70000,"Analyst","USA","2 to 3 hours per day",18,"more than 10 years"]
[null,"ID0608",160000,"Analyst","USA","4 to 6 hours a day",5,"5 - 10 years"]
[null,"ID0609",101990.96564026357,"Manager","Australia","2 to 3 hours per day",20,"more than 10 years"]
[null,"ID0611",6767.0083412281756,"Manager","India","4 to 6 hours a day",10,"more than 10 years"]
[null,"ID0612",30000,"Analyst","USA","2 to 3 hours per day",8,"5 - 10 years"]
[null,"ID0613",7479.3250087258784,"Analyst","India","4 to 6 hours a day",3,"2 - 5 years"]
[null,"ID0614",61000,"Manager","USA","4 to 6 hours a day",5,"5 - 10 years"]
[null,"ID0615",13800,"Controller","Sri Lanka","4 to 6 hours a day",20,"more than 10 years"]
[null,"ID0616",15136.729184326183,"Analyst","India","4 to 6 hours a day",6,"5 - 10 years"]
[null,"ID0617",32054.250037396621,"Manager","India","2 to 3 hours per day",10,"more than 10 years"]
[null,"ID0618",80000,"Controller","USA","4 to 6 hours a day",15,"more than 10 years"]
[null,"ID0619",21000,"Manager","India","All the 8 hours baby, all the 8!",23,"more than 10 years"]
[null,"ID0620",245840.3807575817,"Analyst","Canada","4 to 6 hours a day",32,"more than 10 years"]
[null,"ID0621",2849.2666699908109,"Reporting","India","All the 8 hours baby, all the 8!",3,"2 - 5 years"]
[null,"ID0622",8400,"Manager","India","All the 8 hours baby, all the 8!",26,"more than 10 years"]
[null,"ID0623",86692.320794224041,"Consultant","Australia","1 or 2 hours a day",20,"more than 10 years"]
[null,"ID0624",50000,"Manager","USA","4 to 6 hours a day",20,"more than 10 years"]
[null,"ID0625",4000,"Reporting","India","All the 8 hours baby, all the 8!",6,"5 - 10 years"]
[null,"ID0626",101990.96564026357,"Analyst","Australia","All the 8 hours baby, all the 8!",1,"less than 2 years"]
[null,"ID0627",95000,"Manager","USA","1 or 2 hours a day",10,"more than 10 years"]
[null,"ID0628",10000,"Manager","Indonesia","2 to 3 hours per day",5,"5 - 10 years"]
[null,"ID0629",4200,"Reporting","India","All the 8 hours baby, all the 8!",4,"2 - 5 years"]
[null,"ID0630",12821.700014958649,"Manager","India","4 to 6 hours a day",12,"more than 10 years"]
[null,"ID0631",39000,"Analyst","USA","All the 8 hours baby, all the 8!",3,"2 - 5 years"]
[null,"ID0632",60000,"Analyst","USA","4 to 6 hours a day",12,"more than 10 years"]
[null,"ID0633",173384.64158844808,"Analyst","Australia","All the 8 hours baby, all the 8!",10,"more than 10 years"]
[null,"ID0634",125000,"Analyst","USA","2 to 3 hours per day",20,"more than 10 years"]
[null,"ID0635",79552.953199405587,"Accountant","Australia","All the 8 hours baby, all the 8!",4,"2 - 5 years"]
[null,"ID0636",3561.5833374885137,"Accountant","India","4 to 6 hours a day",3,"2 - 5 years"]
[null,"ID0637",80000,"Manager","USA","4 to 6 hours a day",8,"5 - 10 years"]
[null,"ID0638",10684.750012465542,"Analyst","India","2 to 3 hours per day",3,"2 - 5 years"]
[null,"ID0639",5342.3750062327708,"Engineer","India","All the 8 hours baby, all the 8!",2,"2 - 5 years"]
[null,"ID0640",71231.666749770273,"Manager","India","4 to 6 hours a day",1.5,"less than 2 years"]
[null,"ID0641",80135.625093491559,"CXO or Top Mgmt.","India","1 or 2 hours a day",6,"5 - 10 years"]
[null,"ID0642",54084.883766667976,"Manager","Canada","4 to 6 hours a day",5,"5 - 10 years"]
[null,"ID0643",53000,"Analyst","USA","4 to 6 hours a day",30,"more than 10 years"]
[null,"ID0644",5342.3750062327708,"Reporting","India","4 to 6 hours a day",1,"less than 2 years"]
[null,"ID0645",7123.1666749770275,"Manager","India","1 or 2 hours a day",5,"5 - 10 years"]
[null,"ID0646",10684.750012465542,"Manager","India","4 to 6 hours a day",11,"more than 10 years"]
[null,"ID0647",4000,"Reporting","India","All the 8 hours baby, all the 8!",4,"2 - 5 years"]
[null,"ID0648",8000,"Manager","Thailand","All the 8 hours baby, all the 8!",1,"less than 2 years"]
[null,"ID0649",2671.1875031163854,"Manager","India","2 to 3 hours per day",5,"5 - 10 years"]
[null,"ID0650",14246.333349954055,"Engineer","India","2 to 3 hours per day",3,"2 - 5 years"]
[null,"ID0651",8547.8000099724322,"Reporting","India","1 or 2 hours a day",3,"2 - 5 years"]
[null,"ID0652",7693.0200089751897,"Manager","India","2 to 3 hours per day",5,"5 - 10 years"]
[null,"ID0653",4000,"Manager","India","All the 8 hours baby, all the 8!",8,"5 - 10 years"]
[null,"ID0654",5400,"Manager","India","All the 8 hours baby, all the 8!",3,"2 - 5 years"]
[null,"ID0655",186983.12521814698,"Manager","India","2 to 3 hours per day",10,{"$f":"IF(ISBLANK(G642),NA(),VLOOKUP(G642,experienceCode,2,1))","v":"more than 10 years"}]
[null,"ID0657",21500,"Analyst","India","4 to 6 hours a day",9,"5 - 10 years"]
[null,"ID0658",15000,"Reporting","India","All the 8 hours baby, all the 8!",2,"2 - 5 years"]
[null,"ID0659",2122.8177433598262,"Accountant","Pakistan","2 to 3 hours per day",2,"2 - 5 years"]
[null,"ID0660",16917.52085307044,"Manager","India","4 to 6 hours a day",3,"2 - 5 years"]
[null,"ID0661",2938.3062534280239,"Manager","India","All the 8 hours baby, all the 8!",11,"more than 10 years"]
[null,"ID0662",16800,"Analyst","Pakistan","4 to 6 hours a day",12,"more than 10 years"]
[null,"ID0663",37000,"Engineer","India","4 to 6 hours a day",10,"more than 10 years"]
[null,"ID0664",5342.3750062327708,"Analyst","India","4 to 6 hours a day",4.5,"2 - 5 years"]
[null,"ID0665",3561.5833374885137,"Reporting","India","All the 8 hours baby, all the 8!",3,"2 - 5 years"]
[null,"ID0666",8547.8000099724322,"Manager","India","2 to 3 hours per day",8,"5 - 10 years"]
[null,"ID0667",5800,"Manager","India","All the 8 hours baby, all the 8!",8,"5 - 10 years"]
[null,"ID0668",4095.8208381117906,"Reporting","India","All the 8 hours baby, all the 8!",3,"2 - 5 years"]
[null,"ID0669",4914.9850057341491,"Manager","Pakistan","1 or 2 hours a day",3,"2 - 5 years"]
[null,"ID0670",24000,"Manager","Saudi Arabia","4 to 6 hours a day",12,"more than 10 years"]
[null,"ID0671",24000,"Accountant","UAE","2 to 3 hours per day",15,"more than 10 years"]
[null,"ID0672",8738,"Manager","India","All the 8 hours baby, all the 8!",7.3,"5 - 10 years"]
[null,"ID0673",15000,"Analyst","Indonesia","4 to 6 hours a day",1,"less than 2 years"]
[null,"ID0674",56400,"Manager","UAE","2 to 3 hours per day",6,"5 - 10 years"]
[null,"ID0675",10200,"Analyst","India","4 to 6 hours a day",4.5,"2 - 5 years"]
[null,"ID0676",5787.5729234188348,"Reporting","India","All the 8 hours baby, all the 8!",4.5,"2 - 5 years"]
[null,"ID0677",105000,"Consultant","USA","2 to 3 hours per day",15,"more than 10 years"]
[null,"ID0678",4451.9791718606421,"Manager","India","2 to 3 hours per day",5,"5 - 10 years"]
[null,"ID0679",8369.7208430980063,"Consultant","India","All the 8 hours baby, all the 8!",4,"2 - 5 years"]
[null,"ID0680",17067.637625607145,"Manager","Philippines","4 to 6 hours a day",9,"5 - 10 years"]
[null,"ID0681",101990.96564026357,"Manager","Australia","1 or 2 hours a day",20,"more than 10 years"]
[null,"ID0682",3917.7416712373652,"Analyst","India","2 to 3 hours per day",3,"2 - 5 years"]
[null,"ID0683",52000,"Specialist","USA","4 to 6 hours a day",18,"more than 10 years"]
[null,"ID0684",4630.058338735068,"Analyst","India","4 to 6 hours a day",2,"2 - 5 years"]
[null,"ID0685",2136.9500024931081,"Analyst","India","2 to 3 hours per day",3,"2 - 5 years"]
[null,"ID0686",13000,"Analyst","India","1 or 2 hours a day",4,"2 - 5 years"]
[null,"ID0687",2564.3400029917298,"Manager","India","2 to 3 hours per day",7,"5 - 10 years"]
[null,"ID0688",20479.104190558952,"Manager","India","2 to 3 hours per day",7,"5 - 10 years"]
[null,"ID0689",33500,"Accountant","Dubai","1 or 2 hours a day",10,"more than 10 years"]
[null,"ID0690",50000,"Manager","India","2 to 3 hours per day",20,"more than 10 years"]
[null,"ID0691",5342.3750062327708,"Manager","India","2 to 3 hours per day",3,"2 - 5 years"]
[null,"ID0692",11539.530013462785,"Analyst","India","All the 8 hours baby, all the 8!",2,"2 - 5 years"]
[null,"ID0693",7000,"Manager","India","4 to 6 hours a day",23,"more than 10 years"]
[null,"ID0694",6767.0083412281756,"Reporting","India","2 to 3 hours per day",6,"5 - 10 years"]
[null,"ID0695",3000,"Consultant","Cambodia","2 to 3 hours per day",2,"2 - 5 years"]
[null,"ID0696",4451.9791718606421,"Reporting","India","All the 8 hours baby, all the 8!",4,"2 - 5 years"]
[null,"ID0697",2671.1875031163854,"CXO or Top Mgmt.","India","4 to 6 hours a day",4.5,"2 - 5 years"]
[null,"ID0698",4957.7240057840108,"Manager","India","4 to 6 hours a day",5,"5 - 10 years"]
[null,"ID0699",3205.4250037396623,"Accountant","India","2 to 3 hours per day",14,"more than 10 years"]
[null,"ID0700",14246.333349954055,"Manager","India","4 to 6 hours a day",7,"5 - 10 years"]
[null,"ID0701",5342.3750062327708,"Analyst","India","All the 8 hours baby, all the 8!",7,"5 - 10 years"]
[null,"ID0702",6588.9291743537506,"Analyst","India","All the 8 hours baby, all the 8!",2,"2 - 5 years"]
[null,"ID0703",6588.9291743537506,"Analyst","India","All the 8 hours baby, all the 8!",2,"2 - 5 years"]
[null,"ID0704",35000,"Specialist","USA","4 to 6 hours a day",10,"more than 10 years"]
[null,"ID0705",12821.700014958649,"Accountant","India","4 to 6 hours a day",4,"2 - 5 years"]
[null,"ID0706",10684.750012465542,"Manager","India","1 or 2 hours a day",2,"2 - 5 years"]
[null,"ID0707",10000,"Manager","India","4 to 6 hours a day",2,"2 - 5 years"]
[null,"ID0708",2136.9500024931081,"Analyst","India","1 or 2 hours a day",0,"less than 2 years"]
[null,"ID0709",8547.8000099724322,"Analyst","India","4 to 6 hours a day",4,"2 - 5 years"]
[null,"ID0710",8013.5625093491553,"Analyst","India","All the 8 hours baby, all the 8!",8,"5 - 10 years"]
[null,"ID0711",7123.1666749770275,"Consultant","India","4 to 6 hours a day",0,"less than 2 years"]
[null,"ID0712",40958.208381117904,"Analyst","India","All the 8 hours baby, all the 8!",5,"5 - 10 years"]
[null,"ID0713",11325.835013213473,"Manager","India","4 to 6 hours a day",2,"2 - 5 years"]
[null,"ID0714",15000,"Accountant","Lithuania","4 to 6 hours a day",2,"2 - 5 years"]
[null,"ID0715",12000,"Analyst","UAE","4 to 6 hours a day",12,"more than 10 years"]
[null,"ID0716",8903.9583437212841,"Reporting","India","2 to 3 hours per day",1,"less than 2 years"]
[null,"ID0717",8903.9583437212841,"Engineer","India","All the 8 hours baby, all the 8!",2,"2 - 5 years"]
[null,"ID0718",12821.700014958649,"Manager","India","All the 8 hours baby, all the 8!",10,"more than 10 years"]
[null,"ID0719",3205.4250037396623,"Manager","India","All the 8 hours baby, all the 8!",7,"5 - 10 years"]
[null,"ID0720",6677.9687577909626,"Manager","India","2 to 3 hours per day",6,{"$f":"IF(ISBLANK(G706),NA(),VLOOKUP(G706,experienceCode,2,1))","v":"5 - 10 years"}]
[null,"ID0721",67794.987956419791,"Manager","New Zealand","4 to 6 hours a day",15,"more than 10 years"]
[null,"ID0722",31250,"Manager","India","2 to 3 hours per day",6,"5 - 10 years"]
[null,"ID0723",2165.2740982270229,"Manager","Pakistan","All the 8 hours baby, all the 8!",2,"2 - 5 years"]
[null,"ID0724",7123.1666749770275,"Reporting","India","All the 8 hours baby, all the 8!",4,"2 - 5 years"]
[null,"ID0725",130000,"Manager","Australia","4 to 6 hours a day",3,"2 - 5 years"]
[null,"ID0726",4451.9791718606421,"Manager","India","4 to 6 hours a day",6,"5 - 10 years"]
[null,"ID0727",9600,"Analyst","South Africa","4 to 6 hours a day",2,"2 - 5 years"]
[null,"ID0728",6945.0875081026015,"Analyst","India","4 to 6 hours a day",1,"less than 2 years"]
[null,"ID0729",10684.750012465542,"Accountant","India","All the 8 hours baby, all the 8!",7,"5 - 10 years"]
[null,"ID0730",8547.8000099724322,"Analyst","India","2 to 3 hours per day",3.5,"2 - 5 years"]
[null,"ID0731",35000,"Analyst","India","4 to 6 hours a day",10,"more than 10 years"]
[null,"ID0732",17807.916687442568,"Analyst","India","2 to 3 hours per day",12,"more than 10 years"]
[null,"ID0733",3205.4250037396623,"Accountant","India","All the 8 hours baby, all the 8!",4,"2 - 5 years"]
[null,"ID0734",60000,"Manager","Russia","4 to 6 hours a day",10,"more than 10 years"]
[null,"ID0735",14246.333349954055,"Manager","India","2 to 3 hours per day",13,"more than 10 years"]
[null,"ID0736",10684.750012465542,"Manager","India","2 to 3 hours per day",8,"5 - 10 years"]
[null,"ID0737",40000,"Manager","India","All the 8 hours baby, all the 8!",15,"more than 10 years"]
[null,"ID0738",5022,"Analyst","Pakistan","4 to 6 hours a day",15,"more than 10 years"]
[null,"ID0739",7301.2458418514525,"Analyst","India","All the 8 hours baby, all the 8!",5,"5 - 10 years"]
[null,"ID0740",19831.432821021317,"Analyst","Egypt","All the 8 hours baby, all the 8!",5,"5 - 10 years"]
[null,"ID0741",10684.750012465542,"Manager","India","4 to 6 hours a day",5,"5 - 10 years"]
[null,"ID0742",4800,"Analyst","Bhutan","4 to 6 hours a day",2,"2 - 5 years"]
[null,"ID0743",83846.362973446114,"Analyst","Germany","4 to 6 hours a day",7,"5 - 10 years"]
[null,"ID0744",15000,"Controller","India","2 to 3 hours per day",2,"2 - 5 years"]
[null,"ID0745",10000,"Analyst","India","4 to 6 hours a day",12,"more than 10 years"]
[null,"ID0746",116637.19213297902,"Manager","UK","4 to 6 hours a day",5,"5 - 10 years"]
[null,"ID0747",34357.533974522659,"Analyst","UK","All the 8 hours baby, all the 8!",1.5,"less than 2 years"]
[null,"ID0748",102451.58768437347,"Manager","UK","4 to 6 hours a day",15,"more than 10 years"]
[null,"ID0749",16000,"Engineer","India","2 to 3 hours per day",5,"5 - 10 years"]
[null,"ID0750",6000,"Manager","India","2 to 3 hours per day",6,"5 - 10 years"]
[null,"ID0751",6410.8500074793246,"Manager","India","All the 8 hours baby, all the 8!",6,"5 - 10 years"]
[null,"ID0752",36000,"Engineer","UAE","1 or 2 hours a day",7,"5 - 10 years"]
[null,"ID0753",20000,"Engineer","India","1 or 2 hours a day",7,"5 - 10 years"]
[null,"ID0754",4273.9000049862161,"Accountant","India","4 to 6 hours a day",8,"5 - 10 years"]
[null,"ID0755",37828.278529614821,"Specialist","UK","All the 8 hours baby, all the 8!",8,"5 - 10 years"]
[null,"ID0756",11000,"Manager","Sri Lanka","All the 8 hours baby, all the 8!",4.5,"2 - 5 years"]
[null,"ID0757",8000,"Analyst","India","2 to 3 hours per day",6,"5 - 10 years"]
[null,"ID0758",4006.7812546745777,"Reporting","India","All the 8 hours baby, all the 8!",5.5,"5 - 10 years"]
[null,"ID0759",9171.0323574730355,"Manager","Nigeria","2 to 3 hours per day",5,"5 - 10 years"]
[null,"ID0760",4273.9000049862161,"Analyst","India","2 to 3 hours per day",20,"more than 10 years"]
[null,"ID0761",12465.541681209797,"Analyst","India","All the 8 hours baby, all the 8!",5,"5 - 10 years"]
[null,"ID0762",24000,"Analyst","India","2 to 3 hours per day",1,"less than 2 years"]
[null,"ID0763",20000,"Consultant","Denmark","2 to 3 hours per day",15,"more than 10 years"]
[null,"ID0764",62000,"Analyst","USA","2 to 3 hours per day",20,"more than 10 years"]
[null,"ID0765",14960,"Controller","Saudi Arabia","All the 8 hours baby, all the 8!",2,"2 - 5 years"]
[null,"ID0766",2136.9500024931081,"Accountant","India","2 to 3 hours per day",2,"2 - 5 years"]
[null,"ID0767",30232,"Accountant","USA","2 to 3 hours per day",5,"5 - 10 years"]
[null,"ID0768",41000,"Analyst","USA","All the 8 hours baby, all the 8!",4,"2 - 5 years"]
[null,"ID0769",96891.417358250401,"Analyst","Australia","2 to 3 hours per day",11,"more than 10 years"]
[null,"ID0770",21369.500024931083,"Manager","India","All the 8 hours baby, all the 8!",14,"more than 10 years"]
[null,"ID0771",3650.6229209257262,"Accountant","India","All the 8 hours baby, all the 8!",10,"more than 10 years"]
[null,"ID0772",19068,"Accountant","Philippines","All the 8 hours baby, all the 8!",20,"more than 10 years"]
[null,"ID0773",5342.3750062327708,"Controller","India","All the 8 hours baby, all the 8!",4,"2 - 5 years"]
[null,"ID0774",48000,"Consultant","Singapore","All the 8 hours baby, all the 8!",3,"2 - 5 years"]
[null,"ID0775",3917.7416712373652,"Engineer","India","4 to 6 hours a day",2,"2 - 5 years"]
[null,"ID0776",13500,"Reporting","India","All the 8 hours baby, all the 8!",2.5,"2 - 5 years"]
[null,"ID0777",45000,"Manager","India","1 or 2 hours a day",15,"more than 10 years"]
[null,"ID0778",69871.969144538423,"CXO or Top Mgmt.","italy","2 to 3 hours per day",18,"more than 10 years"]
[null,"ID0779",8547.8000099724322,"Manager","India","4 to 6 hours a day",11,"more than 10 years"]
[null,"ID0780",9146.5655463031271,"Accountant","Dubai","1 or 2 hours a day",7,"5 - 10 years"]
[null,"ID0781",10150.512511842264,"Analyst","India","All the 8 hours baby, all the 8!",2.4,"2 - 5 years"]
[null,"ID0782",11325.835013213473,"Manager","India","4 to 6 hours a day",7,"5 - 10 years"]
[null,"ID0783",1910.5359690238436,"Reporting","Pakistan","All the 8 hours baby, all the 8!",7,"5 - 10 years"]
[null,"ID0784",36000,"Manager","Australia","2 to 3 hours per day",12,{"$f":"IF(ISBLANK(G770),NA(),VLOOKUP(G770,experienceCode,2,1))","v":"more than 10 years"}]
[null,"ID0785",40067.812546745779,"Accountant","India","1 or 2 hours a day",5,"5 - 10 years"]
[null,"ID0786",16000,"Reporting","India","All the 8 hours baby, all the 8!",1,"less than 2 years"]
[null,"ID0787",4273.9000049862161,"Analyst","India","All the 8 hours baby, all the 8!",4,"2 - 5 years"]
[null,"ID0788",7123.1666749770275,"Manager","India","4 to 6 hours a day",7,"5 - 10 years"]
[null,"ID0789",10000,"Manager","India","1 or 2 hours a day",12,"more than 10 years"]
[null,"ID0790",64901.860520001574,"Analyst","Canada","2 to 3 hours per day",20,"more than 10 years"]
[null,"ID0791",65000,"Analyst","USA","2 to 3 hours per day",10,"more than 10 years"]
[null,"ID0792",8013.5625093491553,"Manager","India","All the 8 hours baby, all the 8!",1.5,"less than 2 years"]
[null,"ID0793",98336.152303032693,"CXO or Top Mgmt.","Canada","4 to 6 hours a day",5,"5 - 10 years"]
[null,"ID0794",2671.1875031163854,"Analyst","India","4 to 6 hours a day",2,"2 - 5 years"]
[null,"ID0795",96000,"Reporting","India","All the 8 hours baby, all the 8!",8,"5 - 10 years"]
[null,"ID0796",20514.720023933838,"Accountant","India","4 to 6 hours a day",6,"5 - 10 years"]
[null,"ID0797",19055.991584874118,"Analyst","Spain","2 to 3 hours per day",10,"more than 10 years"]
[null,"ID0798",66294.12766617132,"Analyst","Australia","All the 8 hours baby, all the 8!",10,"more than 10 years"]
[null,"ID0799",6713.584591165848,"Analyst","India","1 or 2 hours a day",7,"5 - 10 years"]
[null,"ID0800",45709.169889951241,"Reporting","UK","2 to 3 hours per day",15,"more than 10 years"]
[null,"ID0801",48500,"Manager","USA","2 to 3 hours per day",10,"more than 10 years"]
[null,"ID0802",10684.750012465542,"Analyst","India","All the 8 hours baby, all the 8!",4,"2 - 5 years"]
[null,"ID0803",33900,"Analyst","USA","2 to 3 hours per day",10,"more than 10 years"]
[null,"ID0804",109729.60187662003,"Analyst","South Africa","All the 8 hours baby, all the 8!",40,"more than 10 years"]
[null,"ID0805",15136.729184326183,"Analyst","India","4 to 6 hours a day",2,"2 - 5 years"]
[null,"ID0806",85000,"CXO or Top Mgmt.","USA","4 to 6 hours a day",15,"more than 10 years"]
[null,"ID0807",8013.5625093491553,"Manager","India","4 to 6 hours a day",6,"5 - 10 years"]
[null,"ID0808",48000,"Manager","USA","2 to 3 hours per day",16,"more than 10 years"]
[null,"ID0809",3027.3458368652364,"Reporting","India","4 to 6 hours a day",2,"2 - 5 years"]
[null,"ID0810",13100,"Accountant","India","2 to 3 hours per day",5,"5 - 10 years"]
[null,"ID0811",60000,"Manager","UAE","2 to 3 hours per day",15,"more than 10 years"]
[null,"ID0812",24000,"Manager","Croatia","2 to 3 hours per day",5,"5 - 10 years"]
[null,"ID0813",4273.9000049862161,"Manager","India","2 to 3 hours per day",3,"2 - 5 years"]
[null,"ID0814",11575.14584683767,"Manager","India","2 to 3 hours per day",5,"5 - 10 years"]
[null,"ID0815",95000,"Analyst","USA","2 to 3 hours per day",13,"more than 10 years"]
[null,"ID0816",9188.8850107203652,"Manager","India","4 to 6 hours a day",0,"less than 2 years"]
[null,"ID0817",8975.1900104710548,"Manager","India","All the 8 hours baby, all the 8!",3,"2 - 5 years"]
[null,"ID0818",2564.3400029917298,"Analyst","India","All the 8 hours baby, all the 8!",1,"less than 2 years"]
[null,"ID0820",86689.804963700633,"Controller","UK","4 to 6 hours a day",12,"more than 10 years"]
[null,"ID0821",15500,"Engineer","India","1 or 2 hours a day",3,"2 - 5 years"]
[null,"ID0822",148284.35006969364,"Analyst","Brazil","All the 8 hours baby, all the 8!",3,"2 - 5 years"]
[null,"ID0823",10684.750012465542,"Analyst","India","All the 8 hours baby, all the 8!",5,"5 - 10 years"]
[null,"ID0824",75000,"Analyst","USA","2 to 3 hours per day",27,"more than 10 years"]
[null,"ID0825",12000,"Manager","Ukraine","4 to 6 hours a day",5,"5 - 10 years"]
[null,"ID0826",30273.458368652366,"Manager","India","All the 8 hours baby, all the 8!",1.1000000000000001,"less than 2 years"]
[null,"ID0827",30000,"Controller","Indonesia","4 to 6 hours a day",7,"5 - 10 years"]
[null,"ID0828",6410.8500074793246,"Analyst","India","All the 8 hours baby, all the 8!",4,"2 - 5 years"]
[null,"ID0829",100000,"CXO or Top Mgmt.","USA","4 to 6 hours a day",10,"more than 10 years"]
[null,"ID0830",53356.776437647524,"Engineer","Netherlands","4 to 6 hours a day",2,"2 - 5 years"]
[null,"ID0831",40000,"Manager","USA","2 to 3 hours per day",20,"more than 10 years"]
[null,"ID0832",9794.354178093412,"Analyst","India","4 to 6 hours a day",1,"less than 2 years"]
[null,"ID0833",18499.860539512854,"Specialist","Romania","4 to 6 hours a day",6,"5 - 10 years"]
[null,"ID0834",19818.231248269083,"Controller","Portugal","4 to 6 hours a day",5,"5 - 10 years"]
[null,"ID0835",10684.750012465542,"Manager","India","All the 8 hours baby, all the 8!",20,"more than 10 years"]
[null,"ID0836",10684.750012465542,"Manager","India","2 to 3 hours per day",18,"more than 10 years"]
[null,"ID0837",17807.916687442568,"Analyst","India","4 to 6 hours a day",10,"more than 10 years"]
[null,"ID0838",13000,"Analyst","India","All the 8 hours baby, all the 8!",6,"5 - 10 years"]
[null,"ID0839",16027.125018698311,"Manager","India","1 or 2 hours a day",9,"5 - 10 years"]
[null,"ID0840",85000,"Accountant","USA","All the 8 hours baby, all the 8!",1,"less than 2 years"]
[null,"ID0841",6000,"Analyst","Colombia","1 or 2 hours a day",10,"more than 10 years"]
[null,"ID0842",30000,"Reporting","India","4 to 6 hours a day",2,"2 - 5 years"]
[null,"ID0844",157617.8272067284,"Controller","UK","2 to 3 hours per day",20,"more than 10 years"]
[null,"ID0845",21369.500024931083,"Manager","India","1 or 2 hours a day",18,"more than 10 years"]
[null,"ID0846",3561.5833374885137,"Reporting","India","4 to 6 hours a day",1,"less than 2 years"]
[null,"ID0847",5000,"Manager","India","4 to 6 hours a day",1,"less than 2 years"]
[null,"ID0848",3561.5833374885137,"Analyst","India","4 to 6 hours a day",2,"2 - 5 years"]
[null,"ID0849",38111.983169748237,"Accountant","Portugal","All the 8 hours baby, all the 8!",8,"5 - 10 years"]
[null,"ID0850",17807.916687442568,"Analyst","India","4 to 6 hours a day",6.5,{"$f":"IF(ISBLANK(G834),NA(),VLOOKUP(G834,experienceCode,2,1))","v":"5 - 10 years"}]
[null,"ID0851",11575.14584683767,"Analyst","India","All the 8 hours baby, all the 8!",3.5,"2 - 5 years"]
[null,"ID0852",98336.152303032693,"Manager","Canada","2 to 3 hours per day",10,"more than 10 years"]
[null,"ID0854",92500,"Analyst","USA","2 to 3 hours per day",15,"more than 10 years"]
[null,"ID0855",9794.354178093412,"Analyst","India","4 to 6 hours a day",1,"less than 2 years"]
[null,"ID0856",32000,"Manager","USA","4 to 6 hours a day",1,"less than 2 years"]
[null,"ID0857",55000,"Analyst","USA","4 to 6 hours a day",10,"more than 10 years"]
[null,"ID0858",40000,"Analyst","USA","All the 8 hours baby, all the 8!",4,"2 - 5 years"]
[null,"ID0859",3000,"Analyst","Pakistan","2 to 3 hours per day",2,"2 - 5 years"]
[null,"ID0860",43600,"Analyst","USA","4 to 6 hours a day",5,"5 - 10 years"]
[null,"ID0861",9616.275011218986,"Analyst","India","All the 8 hours baby, all the 8!",8,"5 - 10 years"]
[null,"ID0862",35000,"Manager","Uruguay","All the 8 hours baby, all the 8!",10,"more than 10 years"]
[null,"ID0863",12000,"Consultant","Spain","2 to 3 hours per day",15,"more than 10 years"]
[null,"ID0864",5000,"Consultant","Aruba","1 or 2 hours a day",13,"more than 10 years"]
[null,"ID0865",16337.518501630093,"Analyst","South Africa","4 to 6 hours a day",2,"2 - 5 years"]
[null,"ID0866",65000,"Analyst","USA","1 or 2 hours a day",8,"5 - 10 years"]
[null,"ID0867",40000,"Analyst","USA","All the 8 hours baby, all the 8!",2,"2 - 5 years"]
[null,"ID0868",98000,"Manager","Indonesia","2 to 3 hours per day",14,"more than 10 years"]
[null,"ID0869",50000,"CXO or Top Mgmt.","USA","All the 8 hours baby, all the 8!",15,"more than 10 years"]
[null,"ID0870",135000,"CXO or Top Mgmt.","USA","4 to 6 hours a day",25,"more than 10 years"]
[null,"ID0871",125000,"Manager","Norway","4 to 6 hours a day",6,"5 - 10 years"]
[null,"ID0872",4500,"Analyst","Indonesia","2 to 3 hours per day",4,"2 - 5 years"]
[null,"ID0873",115000,"Analyst","USA","4 to 6 hours a day",10,"more than 10 years"]
[null,"ID0874",70000,"Analyst","USA","All the 8 hours baby, all the 8!",15,"more than 10 years"]
[null,"ID0875",60000,"Analyst","USA","2 to 3 hours per day",8,"5 - 10 years"]
[null,"ID0876",87456,"Manager","USA","2 to 3 hours per day",12,"more than 10 years"]
[null,"ID0877",26400,"Analyst","UAE","All the 8 hours baby, all the 8!",6,"5 - 10 years"]
[null,"ID0878",12000,"Manager","UAE","All the 8 hours baby, all the 8!",18,"more than 10 years"]
[null,"ID0879",2564.3400029917298,"Analyst","India","4 to 6 hours a day",1,"less than 2 years"]
[null,"ID0880",62000,"Manager","Qatar","All the 8 hours baby, all the 8!",11,"more than 10 years"]
[null,"ID0881",5342.3750062327708,"Analyst","India","1 or 2 hours a day",10,"more than 10 years"]
[null,"ID0882",50815.977559664309,"Analyst","Netherlands","4 to 6 hours a day",4,"2 - 5 years"]
[null,"ID0883",25560,"Manager","Saudi Arabia","4 to 6 hours a day",3,"2 - 5 years"]
[null,"ID0884",12821.700014958649,"Accountant","India","4 to 6 hours a day",3,"2 - 5 years"]
[null,"ID0885",10684.750012465542,"Manager","India","All the 8 hours baby, all the 8!",5,"5 - 10 years"]
[null,"ID0886",4457.9172610556352,"Manager","Pakistan","All the 8 hours baby, all the 8!",4,"2 - 5 years"]
[null,"ID0887",125000,"CXO or Top Mgmt.","South Africa","4 to 6 hours a day",20,"more than 10 years"]
[null,"ID0888",43000,"Analyst","USA","4 to 6 hours a day",1,"less than 2 years"]
[null,"ID0889",7123.1666749770275,"Engineer","India","2 to 3 hours per day",6,"5 - 10 years"]
[null,"ID0890",10000,"Accountant","Viet Nam","4 to 6 hours a day",4,"2 - 5 years"]
[null,"ID0891",8903.9583437212841,"Manager","India","1 or 2 hours a day",5,"5 - 10 years"]
[null,"ID0892",36500,"Accountant","Saudi Arabia","4 to 6 hours a day",15,"more than 10 years"]
[null,"ID0893",100000,"CXO or Top Mgmt.","Mexico","All the 8 hours baby, all the 8!",10,"more than 10 years"]
[null,"ID0894",7123.1666749770275,"Accountant","India","2 to 3 hours per day",8,"5 - 10 years"]
[null,"ID0895",40958.208381117904,"Manager","India","2 to 3 hours per day",8,"5 - 10 years"]
[null,"ID0896",21369.500024931083,"CXO or Top Mgmt.","India","4 to 6 hours a day",17,"more than 10 years"]
[null,"ID0897",2136.9500024931081,"Manager","India","4 to 6 hours a day",5,"5 - 10 years"]
[null,"ID0898",8903.9583437212841,"Engineer","India","2 to 3 hours per day",3,"2 - 5 years"]
[null,"ID0899",17807.916687442568,"Manager","India","4 to 6 hours a day",5,"5 - 10 years"]
[null,"ID0900",15136.729184326183,"Manager","India","2 to 3 hours per day",3,"2 - 5 years"]
[null,"ID0901",3982.448779308334,"Analyst","Philippines","4 to 6 hours a day",10,"more than 10 years"]
[null,"ID0903",15600,"Controller","Kuwait ","4 to 6 hours a day",13,"more than 10 years"]
[null,"ID0904",3205.4250037396623,"Analyst","India","2 to 3 hours per day",3.5,"2 - 5 years"]
[null,"ID0905",10000,"Manager","India","4 to 6 hours a day",6,"5 - 10 years"]
[null,"ID0906",75010,"Analyst","USA","2 to 3 hours per day",6,"5 - 10 years"]
[null,"ID0907",10684.750012465542,"Manager","India","All the 8 hours baby, all the 8!",9,"5 - 10 years"]
[null,"ID0908",16350,"Manager","India","4 to 6 hours a day",5,"5 - 10 years"]
[null,"ID0909",126094.26176538273,"Accountant","UK","4 to 6 hours a day",10,"more than 10 years"]
[null,"ID0910",60000,"Accountant","Singapore","All the 8 hours baby, all the 8!",10,"more than 10 years"]
[null,"ID0911",23150.291693675339,"Manager","India","1 or 2 hours a day",3,"2 - 5 years"]
[null,"ID0912",13801.135432767991,"Analyst","India","4 to 6 hours a day",2,"2 - 5 years"]
[null,"ID0913",18698.312521814696,"Manager","India","All the 8 hours baby, all the 8!",5,"5 - 10 years"]
[null,"ID0914",36000,"Controller","Czech Republic","2 to 3 hours per day",9,"5 - 10 years"]
[null,"ID0915",8654.6475100970874,"Manager","India","All the 8 hours baby, all the 8!",6,"5 - 10 years"]
[null,"ID0916",102451.58768437347,"Manager","UK","1 or 2 hours a day",15,{"$f":"IF(ISBLANK(G898),NA(),VLOOKUP(G898,experienceCode,2,1))","v":"more than 10 years"}]
[null,"ID0917",36400,"Analyst","Zimbabwe","4 to 6 hours a day",20,"more than 10 years"]
[null,"ID0918",101206.40684944032,"Consultant","UK","4 to 6 hours a day",16,"more than 10 years"]
[null,"ID0919",5342.3750062327708,"Analyst","India","4 to 6 hours a day",0.5,"less than 2 years"]
[null,"ID0920",28310.79811950968,"Analyst","UAE","4 to 6 hours a day",11,"more than 10 years"]
[null,"ID0921",26043.18849932796,"Manager","Poland","4 to 6 hours a day",8,"5 - 10 years"]
[null,"ID0922",96891.417358250401,"Analyst","Australia","1 or 2 hours a day",7,"5 - 10 years"]
[null,"ID0923",2564.3400029917298,"Controller","India","4 to 6 hours a day",4,"2 - 5 years"]
[null,"ID0924",3205.4250037396623,"Reporting","India","All the 8 hours baby, all the 8!",8,"5 - 10 years"]
[null,"ID0925",10684.750012465542,"Analyst","India","All the 8 hours baby, all the 8!",8,"5 - 10 years"]
[null,"ID0927",150000,"Controller","USA","4 to 6 hours a day",25,"more than 10 years"]
[null,"ID0928",12465.541681209797,"Manager","India","4 to 6 hours a day",3,"2 - 5 years"]
[null,"ID0929",19055.991584874118,"Analyst","Slovenia","4 to 6 hours a day",4,"2 - 5 years"]
[null,"ID0930",105000,"Analyst","USA","4 to 6 hours a day",20,"more than 10 years"]
[null,"ID0931",24000,"Analyst","India","4 to 6 hours a day",3,"2 - 5 years"]
[null,"ID0932",78808.913603364199,"Analyst","UK","All the 8 hours baby, all the 8!",10,"more than 10 years"]
[null,"ID0933",42000,"Controller","Saudi Arabia","All the 8 hours baby, all the 8!",15,"more than 10 years"]
[null,"ID0934",9490.1984044603923,"Analyst","Brazil","All the 8 hours baby, all the 8!",8,"5 - 10 years"]
[null,"ID0935",60000,"Consultant","Singapore","4 to 6 hours a day",5,"5 - 10 years"]
[null,"ID0936",17807.916687442568,"Manager","India","All the 8 hours baby, all the 8!",8,"5 - 10 years"]
[null,"ID0937",12465.541681209797,"Analyst","India","All the 8 hours baby, all the 8!",1,"less than 2 years"]
[null,"ID0938",20571,"CXO or Top Mgmt.","Albania","4 to 6 hours a day",8,"5 - 10 years"]
[null,"ID0939",3480,"Manager","Pakistan","All the 8 hours baby, all the 8!",6,"5 - 10 years"]
[null,"ID0940",18060,"Reporting","Philippines","4 to 6 hours a day",12,"more than 10 years"]
[null,"ID0941",30000,"Accountant","iran","2 to 3 hours per day",30,"more than 10 years"]
[null,"ID0943",24000,"Manager","India","4 to 6 hours a day",10,"more than 10 years"]
[null,"ID0944",80289.244544269619,"Consultant","France","4 to 6 hours a day",3,"2 - 5 years"]
[null,"ID0945",70000,"Manager","USA","4 to 6 hours a day",4,"2 - 5 years"]
[null,"ID0946",8547.8000099724322,"Manager","India","2 to 3 hours per day",2,"2 - 5 years"]
[null,"ID0948",10684.750012465542,"Analyst","India","4 to 6 hours a day",11,"more than 10 years"]
[null,"ID0949",10684.750012465542,"Analyst","India","2 to 3 hours per day",4,"2 - 5 years"]
[null,"ID0950",20000,"Accountant","Zambia","All the 8 hours baby, all the 8!",2,"2 - 5 years"]
[null,"ID0951",53356.776437647524,"Consultant","Germany","2 to 3 hours per day",3,"2 - 5 years"]
[null,"ID0952",36000,"Accountant","UAE","4 to 6 hours a day",4.5,"2 - 5 years"]
[null,"ID0953",57000,"Engineer","USA","2 to 3 hours per day",4,"2 - 5 years"]
[null,"ID0954",135000,"Manager","USA","All the 8 hours baby, all the 8!",15,"more than 10 years"]
[null,"ID0955",95279.957924370581,"Analyst","Netherlands","4 to 6 hours a day",4,"2 - 5 years"]
[null,"ID0957",57167.974754622352,"Analyst","Netherlands","2 to 3 hours per day",10,"more than 10 years"]
[null,"ID0958",12326.656394453004,"Manager","Nigeria","4 to 6 hours a day",5,"5 - 10 years"]
[null,"ID0959",8000,"Analyst","India","1 or 2 hours a day",5,"5 - 10 years"]
[null,"ID0960",48000,"Manager","France","4 to 6 hours a day",5,"5 - 10 years"]
[null,"ID0961",40000,"Analyst","New Zealand","4 to 6 hours a day",5,"5 - 10 years"]
[null,"ID0962",59819.107020370408,"Analyst","New Zealand","4 to 6 hours a day",10,"more than 10 years"]
[null,"ID0963",150000,"Analyst","Switzerland","1 or 2 hours a day",20,"more than 10 years"]
[null,"ID0964",81592.772512210868,"Manager","Australia","4 to 6 hours a day",25,"more than 10 years"]
[null,"ID0965",96891.417358250401,"Analyst","Australia","2 to 3 hours per day",20,"more than 10 years"]
[null,"ID0966",91791.869076237213,"Analyst","Australia","4 to 6 hours a day",13,"more than 10 years"]
[null,"ID0967",15000,"Analyst","India","2 to 3 hours per day",2,"2 - 5 years"]
[null,"ID0968",66294.12766617132,"Manager","Australia","2 to 3 hours per day",5,"5 - 10 years"]
[null,"ID0969",101990.96564026357,"Consultant","Australia","All the 8 hours baby, all the 8!",6,"5 - 10 years"]
[null,"ID0970",60000,"Manager","USA","2 to 3 hours per day",3,"2 - 5 years"]
[null,"ID0971",43856.11522531334,"Manager","Australia","All the 8 hours baby, all the 8!",1,"less than 2 years"]
[null,"ID0972",45616,"Analyst","Australia","4 to 6 hours a day",1.5,"less than 2 years"]
[null,"ID0973",75770.868892469181,"Accountant","New Zealand","4 to 6 hours a day",20,"more than 10 years"]
[null,"ID0974",57726.886552389187,"Manager","Australia","2 to 3 hours per day",2,"2 - 5 years"]
[null,"ID0975",20000,"Analyst","Australia","2 to 3 hours per day",2,"2 - 5 years"]
[null,"ID0976",203981.93128052715,"Manager","Australia","4 to 6 hours a day",15,"more than 10 years"]
[null,"ID0977",50995.482820131787,"Controller","Australia","1 or 2 hours a day",5,"5 - 10 years"]
[null,"ID0978",127488.70705032947,"CXO or Top Mgmt.","Australia","4 to 6 hours a day",15,"more than 10 years"]
[null,"ID0979",66294.12766617132,"Analyst","Australia","4 to 6 hours a day",4,"2 - 5 years"]
[null,"ID0980",63234.398696963413,"Analyst","Australia","4 to 6 hours a day",3,"2 - 5 years"]
[null,"ID0981",260000,"CXO or Top Mgmt.","USA","2 to 3 hours per day",10,"more than 10 years"]
[null,"ID0983",112190.06220428993,"Manager","Australia","2 to 3 hours per day",8,"5 - 10 years"]
[null,"ID0984",71393.675948184507,"Manager","Australia","4 to 6 hours a day",7,"5 - 10 years"]
[null,"ID0985",85000,"Reporting","Australia","4 to 6 hours a day",8,{"$f":"IF(ISBLANK(G962),NA(),VLOOKUP(G962,experienceCode,2,1))","v":"5 - 10 years"}]
[null,"ID0986",95871.50770184776,"Analyst","Australia","2 to 3 hours per day",2.5,"2 - 5 years"]
[null,"ID0987",109130.33323508203,"Manager","Australia","4 to 6 hours a day",35,"more than 10 years"]
[null,"ID0988",36000,"Manager","malaysia","1 or 2 hours a day",3,"2 - 5 years"]
[null,"ID0989",122389.15876831629,"Analyst","Australia","4 to 6 hours a day",2,"2 - 5 years"]
[null,"ID0990",53035.30213293706,"Analyst","Australia","4 to 6 hours a day",4,"2 - 5 years"]
[null,"ID0991",125000,"CXO or Top Mgmt.","USA","4 to 6 hours a day",10,"more than 10 years"]
[null,"ID0992",19000,"Analyst","china","4 to 6 hours a day",6,"5 - 10 years"]
[null,"ID0993",93831.688389042494,"Analyst","Australia","All the 8 hours baby, all the 8!",6,"5 - 10 years"]
[null,"ID0994",101990.96564026357,"Analyst","Australia","4 to 6 hours a day",20,"more than 10 years"]
[null,"ID0995",122389.15876831629,"Analyst","Australia","4 to 6 hours a day",5,"5 - 10 years"]
[null,"ID0996",34417.653306061438,"Analyst","Canada","All the 8 hours baby, all the 8!",4,"2 - 5 years"]
[null,"ID0997",12000,"Manager","Asia","All the 8 hours baby, all the 8!",3,"2 - 5 years"]
[null,"ID0998",3632.815004238284,"Manager","India","4 to 6 hours a day",0,"less than 2 years"]
[null,"ID0999",21369.500024931083,"Consultant","India","All the 8 hours baby, all the 8!",6,"5 - 10 years"]
[null,"ID1000",8903.9583437212841,"Analyst","India","4 to 6 hours a day",7,"5 - 10 years"]
[null,"ID1001",15206.427249917633,"Manager","malaysia","4 to 6 hours a day",2,"2 - 5 years"]
[null,"ID1002",143565.85684888897,"Manager","New Zealand","4 to 6 hours a day",25,"more than 10 years"]
[null,"ID1003",9705.3145946561999,"Manager","India","2 to 3 hours per day",6,"5 - 10 years"]
[null,"ID1004",17807.916687442568,"Manager","India","All the 8 hours baby, all the 8!",8,"5 - 10 years"]
[null,"ID1005",3205.4250037396623,"Analyst","India","4 to 6 hours a day",10,"more than 10 years"]
[null,"ID1006",45000,"Accountant","USA","All the 8 hours baby, all the 8!",3,"2 - 5 years"]
[null,"ID1007",12465.541681209797,"Manager","India","2 to 3 hours per day",7,"5 - 10 years"]
[null,"ID1008",95871.50770184776,"Analyst","Australia","2 to 3 hours per day",14,"more than 10 years"]
[null,"ID1009",173384.64158844808,"Consultant","Australia","2 to 3 hours per day",8,"5 - 10 years"]
[null,"ID1010",11575.14584683767,"Manager","India","2 to 3 hours per day",1,"less than 2 years"]
[null,"ID1011",18000,"Specialist","India","All the 8 hours baby, all the 8!",8,"5 - 10 years"]
[null,"ID1012",71393.675948184507,"CXO or Top Mgmt.","Australia","All the 8 hours baby, all the 8!",2,"2 - 5 years"]
[null,"ID1013",6232.7708406048987,"Analyst","India","4 to 6 hours a day",2.5,"2 - 5 years"]
[null,"ID1014",1805.7739622442759,"Manager","Sri Lanka","4 to 6 hours a day",3,"2 - 5 years"]
[null,"ID1015",11397.066679963244,"Analyst","India","All the 8 hours baby, all the 8!",6,"5 - 10 years"]
[null,"ID1016",15000,"Manager","India","4 to 6 hours a day",4,"2 - 5 years"]
[null,"ID1017",37612.869087708088,"Manager","South Africa","All the 8 hours baby, all the 8!",3,"2 - 5 years"]
[null,"ID1018",6499.8895909165376,"Analyst","India","4 to 6 hours a day",3,"2 - 5 years"]
[null,"ID1019",20000,"Reporting","Paraguay","All the 8 hours baby, all the 8!",6,"5 - 10 years"]
[null,"ID1020",7265,"Engineer","India","4 to 6 hours a day",6,"5 - 10 years"]
[null,"ID1021",72571.80269935554,"Manager","Singapore","All the 8 hours baby, all the 8!",15,"more than 10 years"]
[null,"ID1023",8013.5625093491553,"Manager","India","All the 8 hours baby, all the 8!",15,"more than 10 years"]
[null,"ID1024",10150.512511842264,"Analyst","India","4 to 6 hours a day",5,"5 - 10 years"]
[null,"ID1025",65000,"Controller","USA","4 to 6 hours a day",9,"5 - 10 years"]
[null,"ID1026",3184.2266150397395,"Manager","Pakistan","4 to 6 hours a day",4,"2 - 5 years"]
[null,"ID1027",10898.445012714852,"Manager","India","2 to 3 hours per day",13,"more than 10 years"]
[null,"ID1028",10800,"Manager","Pakistan","All the 8 hours baby, all the 8!",5,"5 - 10 years"]
[null,"ID1029",2136.9500024931081,"Analyst","India","2 to 3 hours per day",3.5,"2 - 5 years"]
[null,"ID1030",45000,"Engineer","Singapore","2 to 3 hours per day",4,"2 - 5 years"]
[null,"ID1031",7123.1666749770275,"Manager","India","2 to 3 hours per day",5,"5 - 10 years"]
[null,"ID1032",5342.3750062327708,"Accountant","India","2 to 3 hours per day",5,"5 - 10 years"]
[null,"ID1033",18000,"Manager","India","2 to 3 hours per day",4.5999999999999996,"2 - 5 years"]
[null,"ID1034",4840.0244548604041,"Manager","Pakistan","4 to 6 hours a day",2,"2 - 5 years"]
[null,"ID1035",7479.3250087258784,"Analyst","India","2 to 3 hours per day",10,"more than 10 years"]
[null,"ID1036",3739.6625043629392,"Reporting","India","All the 8 hours baby, all the 8!",3.5,"2 - 5 years"]
[null,"ID1037",42000,"Manager","Kuwait","All the 8 hours baby, all the 8!",5,"5 - 10 years"]
[null,"ID1038",28000,"Reporting","India","2 to 3 hours per day",3,"2 - 5 years"]
[null,"ID1039",6000,"Manager","India","4 to 6 hours a day",5,"5 - 10 years"]
[null,"ID1040",43867.345148271634,"Analyst","New Zealand","All the 8 hours baby, all the 8!",10,"more than 10 years"]
[null,"ID1041",17807.916687442568,"Analyst","India","1 or 2 hours a day",25,"more than 10 years"]
[null,"ID1042",10684.750012465542,"Analyst","India","All the 8 hours baby, all the 8!",12,"more than 10 years"]
[null,"ID1043",60000,"Consultant","Finland","All the 8 hours baby, all the 8!",5,"5 - 10 years"]
[null,"ID1044",8476.5683432226633,"Reporting","India","4 to 6 hours a day",8,"5 - 10 years"]
[null,"ID1045",8700,"Controller","India","2 to 3 hours per day",7,"5 - 10 years"]
[null,"ID1046",3561.5833374885137,"Manager","India","All the 8 hours baby, all the 8!",8,"5 - 10 years"]
[null,"ID1047",3205.4250037396623,"Reporting","India","All the 8 hours baby, all the 8!",4,"2 - 5 years"]
[null,"ID1048",4487.5950052355274,"Accountant","India","1 or 2 hours a day",5,"5 - 10 years"]
[null,"ID1049",12465.541681209797,"Analyst","India","4 to 6 hours a day",5,"5 - 10 years"]
[null,"ID1050",2400,"Accountant","Pakistan","2 to 3 hours per day",15,{"$f":"IF(ISBLANK(G1026),NA(),VLOOKUP(G1026,experienceCode,2,1))","v":"more than 10 years"}]
[null,"ID1051",55000,"Reporting","Israel","4 to 6 hours a day",6,"5 - 10 years"]
[null,"ID1052",12000,"Controller","iran","4 to 6 hours a day",3,"2 - 5 years"]
[null,"ID1053",55262.375596134938,"Manager","Spain","2 to 3 hours per day",10,"more than 10 years"]
[null,"ID1054",21369.500024931083,"Manager","India","2 to 3 hours per day",2,"2 - 5 years"]
[null,"ID1055",40980.635073749385,"Consultant","UK","All the 8 hours baby, all the 8!",8,"5 - 10 years"]
[null,"ID1056",50995.482820131787,"Analyst","Australia","4 to 6 hours a day",4,"2 - 5 years"]
[null,"ID1057",20326.391023865726,"Manager","Greece","All the 8 hours baby, all the 8!",16,"more than 10 years"]
[null,"ID1058",12000,"Consultant","India","2 to 3 hours per day",8,"5 - 10 years"]
[null,"ID1059",29261.227167098674,"Accountant","South Africa","2 to 3 hours per day",20,"more than 10 years"]
[null,"ID1060",14630.613583549337,"CXO or Top Mgmt.","South Africa","4 to 6 hours a day",10,"more than 10 years"]
[null,"ID1061",7265.630008476568,"Accountant","India","All the 8 hours baby, all the 8!",5,"5 - 10 years"]
[null,"ID1062",44132.991617883956,"Analyst","UK","2 to 3 hours per day",16,"more than 10 years"]
[null,"ID1063",9438.1958443445619,"Analyst","India","2 to 3 hours per day",7,"5 - 10 years"]
[null,"ID1064",18000,"Analyst","Poland","4 to 6 hours a day",7,"5 - 10 years"]
[null,"ID1065",3561.5833374885137,"Manager","India","2 to 3 hours per day",5,"5 - 10 years"]
[null,"ID1066",3561.5833374885137,"Reporting","India","4 to 6 hours a day",3,"2 - 5 years"]
[null,"ID1067",5100,"Reporting","India","All the 8 hours baby, all the 8!",8,"5 - 10 years"]
[null,"ID1068",21369.500024931083,"Analyst","India","4 to 6 hours a day",7,"5 - 10 years"]
[null,"ID1069",5342.3750062327708,"Consultant","India","2 to 3 hours per day",1,"less than 2 years"]
[null,"ID1070",50000,"CXO or Top Mgmt.","India","1 or 2 hours a day",26,"more than 10 years"]
[null,"ID1071",28492.66669990811,"Manager","India","All the 8 hours baby, all the 8!",9,"5 - 10 years"]
[null,"ID1072",24588.381044249632,"Analyst","UK","All the 8 hours baby, all the 8!",0,"less than 2 years"]
[null,"ID1074",7000,"Reporting","India","All the 8 hours baby, all the 8!",5,"5 - 10 years"]
[null,"ID1075",7799.8675090998449,"Analyst","India","1 or 2 hours a day",10,"more than 10 years"]
[null,"ID1076",78808.913603364199,"Manager","UK","2 to 3 hours per day",12,"more than 10 years"]
[null,"ID1077",6720,"Reporting","India","4 to 6 hours a day",6,"5 - 10 years"]
[null,"ID1078",4451.9791718606421,"Reporting","India","All the 8 hours baby, all the 8!",3.5,"2 - 5 years"]
[null,"ID1079",47285.348162018527,"Analyst","UK","All the 8 hours baby, all the 8!",15,"more than 10 years"]
[null,"ID1080",7200,"Analyst","India","All the 8 hours baby, all the 8!",10,"more than 10 years"]
[null,"ID1081",44519.791718606422,"CXO or Top Mgmt.","India","4 to 6 hours a day",9,"5 - 10 years"]
[null,"ID1082",2493.1083362419595,"Accountant","India","4 to 6 hours a day",4,"2 - 5 years"]
[null,"ID1083",31523.565441345683,"Analyst","UK","4 to 6 hours a day",1,"less than 2 years"]
[null,"ID1084",21369.500024931083,"Controller","India","4 to 6 hours a day",8,"5 - 10 years"]
[null,"ID1085",126094.26176538273,"Consultant","UK","4 to 6 hours a day",10,"more than 10 years"]
[null,"ID1086",99299.231140238902,"Specialist","UK","2 to 3 hours per day",1,"less than 2 years"]
[null,"ID1087",86689.804963700633,"CXO or Top Mgmt.","UK","2 to 3 hours per day",22,"more than 10 years"]
[null,"ID1088",50000,"Manager","India","2 to 3 hours per day",30,"more than 10 years"]
[null,"ID1089",4273.9000049862161,"Analyst","India","2 to 3 hours per day",3,"2 - 5 years"]
[null,"ID1090",4451.9791718606421,"Reporting","India","2 to 3 hours per day",3,"2 - 5 years"]
[null,"ID1091",10684.750012465542,"Analyst","India","4 to 6 hours a day",10,"more than 10 years"]
[null,"ID1092",63835.220018725006,"Manager","UK","2 to 3 hours per day",25,"more than 10 years"]
[null,"ID1093",36252.100257547536,"Analyst","UK","All the 8 hours baby, all the 8!",5,"5 - 10 years"]
[null,"ID1094",7960,"Manager","India","4 to 6 hours a day",7,"5 - 10 years"]
[null,"ID1095",8903.9583437212841,"Analyst","India","2 to 3 hours per day",23,"more than 10 years"]
[null,"ID1096",50815.977559664309,"Analyst","Netherlands","4 to 6 hours a day",3,"2 - 5 years"]
[null,"ID1097",47285.348162018527,"Analyst","UK","4 to 6 hours a day",4,"2 - 5 years"]
[null,"ID1098",75656.557059229643,"Manager","UK","2 to 3 hours per day",10,"more than 10 years"]
[null,"ID1099",4273.9000049862161,"Accountant","India","All the 8 hours baby, all the 8!",20,"more than 10 years"]
[null,"ID1100",47004.779242689488,"Analyst","Spain","4 to 6 hours a day",11,"more than 10 years"]
[null,"ID1101",47285.348162018527,"Analyst","UK","All the 8 hours baby, all the 8!",10,"more than 10 years"]
[null,"ID1102",91418.339779902482,"Analyst","UK","All the 8 hours baby, all the 8!",8,"5 - 10 years"]
[null,"ID1103",124518.08349331544,"Analyst","UK","2 to 3 hours per day",14,"more than 10 years"]
[null,"ID1104",69213.140283018583,"Analyst","UK","All the 8 hours baby, all the 8!",3,"2 - 5 years"]
[null,"ID1105",3500,"Manager","Pakistan","4 to 6 hours a day",4,"2 - 5 years"]
[null,"ID1107",63047.130882691366,"Manager","UK","1 or 2 hours a day",20,"more than 10 years"]
[null,"ID1108",72412.768022521646,"Manager","Norway","1 or 2 hours a day",15,"more than 10 years"]
[null,"ID1109",50815.977559664309,"Accountant","Portugal","2 to 3 hours per day",10,"more than 10 years"]
[null,"ID1110",21369.500024931083,"Manager","India","2 to 3 hours per day",5,"5 - 10 years"]
[null,"ID1111",55166.239522354947,"Analyst","UK","2 to 3 hours per day",6,"5 - 10 years"]
[null,"ID1112",3205.4250037396623,"Analyst","India","All the 8 hours baby, all the 8!",3,"2 - 5 years"]
[null,"ID1113",10684.750012465542,"Accountant","India","2 to 3 hours per day",8,"5 - 10 years"]
[null,"ID1114",5342.3750062327708,"Analyst","India","4 to 6 hours a day",5,"5 - 10 years"]
[null,"ID1115",118213.37040504631,"Manager","UK","2 to 3 hours per day",10,"more than 10 years"]
[null,"ID1116",12192.177986291113,"Manager","South Africa","All the 8 hours baby, all the 8!",15,{"$f":"IF(ISBLANK(G1090),NA(),VLOOKUP(G1090,experienceCode,2,1))","v":"more than 10 years"}]
[null,"ID1117",70928.022243027779,"CXO or Top Mgmt.","UK","4 to 6 hours a day",8,"5 - 10 years"]
[null,"ID1118",39404.456801682099,"Analyst","UK","4 to 6 hours a day",3,"2 - 5 years"]
[null,"ID1119",18987,"Analyst","Nigeria","All the 8 hours baby, all the 8!",7,"5 - 10 years"]
[null,"ID1120",44921.080753917595,"Manager","UK","1 or 2 hours a day",15,"more than 10 years"]
[null,"ID1121",60000,"Manager","India","All the 8 hours baby, all the 8!",14,"more than 10 years"]
[null,"ID1122",71243.257897441246,"Manager","UK","2 to 3 hours per day",5,"5 - 10 years"]
[null,"ID1123",4487.5950052355274,"Manager","India","1 or 2 hours a day",16,"more than 10 years"]
[null,"ID1124",4314.929445034084,"Accountant","India","4 to 6 hours a day",7,"5 - 10 years"]
[null,"ID1125",3739.6625043629392,"Analyst","India","All the 8 hours baby, all the 8!",1,"less than 2 years"]
[null,"ID1126",76223.966339496474,"Manager","Finland","1 or 2 hours a day",4,"2 - 5 years"]
[null,"ID1127",32666.305522511171,"Manager","UAE","2 to 3 hours per day",12,"more than 10 years"]
[null,"ID1128",19000,"Reporting","UK","All the 8 hours baby, all the 8!",8,"5 - 10 years"]
[null,"ID1129",63519.971949580387,"Engineer","Portugal","2 to 3 hours per day",14,"more than 10 years"]
[null,"ID1130",16027.125018698311,"Manager","India","4 to 6 hours a day",22,"more than 10 years"]
[null,"ID1131",7123.1666749770275,"Reporting","India","4 to 6 hours a day",9,"5 - 10 years"]
[null,"ID1132",2675.675098121621,"Manager","India","2 to 3 hours per day",5,"5 - 10 years"]
[null,"ID1133",23642.674081009263,"Reporting","UK","All the 8 hours baby, all the 8!",2,"2 - 5 years"]
[null,"ID1134",57167.974754622352,"Manager","Spain","4 to 6 hours a day",14,"more than 10 years"]
[null,"ID1135",42739.000049862167,"Manager","India","All the 8 hours baby, all the 8!",10,"more than 10 years"]
[null,"ID1136",5120.2912876821438,"Manager","Philippines","4 to 6 hours a day",2,"2 - 5 years"]
[null,"ID1137",127039.94389916077,"CXO or Top Mgmt.","Spain","1 or 2 hours a day",20,"more than 10 years"]
[null,"ID1138",90000,"Manager","USA","4 to 6 hours a day",5,"5 - 10 years"]
[null,"ID1139",7123.1666749770275,"Engineer","India","1 or 2 hours a day",2,"2 - 5 years"]
[null,"ID1140",10000,"Analyst","India","2 to 3 hours per day",5,"5 - 10 years"]
[null,"ID1141",45709.169889951241,"Analyst","UK","4 to 6 hours a day",14,"more than 10 years"]
[null,"ID1142",3561.5833374885137,"Reporting","India","All the 8 hours baby, all the 8!",5,"5 - 10 years"]
[null,"ID1143",38111.983169748237,"Analyst","Belgium","1 or 2 hours a day",15,"more than 10 years"]
[null,"ID1144",60000,"Analyst","USA","2 to 3 hours per day",4,"2 - 5 years"]
[null,"ID1145",40000,"Engineer","India","2 to 3 hours per day",2,"2 - 5 years"]
[null,"ID1146",15190.15293438851,"Analyst","India","2 to 3 hours per day",6,"5 - 10 years"]
[null,"ID1147",114335.9495092447,"Manager","CEE","2 to 3 hours per day",20,"more than 10 years"]
[null,"ID1148",36252.100257547536,"Manager","UK","4 to 6 hours a day",10,"more than 10 years"]
[null,"ID1149",47285.348162018527,"Accountant","UK","2 to 3 hours per day",5,"5 - 10 years"]
[null,"ID1150",88927.960729412545,"Consultant","Ireland","2 to 3 hours per day",20,"more than 10 years"]
[null,"ID1151",6000,"Accountant","Zambia","All the 8 hours baby, all the 8!",5,"5 - 10 years"]
[null,"ID1152",35000,"Analyst","USA","All the 8 hours baby, all the 8!",20,"more than 10 years"]
[null,"ID1153",55166.239522354947,"Analyst","UK","4 to 6 hours a day",10,"more than 10 years"]
[null,"ID1154",1783.166904422254,"Accountant","Pakistan","4 to 6 hours a day",10,"more than 10 years"]
[null,"ID1155",13500,"Manager","Montenegro","4 to 6 hours a day",13,"more than 10 years"]
[null,"ID1156",59106.685202523156,"Accountant","UK","2 to 3 hours per day",5,"5 - 10 years"]
[null,"ID1157",12608.005014709339,"Manager","India","4 to 6 hours a day",5,"5 - 10 years"]
[null,"ID1158",44654.095718350931,"Accountant","South Africa","All the 8 hours baby, all the 8!",15,"more than 10 years"]
[null,"ID1159",69000,"Analyst","USA","2 to 3 hours per day",20,"more than 10 years"]
[null,"ID1160",6000,"Manager","India","4 to 6 hours a day",6,"5 - 10 years"]
[null,"ID1161",8903.9583437212841,"Manager","India","1 or 2 hours a day",25,"more than 10 years"]
[null,"ID1162",30000,"Manager","Mexico","All the 8 hours baby, all the 8!",17,"more than 10 years"]
[null,"ID1163",8600,"Analyst","India","4 to 6 hours a day",2,"2 - 5 years"]
[null,"ID1164",81600,"Analyst","UK","4 to 6 hours a day",4,"2 - 5 years"]
[null,"ID1165",15404.364569961488,"Analyst","Republica Dominicana","All the 8 hours baby, all the 8!",3,"2 - 5 years"]
[null,"ID1166",63918.498996971248,"Analyst","Canada","4 to 6 hours a day",20,"more than 10 years"]
[null,"ID1167",75000,"Controller","USA","2 to 3 hours per day",20,"more than 10 years"]
[null,"ID1168",59000,"Analyst","USA","4 to 6 hours a day",14,"more than 10 years"]
[null,"ID1169",50000,"Manager","Canada","1 or 2 hours a day",5,"5 - 10 years"]
[null,"ID1170",126094.26176538273,"Controller","UK","4 to 6 hours a day",15,"more than 10 years"]
[null,"ID1171",26691.183012544854,"Manager","Brazil","1 or 2 hours a day",7,"5 - 10 years"]
[null,"ID1172",8903.9583437212841,"Analyst","India","4 to 6 hours a day",0.8,"less than 2 years"]
[null,"ID1173",8725,"Manager","Pakistan","2 to 3 hours per day",18,"more than 10 years"]
[null,"ID1175",50437.70470615309,"Analyst","UK","4 to 6 hours a day",4,"2 - 5 years"]
[null,"ID1176",67775.665698893223,"Accountant","UK","All the 8 hours baby, all the 8!",15,"more than 10 years"]
[null,"ID1177",52118.160720607324,"Analyst","Canada","4 to 6 hours a day",6,"5 - 10 years"]
[null,"ID1178",3561.5833374885137,"Analyst","India","1 or 2 hours a day",6,"5 - 10 years"]
[null,"ID1179",8013.5625093491553,"Manager","India","4 to 6 hours a day",21,"more than 10 years"]
[null,"ID1180",28000,"Manager","Poland","4 to 6 hours a day",5,"5 - 10 years"]
[null,"ID1181",50064.150455673145,"Analyst","UK","2 to 3 hours per day",2,{"$f":"IF(ISBLANK(G1154),NA(),VLOOKUP(G1154,experienceCode,2,1))","v":"2 - 5 years"}]
[null,"ID1182",50437.70470615309,"Analyst","Canada","4 to 6 hours a day",9,"5 - 10 years"]
[null,"ID1183",27840,"Analyst","USA","2 to 3 hours per day",1,"less than 2 years"]
[null,"ID1184",6232.7708406048987,"Accountant","India","2 to 3 hours per day",1.5,"less than 2 years"]
[null,"ID1185",50000,"Engineer","Singapore","2 to 3 hours per day",25,"more than 10 years"]
[null,"ID1186",48000,"Controller","Qatar","2 to 3 hours per day",10,"more than 10 years"]
[null,"ID1187",24000,"Manager","Argentina","4 to 6 hours a day",21,"more than 10 years"]
[null,"ID1188",75000,"Analyst","USA","4 to 6 hours a day",12,"more than 10 years"]
[null,"ID1189",58799.349940520107,"Analyst","Dubai","4 to 6 hours a day",2,"2 - 5 years"]
[null,"ID1190",21228.177433598263,"Consultant","Pakistan","All the 8 hours baby, all the 8!",8,"5 - 10 years"]
[null,"ID1191",60000,"Manager","USA","2 to 3 hours per day",10,"more than 10 years"]
[null,"ID1192",18018.883790212141,"Analyst","Poland","All the 8 hours baby, all the 8!",10,"more than 10 years"]
[null,"ID1193",7200,"Reporting","India","4 to 6 hours a day",7,"5 - 10 years"]
[null,"ID1194",56000,"Analyst","USA","1 or 2 hours a day",2,"2 - 5 years"]
[null,"ID1195",9616.275011218986,"Analyst","India","4 to 6 hours a day",7.9,"5 - 10 years"]
[null,"ID1196",51497.005988023957,"Manager","Kenya","4 to 6 hours a day",9,"5 - 10 years"]
[null,"ID1197",104172.75399731184,"Manager","Netherlands","All the 8 hours baby, all the 8!",25,"more than 10 years"]
[null,"ID1198",88000,"Manager","USA","4 to 6 hours a day",2,"2 - 5 years"]
[null,"ID1199",80000,"Analyst","USA","4 to 6 hours a day",6,"5 - 10 years"]
[null,"ID1200",19000,"Accountant","UK","4 to 6 hours a day",20,"more than 10 years"]
[null,"ID1201",19055.991584874118,"Consultant","italy","4 to 6 hours a day",3,"2 - 5 years"]
[null,"ID1202",8547.8000099724322,"Consultant","India","All the 8 hours baby, all the 8!",15,"more than 10 years"]
[null,"ID1203",19588.708356186824,"Consultant","India","All the 8 hours baby, all the 8!",13,"more than 10 years"]
[null,"ID1204",61000,"Analyst","USA","4 to 6 hours a day",1.5,"less than 2 years"]
[null,"ID1205",53590.061250287661,"Accountant","UK","All the 8 hours baby, all the 8!",10,"more than 10 years"]
[null,"ID1206",53590.061250287661,"Accountant","UK","All the 8 hours baby, all the 8!",10,"more than 10 years"]
[null,"ID1207",4451.9791718606421,"Manager","India","4 to 6 hours a day",1,"less than 2 years"]
[null,"ID1208",25407.988779832154,"Manager","Greece","1 or 2 hours a day",12,"more than 10 years"]
[null,"ID1209",23000,"Accountant","Saudi Arabia","All the 8 hours baby, all the 8!",14,"more than 10 years"]
[null,"ID1210",16027.125018698311,"Manager","India","1 or 2 hours a day",13,"more than 10 years"]
[null,"ID1211",60000,"Engineer","USA","1 or 2 hours a day",6,"5 - 10 years"]
[null,"ID1212",4800,"Analyst","India","4 to 6 hours a day",5,"5 - 10 years"]
[null,"ID1213",106815.148267971,"Manager","Denmark","4 to 6 hours a day",25,"more than 10 years"]
[null,"ID1214",8903.9583437212841,"Consultant","India","2 to 3 hours per day",3,"2 - 5 years"]
[null,"ID1215",60000,"Manager","USA","4 to 6 hours a day",12,"more than 10 years"]
[null,"ID1216",46300.583387350678,"Manager","India","4 to 6 hours a day",4,"2 - 5 years"]
[null,"ID1217",13355.937515581925,"Manager","India","2 to 3 hours per day",3,"2 - 5 years"]
[null,"ID1218",74000,"Specialist","USA","4 to 6 hours a day",10,"more than 10 years"]
[null,"ID1219",95856,"Analyst","USA","2 to 3 hours per day",13,"more than 10 years"]
[null,"ID1220",40000,"Accountant","USA","2 to 3 hours per day",15,"more than 10 years"]
[null,"ID1221",4400,"Manager","Latin America","2 to 3 hours per day",5,"5 - 10 years"]
[null,"ID1222",90000,"Analyst","USA","4 to 6 hours a day",30,"more than 10 years"]
[null,"ID1223",8013.5625093491553,"Manager","India","All the 8 hours baby, all the 8!",2,"2 - 5 years"]
[null,"ID1224",17807.916687442568,"Manager","India","4 to 6 hours a day",8.5,"5 - 10 years"]
[null,"ID1225",12465.541681209797,"Reporting","India","4 to 6 hours a day",6,"5 - 10 years"]
[null,"ID1226",80000,"Analyst","Singapore","1 or 2 hours a day",6,"5 - 10 years"]
[null,"ID1227",100000,"Manager","USA","4 to 6 hours a day",11,"more than 10 years"]
[null,"ID1228",49200,"Accountant","Qatar","2 to 3 hours per day",25,"more than 10 years"]
[null,"ID1229",9000,"Manager","India","4 to 6 hours a day",1,"less than 2 years"]
[null,"ID1230",5342.3750062327708,"Analyst","India","4 to 6 hours a day",6,"5 - 10 years"]
[null,"ID1231",40000,"Manager","Pakistan","4 to 6 hours a day",15,"more than 10 years"]
[null,"ID1232",40980.635073749385,"Analyst","UK","4 to 6 hours a day",2,"2 - 5 years"]
[null,"ID1233",45709.169889951241,"Accountant","UK","2 to 3 hours per day",8,"5 - 10 years"]
[null,"ID1234",7123.1666749770275,"Manager","India","4 to 6 hours a day",1,"less than 2 years"]
[null,"ID1235",100000,"Controller","Norway","4 to 6 hours a day",12,"more than 10 years"]
[null,"ID1236",78764.765217479682,"Analyst","Netherlands","4 to 6 hours a day",15,"more than 10 years"]
[null,"ID1237",152986.44846039536,"Analyst","Australia","2 to 3 hours per day",10,"more than 10 years"]
[null,"ID1238",44463.980364706273,"Analyst","Ireland","All the 8 hours baby, all the 8!",12,"more than 10 years"]
[null,"ID1239",38111.983169748237,"Consultant","Netherlands","1 or 2 hours a day",8,"5 - 10 years"]
[null,"ID1240",118213.37040504631,"Manager","UK","4 to 6 hours a day",20,"more than 10 years"]
[null,"ID1241",39404.456801682099,"Accountant","UK","2 to 3 hours per day",10,"more than 10 years"]
[null,"ID1242",90198.36016840415,"Consultant","Germany","1 or 2 hours a day",3,"2 - 5 years"]
[null,"ID1243",47285.348162018527,"Specialist","UK","4 to 6 hours a day",14,"more than 10 years"]
[null,"ID1244",56000,"Accountant","USA","4 to 6 hours a day",1,"less than 2 years"]
[null,"ID1245",5082.6943786459069,"Analyst","Indonesia","1 or 2 hours a day",2,{"$f":"IF(ISBLANK(G1218),NA(),VLOOKUP(G1218,experienceCode,2,1))","v":"2 - 5 years"}]
[null,"ID1246",53590.061250287661,"Accountant","UK","All the 8 hours baby, all the 8!",10,"more than 10 years"]
[null,"ID1247",76906.906752939132,"CXO or Top Mgmt.","Denmark","All the 8 hours baby, all the 8!",17,"more than 10 years"]
[null,"ID1248",85000,"Analyst","USA","4 to 6 hours a day",5,"5 - 10 years"]
[null,"ID1249",72000,"Consultant","New Zealand","2 to 3 hours per day",10,"more than 10 years"]
[null,"ID1250",55000,"Analyst","USA","1 or 2 hours a day",7,"5 - 10 years"]
[null,"ID1251",67775.665698893223,"Controller","UK","4 to 6 hours a day",25,"more than 10 years"]
[null,"ID1252",40586.590505732565,"Analyst","UK","4 to 6 hours a day",1,"less than 2 years"]
[null,"ID1253",50846,"Analyst","USA","4 to 6 hours a day",25,"more than 10 years"]
[null,"ID1254",63000,"Accountant","USA","All the 8 hours baby, all the 8!",16,"more than 10 years"]
[null,"ID1255",81592.772512210868,"Accountant","Australia","4 to 6 hours a day",5,"5 - 10 years"]
[null,"ID1256",50700,"Analyst","Brazil","1 or 2 hours a day",15,"more than 10 years"]
[null,"ID1257",31523.565441345683,"Analyst","UK","4 to 6 hours a day",1,"less than 2 years"]
[null,"ID1258",70000,"Analyst","USA","1 or 2 hours a day",6,"5 - 10 years"]
[null,"ID1259",63918.498996971248,"Manager","Canada","2 to 3 hours per day",15,"more than 10 years"]
[null,"ID1260",7261.724659606657,"Analyst","Mongolia","All the 8 hours baby, all the 8!",2,"2 - 5 years"]
[null,"ID1261",11404.820437438224,"Engineer","malaysia","4 to 6 hours a day",2,"2 - 5 years"]
[null,"ID1262",120000,"Consultant","Singapore","1 or 2 hours a day",5,"5 - 10 years"]
[null,"ID1263",91791.869076237213,"Analyst","Australia","4 to 6 hours a day",5,"5 - 10 years"]
[null,"ID1264",112190.06220428993,"Analyst","Australia","2 to 3 hours per day",7,"5 - 10 years"]
[null,"ID1265",40000,"Manager","USA","2 to 3 hours per day",18,"more than 10 years"]
[null,"ID1266",107000,"Accountant","USA","4 to 6 hours a day",12,"more than 10 years"]
[null,"ID1267",82000,"Manager","USA","4 to 6 hours a day",10,"more than 10 years"]
[null,"ID1268",101990.96564026357,"Consultant","Australia","4 to 6 hours a day",15,"more than 10 years"]
[null,"ID1270",43000,"Manager","Australia","2 to 3 hours per day",4,"2 - 5 years"]
[null,"ID1271",69000,"Controller","USA","4 to 6 hours a day",20,"more than 10 years"]
[null,"ID1273",30000,"Manager","India","2 to 3 hours per day",3,"2 - 5 years"]
[null,"ID1274",48955.663507326513,"Analyst","Australia","1 or 2 hours a day",2,"2 - 5 years"]
[null,"ID1275",70000,"Manager","USA","4 to 6 hours a day",8,"5 - 10 years"]
[null,"ID1276",45000,"Analyst","USA","4 to 6 hours a day",7,"5 - 10 years"]
[null,"ID1277",35000,"CXO or Top Mgmt.","malaysia","All the 8 hours baby, all the 8!",12,"more than 10 years"]
[null,"ID1278",8903.9583437212841,"Manager","India","2 to 3 hours per day",29,"more than 10 years"]
[null,"ID1279",28353.650809742252,"Manager","malaysia","2 to 3 hours per day",20,"more than 10 years"]
[null,"ID1280",11800,"Analyst","India","4 to 6 hours a day",10,"more than 10 years"]
[null,"ID1281",6410.8500074793246,"Manager","India","All the 8 hours baby, all the 8!",6,"5 - 10 years"]
[null,"ID1282",50000,"Analyst","USA","4 to 6 hours a day",3,"2 - 5 years"]
[null,"ID1283",85000,"Manager","Sri Lanka","All the 8 hours baby, all the 8!",10,"more than 10 years"]
[null,"ID1284",17807.916687442568,"Manager","India","2 to 3 hours per day",10,"more than 10 years"]
[null,"ID1285",16027.125018698311,"Controller","India","All the 8 hours baby, all the 8!",8,"5 - 10 years"]
[null,"ID1286",192000,"CXO or Top Mgmt.","USA","All the 8 hours baby, all the 8!",27,"more than 10 years"]
[null,"ID1287",54000,"Analyst","USA","All the 8 hours baby, all the 8!",6,"5 - 10 years"]
[null,"ID1288",18000,"Manager","India","4 to 6 hours a day",12,"more than 10 years"]
[null,"ID1289",5342.3750062327708,"Reporting","India","2 to 3 hours per day",5,"5 - 10 years"]
[null,"ID1290",7123.1666749770275,"Manager","India","All the 8 hours baby, all the 8!",3,"2 - 5 years"]
[null,"ID1291",15000,"Manager","Myanmar","4 to 6 hours a day",10,"more than 10 years"]
[null,"ID1292",14000,"Analyst","India","4 to 6 hours a day",12,"more than 10 years"]
[null,"ID1294",8000,"Analyst","India","All the 8 hours baby, all the 8!",4,"2 - 5 years"]
[null,"ID1295",12500,"Specialist","Philippines","2 to 3 hours per day",7,"5 - 10 years"]
[null,"ID1296",140000,"Accountant","USA","4 to 6 hours a day",12,"more than 10 years"]
[null,"ID1297",12000,"Consultant","Pakistan","4 to 6 hours a day",1,"less than 2 years"]
[null,"ID1298",38111.983169748237,"Analyst","Belgium","2 to 3 hours per day",15,"more than 10 years"]
[null,"ID1299",10684.750012465542,"Manager","India","2 to 3 hours per day",2,"2 - 5 years"]
[null,"ID1301",6232.7708406048987,"Analyst","India","4 to 6 hours a day",1.5,"less than 2 years"]
[null,"ID1302",45000,"Analyst","Pakistan","All the 8 hours baby, all the 8!",8,"5 - 10 years"]
[null,"ID1303",80000,"Manager","USA","1 or 2 hours a day",6,"5 - 10 years"]
[null,"ID1304",26711.875031163851,"Analyst","India","4 to 6 hours a day",7,"5 - 10 years"]
[null,"ID1305",100000,"Analyst","Uganda","4 to 6 hours a day",17,"more than 10 years"]
[null,"ID1306",69353.856635379227,"Manager","Australia","4 to 6 hours a day",10,"more than 10 years"]
[null,"ID1307",49975.573163729154,"Controller","Australia","4 to 6 hours a day",30,"more than 10 years"]
[null,"ID1308",10239.552095279476,"Manager","India","2 to 3 hours per day",5,"5 - 10 years"]
[null,"ID1309",8903.9583437212841,"Engineer","India","4 to 6 hours a day",2,"2 - 5 years"]
[null,"ID1310",36000,"Analyst","Kuwait","2 to 3 hours per day",10,"more than 10 years"]
[null,"ID1311",3739.6625043629392,"Reporting","India","1 or 2 hours a day",4.5,"2 - 5 years"]
[null,"ID1312",61614.372791092981,"Analyst","Netherlands","4 to 6 hours a day",8,"5 - 10 years"]
[null,"ID1313",3561.5833374885137,"Reporting","India","2 to 3 hours per day",3,{"$f":"IF(ISBLANK(G1282),NA(),VLOOKUP(G1282,experienceCode,2,1))","v":"2 - 5 years"}]
[null,"ID1314",6410.8500074793246,"Analyst","India","All the 8 hours baby, all the 8!",6,"5 - 10 years"]
[null,"ID1315",36206.384011260823,"Analyst","Netherlands","1 or 2 hours a day",5,"5 - 10 years"]
[null,"ID1316",13500,"Manager","India","2 to 3 hours per day",20,"more than 10 years"]
[null,"ID1317",3000,"Accountant","Sri Lanka","4 to 6 hours a day",2,"2 - 5 years"]
[null,"ID1318",21369.500024931083,"Manager","India","4 to 6 hours a day",9,"5 - 10 years"]
[null,"ID1319",10684.750012465542,"Manager","India","2 to 3 hours per day",28,"more than 10 years"]
[null,"ID1320",176585.52201983347,"Manager","Germany","1 or 2 hours a day",25,"more than 10 years"]
[null,"ID1322",54627.175876639136,"Manager","France","All the 8 hours baby, all the 8!",7,"5 - 10 years"]
[null,"ID1323",30489.586535798586,"Controller","italy","4 to 6 hours a day",10,"more than 10 years"]
[null,"ID1324",5591.6858398569666,"Manager","India","1 or 2 hours a day",0.1,"less than 2 years"]
[null,"ID1325",82000,"Consultant","South Africa","4 to 6 hours a day",10,"more than 10 years"]
[null,"ID1326",10000,"Reporting","India","1 or 2 hours a day",0.5,"less than 2 years"]
[null,"ID1327",9000,"Analyst","India","All the 8 hours baby, all the 8!",0.6,"less than 2 years"]
[null,"ID1328",9000,"Analyst","India","4 to 6 hours a day",1,"less than 2 years"]
[null,"ID1329",11753.225013712095,"Manager","India","All the 8 hours baby, all the 8!",7,"5 - 10 years"]
[null,"ID1330",3632.815004238284,"Reporting","India","All the 8 hours baby, all the 8!",2,"2 - 5 years"]
[null,"ID1331",95279.957924370581,"Analyst","Netherlands","All the 8 hours baby, all the 8!",16,"more than 10 years"]
[null,"ID1332",70928.022243027779,"Consultant","UK","2 to 3 hours per day",4,"2 - 5 years"]
[null,"ID1333",52086.37699865592,"Engineer","Spain","4 to 6 hours a day",12,"more than 10 years"]
[null,"ID1334",4897.177089046706,"Manager","India","All the 8 hours baby, all the 8!",4,"2 - 5 years"]
[null,"ID1335",63807.047488395103,"Accountant","New Zealand","All the 8 hours baby, all the 8!",15,"more than 10 years"]
[null,"ID1336",24000,"Manager","Saudi Arabia","4 to 6 hours a day",5,"5 - 10 years"]
[null,"ID1337",60000,"Manager","CEE","All the 8 hours baby, all the 8!",20,"more than 10 years"]
[null,"ID1338",5342.3750062327708,"Analyst","India","All the 8 hours baby, all the 8!",3,"2 - 5 years"]
[null,"ID1339",8903.9583437212841,"Manager","India","2 to 3 hours per day",5,"5 - 10 years"]
[null,"ID1340",40980.635073749385,"Analyst","UK","4 to 6 hours a day",2,"2 - 5 years"]
[null,"ID1341",10684.750012465542,"Manager","India","1 or 2 hours a day",7,"5 - 10 years"]
[null,"ID1342",21369.500024931083,"Consultant","India","2 to 3 hours per day",21,"more than 10 years"]
[null,"ID1343",18000,"Manager","Ghana","4 to 6 hours a day",12,"more than 10 years"]
[null,"ID1344",41000,"Manager","Israel","2 to 3 hours per day",4,"2 - 5 years"]
[null,"ID1345",28492.66669990811,"Analyst","India","2 to 3 hours per day",4,"2 - 5 years"]
[null,"ID1346",49500,"Analyst","USA","4 to 6 hours a day",4.5,"2 - 5 years"]
[null,"ID1347",6600,"Reporting","India","2 to 3 hours per day",6.4,"5 - 10 years"]
[null,"ID1348",110332.47904470989,"Consultant","UK","4 to 6 hours a day",15,"more than 10 years"]
[null,"ID1349",47285.348162018527,"Analyst","UK","All the 8 hours baby, all the 8!",6,"5 - 10 years"]
[null,"ID1350",5300,"Manager","Pakistan","4 to 6 hours a day",5,"5 - 10 years"]
[null,"ID1351",43828.780645210471,"Analyst","Netherlands","4 to 6 hours a day",15,"more than 10 years"]
[null,"ID1352",80000,"Analyst","USA","1 or 2 hours a day",14,"more than 10 years"]
[null,"ID1353",11518.711713336908,"Analyst","Hungary","2 to 3 hours per day",3,"2 - 5 years"]
[null,"ID1354",152986.44846039536,"Analyst","Australia","1 or 2 hours a day",5.5,"5 - 10 years"]
[null,"ID1355",125000,"Manager","USA","4 to 6 hours a day",2,"2 - 5 years"]
[null,"ID1356",101990.96564026357,"Consultant","Australia","1 or 2 hours a day",30,"more than 10 years"]
[null,"ID1357",105000,"CXO or Top Mgmt.","USA","1 or 2 hours a day",15,"more than 10 years"]
[null,"ID1358",50815.977559664309,"Manager","Austria","4 to 6 hours a day",20,"more than 10 years"]
[null,"ID1359",75000,"Analyst","USA","4 to 6 hours a day",7,"5 - 10 years"]
[null,"ID1360",4451.9791718606421,"Analyst","India","All the 8 hours baby, all the 8!",8,"5 - 10 years"]
[null,"ID1361",110000,"Analyst","USA","1 or 2 hours a day",10,"more than 10 years"]
[null,"ID1362",42556.81334581667,"Engineer","UK","4 to 6 hours a day",1,"less than 2 years"]
[null,"ID1363",8013.5625093491553,"Engineer","India","1 or 2 hours a day",7,"5 - 10 years"]
[null,"ID1364",125000,"Manager","USA","4 to 6 hours a day",25,"more than 10 years"]
[null,"ID1365",60000,"Analyst","USA","All the 8 hours baby, all the 8!",12,"more than 10 years"]
[null,"ID1366",39355.495879248076,"Analyst","India","1 or 2 hours a day",5.6,"5 - 10 years"]
[null,"ID1367",57167.974754622352,"Controller","Germany","4 to 6 hours a day",12,"more than 10 years"]
[null,"ID1368",50694.322109187968,"Analyst","Japan","4 to 6 hours a day",8,"5 - 10 years"]
[null,"ID1369",57500,"Manager","USA","4 to 6 hours a day",30,"more than 10 years"]
[null,"ID1370",78764.765217479682,"Controller","Netherlands","4 to 6 hours a day",15,"more than 10 years"]
[null,"ID1371",80000,"Manager","USA","4 to 6 hours a day",10,"more than 10 years"]
[null,"ID1372",70928.022243027779,"Manager","UK","2 to 3 hours per day",15,"more than 10 years"]
[null,"ID1373",33000,"Controller","USA","4 to 6 hours a day",3,"2 - 5 years"]
[null,"ID1374",100000,"Analyst","USA","4 to 6 hours a day",1,"less than 2 years"]
[null,"ID1375",60000,"Manager","USA","2 to 3 hours per day",20,"more than 10 years"]
[null,"ID1376",95000,"Analyst","USA","2 to 3 hours per day",7,"5 - 10 years"]
[null,"ID1377",24000,"Analyst","USA","1 or 2 hours a day",33,"more than 10 years"]
[null,"ID1378",50000,"Engineer","USA","4 to 6 hours a day",0.5,{"$f":"IF(ISBLANK(G1346),NA(),VLOOKUP(G1346,experienceCode,2,1))","v":"less than 2 years"}]
[null,"ID1379",103000,"Controller","USA","4 to 6 hours a day",22,"more than 10 years"]
[null,"ID1380",36000,"Specialist","USA","All the 8 hours baby, all the 8!",8,"5 - 10 years"]
[null,"ID1381",85000,"Analyst","USA","4 to 6 hours a day",17,"more than 10 years"]
[null,"ID1382",100000,"CXO or Top Mgmt.","Sweden","2 to 3 hours per day",20,"more than 10 years"]
[null,"ID1383",83000,"Analyst","Canada","4 to 6 hours a day",12,"more than 10 years"]
[null,"ID1384",85000,"Engineer","USA","2 to 3 hours per day",25,"more than 10 years"]
[null,"ID1385",120000,"Manager","USA","2 to 3 hours per day",5,"5 - 10 years"]
[null,"ID1386",69960,"Engineer","USA","2 to 3 hours per day",22,"more than 10 years"]
[null,"ID1387",97000,"Manager","USA","4 to 6 hours a day",14,"more than 10 years"]
[null,"ID1388",94570.696324037053,"Analyst","UK","4 to 6 hours a day",7,"5 - 10 years"]
[null,"ID1389",39000,"Manager","South Africa","All the 8 hours baby, all the 8!",6,"5 - 10 years"]
[null,"ID1390",4451.9791718606421,"Manager","India","1 or 2 hours a day",15,"more than 10 years"]
[null,"ID1391",62000,"Specialist","USA","All the 8 hours baby, all the 8!",25,"more than 10 years"]
[null,"ID1392",44000,"Engineer","USA","4 to 6 hours a day",15,"more than 10 years"]
[null,"ID1393",150000,"Manager","USA","2 to 3 hours per day",30,"more than 10 years"]
[null,"ID1394",228671.89901848941,"Controller","Europe","4 to 6 hours a day",15,"more than 10 years"]
[null,"ID1395",73500,"Analyst","USA","All the 8 hours baby, all the 8!",6,"5 - 10 years"]
[null,"ID1396",77500,"Analyst","USA","4 to 6 hours a day",7,"5 - 10 years"]
[null,"ID1397",60800,"Analyst","USA","All the 8 hours baby, all the 8!",10,"more than 10 years"]
[null,"ID1398",136000,"Manager","USA","4 to 6 hours a day",10,"more than 10 years"]
[null,"ID1399",20000,"Specialist","India","4 to 6 hours a day",6,"5 - 10 years"]
[null,"ID1400",95000,"Engineer","USA","4 to 6 hours a day",14,"more than 10 years"]
[null,"ID1401",130000,"Manager","USA","1 or 2 hours a day",25,"more than 10 years"]
[null,"ID1402",65000,"Analyst","USA","2 to 3 hours per day",10,"more than 10 years"]
[null,"ID1403",80000,"Consultant","USA","2 to 3 hours per day",8,"5 - 10 years"]
[null,"ID1404",37000,"Reporting","USA","2 to 3 hours per day",30,"more than 10 years"]
[null,"ID1405",40000,"Manager","USA","1 or 2 hours a day",8,"5 - 10 years"]
[null,"ID1406",49000,"Analyst","USA","4 to 6 hours a day",10,"more than 10 years"]
[null,"ID1407",65000,"Analyst","USA","All the 8 hours baby, all the 8!",14,"more than 10 years"]
[null,"ID1408",55000,"Analyst","USA","All the 8 hours baby, all the 8!",1,"less than 2 years"]
[null,"ID1409",40000,"Manager","USA","4 to 6 hours a day",1,"less than 2 years"]
[null,"ID1410",60000,"Analyst","USA","4 to 6 hours a day",15,"more than 10 years"]
[null,"ID1411",45734.379803697877,"Analyst","Ireland","2 to 3 hours per day",4,"2 - 5 years"]
[null,"ID1412",150000,"Analyst","USA","2 to 3 hours per day",30,"more than 10 years"]
[null,"ID1413",88000,"Manager","USA","4 to 6 hours a day",21,"more than 10 years"]
[null,"ID1414",64500,"Analyst","USA","4 to 6 hours a day",13,"more than 10 years"]
[null,"ID1415",57600,"Engineer","Saudi Arabia","4 to 6 hours a day",20,"more than 10 years"]
[null,"ID1416",50000,"Accountant","USA","4 to 6 hours a day",15,"more than 10 years"]
[null,"ID1417",120000,"Manager","USA","2 to 3 hours per day",10,"more than 10 years"]
[null,"ID1418",107000,"Manager","USA","All the 8 hours baby, all the 8!",29,"more than 10 years"]
[null,"ID1419",40000,"Analyst","USA","2 to 3 hours per day",6,"5 - 10 years"]
[null,"ID1420",81000,"Manager","USA","1 or 2 hours a day",12,"more than 10 years"]
[null,"ID1421",45000,"Specialist","USA","4 to 6 hours a day",20,"more than 10 years"]
[null,"ID1422",49000,"Specialist","USA","4 to 6 hours a day",5,"5 - 10 years"]
[null,"ID1423",13355.937515581925,"CXO or Top Mgmt.","India","1 or 2 hours a day",1,"less than 2 years"]
[null,"ID1424",72000,"Manager","USA","1 or 2 hours a day",20,"more than 10 years"]
[null,"ID1425",50000,"Analyst","USA","4 to 6 hours a day",7,"5 - 10 years"]
[null,"ID1426",57678,"Analyst","USA","4 to 6 hours a day",2,"2 - 5 years"]
[null,"ID1427",80442,"Analyst","USA","4 to 6 hours a day",16,"more than 10 years"]
[null,"ID1428",75000,"Manager","USA","1 or 2 hours a day",9,"5 - 10 years"]
[null,"ID1429",61000,"Analyst","USA","4 to 6 hours a day",12,"more than 10 years"]
[null,"ID1430",77000,"Engineer","USA","4 to 6 hours a day",10,"more than 10 years"]
[null,"ID1431",92000,"Controller","USA","2 to 3 hours per day",9,"5 - 10 years"]
[null,"ID1432",72000,"Analyst","USA","All the 8 hours baby, all the 8!",10,"more than 10 years"]
[null,"ID1433",14000,"Consultant","India","4 to 6 hours a day",3,"2 - 5 years"]
[null,"ID1434",111000,"Manager","USA","2 to 3 hours per day",10,"more than 10 years"]
[null,"ID1435",80000,"Analyst","USA","4 to 6 hours a day",20,"more than 10 years"]
[null,"ID1436",57875.729234188344,"Analyst","India","4 to 6 hours a day",5.5,"5 - 10 years"]
[null,"ID1437",25000,"Accountant","India","2 to 3 hours per day",8,"5 - 10 years"]
[null,"ID1438",24000,"Controller","USA","1 or 2 hours a day",2,"2 - 5 years"]
[null,"ID1439",61000,"Manager","USA","2 to 3 hours per day",25,"more than 10 years"]
[null,"ID1440",56095.031102144967,"Analyst","Australia","2 to 3 hours per day",11,"more than 10 years"]
[null,"ID1442",71393.675948184507,"Accountant","Australia","2 to 3 hours per day",5,"5 - 10 years"]
[null,"ID1443",96230,"Manager","USA","4 to 6 hours a day",18,{"$f":"IF(ISBLANK(G1410),NA(),VLOOKUP(G1410,experienceCode,2,1))","v":"more than 10 years"}]
[null,"ID1444",75000,"Analyst","USA","2 to 3 hours per day",1.5,"less than 2 years"]
[null,"ID1445",102000,"Analyst","USA","4 to 6 hours a day",5,"5 - 10 years"]
[null,"ID1446",19008.034062397041,"Manager","malaysia","4 to 6 hours a day",3,"2 - 5 years"]
[null,"ID1447",4356,"Analyst","India","4 to 6 hours a day",5,"5 - 10 years"]
[null,"ID1448",5342.3750062327708,"Accountant","India","4 to 6 hours a day",4,"2 - 5 years"]
[null,"ID1449",67000,"Manager","USA","2 to 3 hours per day",20,"more than 10 years"]
[null,"ID1450",8547.8000099724322,"Analyst","India","4 to 6 hours a day",7,"5 - 10 years"]
[null,"ID1451",16027.125018698311,"Analyst","India","4 to 6 hours a day",4,"2 - 5 years"]
[null,"ID1452",10684.750012465542,"Consultant","India","2 to 3 hours per day",36,"more than 10 years"]
[null,"ID1453",30000,"Accountant","UAE","4 to 6 hours a day",8,"5 - 10 years"]
[null,"ID1454",8903.9583437212841,"Manager","India","2 to 3 hours per day",0,"less than 2 years"]
[null,"ID1455",20000,"Manager","India","Excel ?!? What Excel?",10,"more than 10 years"]
[null,"ID1456",87712.230450626681,"Analyst","Australia","4 to 6 hours a day",10,"more than 10 years"]
[null,"ID1457",17807.916687442568,"Manager","India","All the 8 hours baby, all the 8!",6,"5 - 10 years"]
[null,"ID1458",41000,"Analyst","Japan","2 to 3 hours per day",2,"2 - 5 years"]
[null,"ID1459",60000,"Manager","USA","2 to 3 hours per day",4,"2 - 5 years"]
[null,"ID1460",32187.34988380854,"Analyst","South Africa","All the 8 hours baby, all the 8!",2,"2 - 5 years"]
[null,"ID1461",39879.404680246938,"Engineer","New Zealand","4 to 6 hours a day",5,"5 - 10 years"]
[null,"ID1462",5698.5333399816218,"Analyst","India","2 to 3 hours per day",2,"2 - 5 years"]
[null,"ID1463",7123.1666749770275,"Manager","India","4 to 6 hours a day",6,"5 - 10 years"]
[null,"ID1464",4451.9791718606421,"Manager","India","2 to 3 hours per day",15,"more than 10 years"]
[null,"ID1465",6410.8500074793246,"Analyst","India","2 to 3 hours per day",6,"5 - 10 years"]
[null,"ID1466",20479.104190558952,"Manager","India","All the 8 hours baby, all the 8!",12,"more than 10 years"]
[null,"ID1467",11040.908346214392,"Analyst","India","1 or 2 hours a day",5,"5 - 10 years"]
[null,"ID1468",17807.916687442568,"Specialist","India","2 to 3 hours per day",7,"5 - 10 years"]
[null,"ID1469",3561.5833374885137,"Analyst","India","4 to 6 hours a day",11,"more than 10 years"]
[null,"ID1470",26795.030625143831,"Analyst","UK","2 to 3 hours per day",5,"5 - 10 years"]
[null,"ID1471",20400,"Manager","Myanmar","1 or 2 hours a day",10,"more than 10 years"]
[null,"ID1472",39404.456801682099,"Accountant","UK","4 to 6 hours a day",35,"more than 10 years"]
[null,"ID1473",149907.13380100971,"Analyst","Europe","4 to 6 hours a day",7,"5 - 10 years"]
[null,"ID1474",4095.8208381117906,"Analyst","India","4 to 6 hours a day",1.6,"less than 2 years"]
[null,"ID1475",127488.70705032947,"Accountant","Australia","4 to 6 hours a day",7,"5 - 10 years"]
[null,"ID1476",58318.59606648951,"Manager","UK","All the 8 hours baby, all the 8!",20,"more than 10 years"]
[null,"ID1477",9509.8988293070688,"Controller","South Africa","4 to 6 hours a day",2,"2 - 5 years"]
[null,"ID1478",12821.700014958649,"Analyst","India","4 to 6 hours a day",3,"2 - 5 years"]
[null,"ID1479",4000,"Analyst","India","All the 8 hours baby, all the 8!",6,"5 - 10 years"]
[null,"ID1480",42000,"Analyst","USA","All the 8 hours baby, all the 8!",2,"2 - 5 years"]
[null,"ID1481",3200,"Manager","India","All the 8 hours baby, all the 8!",19,"more than 10 years"]
[null,"ID1482",60000,"Analyst","Turkey","2 to 3 hours per day",10,"more than 10 years"]
[null,"ID1483",85000,"Analyst","USA","4 to 6 hours a day",9,"5 - 10 years"]
[null,"ID1484",109000,"Manager","USA","4 to 6 hours a day",15,"more than 10 years"]
[null,"ID1485",76223.966339496474,"Analyst","italy","All the 8 hours baby, all the 8!",14,"more than 10 years"]
[null,"ID1486",77000,"Engineer","USA","2 to 3 hours per day",13,"more than 10 years"]
[null,"ID1487",25000,"Analyst","India","All the 8 hours baby, all the 8!",4,"2 - 5 years"]
[null,"ID1488",64000,"Manager","USA","2 to 3 hours per day",12,"more than 10 years"]
[null,"ID1489",231119.74856804207,"Engineer","UK","2 to 3 hours per day",10,"more than 10 years"]
[null,"ID1490",76000,"Analyst","USA","All the 8 hours baby, all the 8!",10,"more than 10 years"]
[null,"ID1491",15761.782720672842,"Analyst","UK","2 to 3 hours per day",8,"5 - 10 years"]
[null,"ID1492",168285.09330643489,"Engineer","Australia","2 to 3 hours per day",17,"more than 10 years"]
[null,"ID1493",50000,"Analyst","Kuwait","4 to 6 hours a day",13,"more than 10 years"]
[null,"ID1494",7200,"Controller","Colombia","4 to 6 hours a day",8,"5 - 10 years"]
[null,"ID1495",53356.776437647524,"Consultant","Germany","All the 8 hours baby, all the 8!",7,"5 - 10 years"]
[null,"ID1496",45000,"Specialist","USA","2 to 3 hours per day",10,"more than 10 years"]
[null,"ID1497",5000,"Manager","India","All the 8 hours baby, all the 8!",4,"2 - 5 years"]
[null,"ID1498",75473.31457379504,"Analyst","Australia","All the 8 hours baby, all the 8!",20,"more than 10 years"]
[null,"ID1499",15000,"Manager","Romania","2 to 3 hours per day",5,"5 - 10 years"]
[null,"ID1500",42558.381206218859,"Controller","Germany","All the 8 hours baby, all the 8!",8,"5 - 10 years"]
[null,"ID1501",61000,"Analyst","USA","4 to 6 hours a day",5,"5 - 10 years"]
[null,"ID1502",66000,"Analyst","USA","4 to 6 hours a day",2,"2 - 5 years"]
[null,"ID1503",4950.6008391090336,"Reporting","India","All the 8 hours baby, all the 8!",8,"5 - 10 years"]
[null,"ID1504",55000,"Manager","USA","2 to 3 hours per day",14,"more than 10 years"]
[null,"ID1505",32000,"Reporting","USA","4 to 6 hours a day",10,"more than 10 years"]
[null,"ID1506",18000,"Analyst","India","All the 8 hours baby, all the 8!",6,"5 - 10 years"]
[null,"ID1507",11575.14584683767,"Analyst","India","4 to 6 hours a day",21,{"$f":"IF(ISBLANK(G1474),NA(),VLOOKUP(G1474,experienceCode,2,1))","v":"more than 10 years"}]
[null,"ID1508",63519.971949580387,"Accountant","italy","All the 8 hours baby, all the 8!",15,"more than 10 years"]
[null,"ID1509",71231.666749770273,"Specialist","India","All the 8 hours baby, all the 8!",5,"5 - 10 years"]
[null,"ID1510",10000,"Analyst","Brazil","4 to 6 hours a day",1,"less than 2 years"]
[null,"ID1511",74300,"Analyst","USA","4 to 6 hours a day",3,"2 - 5 years"]
[null,"ID1512",26711.875031163851,"Consultant","India","4 to 6 hours a day",10,"more than 10 years"]
[null,"ID1513",9545.0433444692171,"Manager","India","4 to 6 hours a day",4,"2 - 5 years"]
[null,"ID1514",95000,"Analyst","USA","4 to 6 hours a day",15,"more than 10 years"]
[null,"ID1515",64300,"Accountant","USA","4 to 6 hours a day",15,"more than 10 years"]
[null,"ID1516",250000,"Consultant","USA","All the 8 hours baby, all the 8!",20,"more than 10 years"]
[null,"ID1519",89000,"Manager","USA","2 to 3 hours per day",10,"more than 10 years"]
[null,"ID1520",75000,"Analyst","USA","All the 8 hours baby, all the 8!",1.5,"less than 2 years"]
[null,"ID1521",45000,"Analyst","USA","All the 8 hours baby, all the 8!",5,"5 - 10 years"]
[null,"ID1522",127500,"CXO or Top Mgmt.","USA","All the 8 hours baby, all the 8!",22,"more than 10 years"]
[null,"ID1523",170000,"CXO or Top Mgmt.","USA","2 to 3 hours per day",18,"more than 10 years"]
[null,"ID1524",9600,"Analyst","Bolivia","All the 8 hours baby, all the 8!",2,"2 - 5 years"]
[null,"ID1525",62000,"Analyst","USA","All the 8 hours baby, all the 8!",27,"more than 10 years"]
[null,"ID1526",22000,"Manager","USA","4 to 6 hours a day",3,"2 - 5 years"]
[null,"ID1527",45000,"Analyst","USA","4 to 6 hours a day",8,"5 - 10 years"]
[null,"ID1528",145000,"Analyst","USA","4 to 6 hours a day",6,"5 - 10 years"]
[null,"ID1529",89000,"Analyst","USA","All the 8 hours baby, all the 8!",14,"more than 10 years"]
[null,"ID1530",38000,"Accountant","USA","4 to 6 hours a day",11,"more than 10 years"]
[null,"ID1531",49168.076151516347,"Analyst","Canada","4 to 6 hours a day",3,"2 - 5 years"]
[null,"ID1532",8903.9583437212841,"Analyst","India","4 to 6 hours a day",8,"5 - 10 years"]
[null,"ID1533",10000,"Manager","Vietnam","2 to 3 hours per day",8,"5 - 10 years"]
[null,"ID1534",105000,"Manager","USA","1 or 2 hours a day",30,"more than 10 years"]
[null,"ID1535",12000,"Analyst","MYS","2 to 3 hours per day",0,"less than 2 years"]
[null,"ID1536",3561.5833374885137,"Accountant","India","All the 8 hours baby, all the 8!",3,"2 - 5 years"]
[null,"ID1537",86692.320794224041,"Analyst","Australia","1 or 2 hours a day",5,"5 - 10 years"]
[null,"ID1539",8000,"CXO or Top Mgmt.","India","4 to 6 hours a day",18,"more than 10 years"]
[null,"ID1540",6767.0083412281756,"Analyst","India","2 to 3 hours per day",6,"5 - 10 years"]
[null,"ID1541",48073.437298052166,"Consultant","UK","4 to 6 hours a day",14,"more than 10 years"]
[null,"ID1542",76223.966339496474,"Manager","Netherlands","2 to 3 hours per day",15,"more than 10 years"]
[null,"ID1543",85333.333333333328,"Manager","Saudi Arabia","2 to 3 hours per day",15,"more than 10 years"]
[null,"ID1544",76223.981237173866,"Manager","UK","All the 8 hours baby, all the 8!",8,"5 - 10 years"]
[null,"ID1545",30000,"Manager","Pakistan","4 to 6 hours a day",5,"5 - 10 years"]
[null,"ID1546",34000,"Analyst","India","All the 8 hours baby, all the 8!",4,"2 - 5 years"]
[null,"ID1547",3205.4250037396623,"Manager","India","4 to 6 hours a day",5,"5 - 10 years"]
[null,"ID1548",45000,"Manager","Germany","2 to 3 hours per day",5,"5 - 10 years"]
[null,"ID1549",24864,"Manager","Libya","All the 8 hours baby, all the 8!",8,"5 - 10 years"]
[null,"ID1550",47285.348162018527,"Analyst","UK","4 to 6 hours a day",7,"5 - 10 years"]
[null,"ID1551",17807.916687442568,"Analyst","India","All the 8 hours baby, all the 8!",10,"more than 10 years"]
[null,"ID1552",55166.239522354947,"Analyst","UK","4 to 6 hours a day",3,"2 - 5 years"]
[null,"ID1553",69871.969144538423,"Manager","Netherlands","1 or 2 hours a day",5,"5 - 10 years"]
[null,"ID1554",70970,"Analyst","USA","4 to 6 hours a day",17,"more than 10 years"]
[null,"ID1555",76223.966339496474,"Engineer","Netherlands","4 to 6 hours a day",7,"5 - 10 years"]
[null,"ID1556",110000,"Controller","Norway","All the 8 hours baby, all the 8!",5,"5 - 10 years"]
[null,"ID1557",14400,"Analyst","Bulgaria","All the 8 hours baby, all the 8!",15,"more than 10 years"]
[null,"ID1558",125000,"Consultant","USA","All the 8 hours baby, all the 8!",8,"5 - 10 years"]
[null,"ID1559",72768.752704244194,"Analyst","Canada","4 to 6 hours a day",10,"more than 10 years"]
[null,"ID1560",59000,"Manager","USA","4 to 6 hours a day",15,"more than 10 years"]
[null,"ID1561",71500,"Analyst","USA","4 to 6 hours a day",5,"5 - 10 years"]
[null,"ID1562",39404.456801682099,"Reporting","UK","4 to 6 hours a day",2,"2 - 5 years"]
[null,"ID1563",88927.960729412545,"Specialist","Germany","1 or 2 hours a day",5,"5 - 10 years"]
[null,"ID1564",90000,"Manager","USA","4 to 6 hours a day",25,"more than 10 years"]
[null,"ID1565",12465.541681209797,"Manager","India","All the 8 hours baby, all the 8!",30,"more than 10 years"]
[null,"ID1566",40000,"Analyst","USA","4 to 6 hours a day",8,"5 - 10 years"]
[null,"ID1567",30000,"Analyst","India","All the 8 hours baby, all the 8!",4,"2 - 5 years"]
[null,"ID1569",46325,"Controller","USA","4 to 6 hours a day",1,"less than 2 years"]
[null,"ID1570",15000,"Analyst","USA","All the 8 hours baby, all the 8!",8,"5 - 10 years"]
[null,"ID1571",31200,"Analyst","USA","4 to 6 hours a day",15,"more than 10 years"]
[null,"ID1572",8903.9583437212841,"Analyst","India","4 to 6 hours a day",9,"5 - 10 years"]
[null,"ID1573",15840,"Analyst","Peru","All the 8 hours baby, all the 8!",8,"5 - 10 years"]
[null,"ID1574",15136.729184326183,"Analyst","India","4 to 6 hours a day",5,"5 - 10 years"]
[null,"ID1575",41000,"Consultant","USA","4 to 6 hours a day",10,{"$f":"IF(ISBLANK(G1538),NA(),VLOOKUP(G1538,experienceCode,2,1))","v":"more than 10 years"}]
[null,"ID1576",11000,"Manager","Mexico","4 to 6 hours a day",2,"2 - 5 years"]
[null,"ID1577",55166.239522354947,"CXO or Top Mgmt.","UK","2 to 3 hours per day",30,"more than 10 years"]
[null,"ID1578",5689.2125418690484,"Manager","Philippines","4 to 6 hours a day",15,"more than 10 years"]
[null,"ID1579",17728,"Analyst","Mexico","4 to 6 hours a day",3,"2 - 5 years"]
[null,"ID1580",13745.704467353951,"Controller","Morocco","All the 8 hours baby, all the 8!",8,"5 - 10 years"]
[null,"ID1581",50000,"Accountant","USA","4 to 6 hours a day",15,"more than 10 years"]
[null,"ID1582",78668.921842426149,"Analyst","Canada","4 to 6 hours a day",7,"5 - 10 years"]
[null,"ID1583",85000,"Reporting","USA","4 to 6 hours a day",10,"more than 10 years"]
[null,"ID1584",101990.96564026357,"Manager","Australia","4 to 6 hours a day",20,"more than 10 years"]
[null,"ID1585",100614.72928405051,"Reporting","India","2 to 3 hours per day",6,"5 - 10 years"]
[null,"ID1586",86692.320794224041,"Analyst","Australia","4 to 6 hours a day",30,"more than 10 years"]
[null,"ID1587",122389.15876831629,"Analyst","Australia","2 to 3 hours per day",5,"5 - 10 years"]
[null,"ID1588",6410.8500074793246,"Manager","India","2 to 3 hours per day",8,"5 - 10 years"]
[null,"ID1589",44000,"Analyst","USA","4 to 6 hours a day",3.5,"2 - 5 years"]
[null,"ID1590",4451.9791718606421,"Engineer","India","4 to 6 hours a day",2.5,"2 - 5 years"]
[null,"ID1591",4500,"Analyst","Pakistan","4 to 6 hours a day",6,"5 - 10 years"]
[null,"ID1592",30273.458368652366,"CXO or Top Mgmt.","India","4 to 6 hours a day",6,"5 - 10 years"]
[null,"ID1593",52000,"Analyst","USA","All the 8 hours baby, all the 8!",5,"5 - 10 years"]
[null,"ID1594",75000,"Consultant","Germany","2 to 3 hours per day",9,"5 - 10 years"]
[null,"ID1595",17807.916687442568,"Analyst","India","All the 8 hours baby, all the 8!",4,"2 - 5 years"]
[null,"ID1596",177600,"Accountant","Lesotho","4 to 6 hours a day",6,"5 - 10 years"]
[null,"ID1597",11575.14584683767,"Analyst","India","4 to 6 hours a day",5,"5 - 10 years"]
[null,"ID1598",26678.388218823762,"Manager","Portugal","4 to 6 hours a day",10,"more than 10 years"]
[null,"ID1600",126094.26176538273,"Consultant","UK","4 to 6 hours a day",12,"more than 10 years"]
[null,"ID1601",6000,"Analyst","India","4 to 6 hours a day",2,"2 - 5 years"]
[null,"ID1602",10000,"Reporting","India","All the 8 hours baby, all the 8!",6,"5 - 10 years"]
[null,"ID1603",50000,"Analyst","USA","All the 8 hours baby, all the 8!",2,"2 - 5 years"]
[null,"ID1604",10000,"Manager","India","All the 8 hours baby, all the 8!",12,"more than 10 years"]
[null,"ID1605",50000,"Analyst","USA","All the 8 hours baby, all the 8!",12,"more than 10 years"]
[null,"ID1606",20000,"Manager","India","4 to 6 hours a day",1,"less than 2 years"]
[null,"ID1607",31523.565441345683,"Analyst","UK","All the 8 hours baby, all the 8!",3,"2 - 5 years"]
[null,"ID1608",63519.971949580387,"Controller","Netherlands","4 to 6 hours a day",10,"more than 10 years"]
[null,"ID1609",35063.024516168378,"Controller","Hungary","All the 8 hours baby, all the 8!",15,"more than 10 years"]
[null,"ID1610",55000,"Analyst","USA","4 to 6 hours a day",2,"2 - 5 years"]
[null,"ID1611",38000,"Analyst","USA","All the 8 hours baby, all the 8!",1,"less than 2 years"]
[null,"ID1612",32054.250037396621,"Analyst","India","All the 8 hours baby, all the 8!",1,"less than 2 years"]
[null,"ID1613",35500,"Analyst","USA","4 to 6 hours a day",20,"more than 10 years"]
[null,"ID1614",62000,"Analyst","USA","2 to 3 hours per day",5,"5 - 10 years"]
[null,"ID1615",33887.832849446611,"Analyst","UK","All the 8 hours baby, all the 8!",1,"less than 2 years"]
[null,"ID1616",60000,"Analyst","USA","2 to 3 hours per day",1,"less than 2 years"]
[null,"ID1617",32884,"Analyst","USA","All the 8 hours baby, all the 8!",10,"more than 10 years"]
[null,"ID1618",42000,"Analyst","USA","4 to 6 hours a day",2,"2 - 5 years"]
[null,"ID1619",68000,"Analyst","USA","4 to 6 hours a day",12,"more than 10 years"]
[null,"ID1620",85000,"Accountant","USA","2 to 3 hours per day",8,"5 - 10 years"]
[null,"ID1621",13000,"Analyst","Brazil","All the 8 hours baby, all the 8!",4,"2 - 5 years"]
[null,"ID1623",15000,"Analyst","India","4 to 6 hours a day",5,"5 - 10 years"]
[null,"ID1624",50000,"CXO or Top Mgmt.","India","1 or 2 hours a day",8,"5 - 10 years"]
[null,"ID1625",7000,"Reporting","India","4 to 6 hours a day",1,"less than 2 years"]
[null,"ID1626",140000,"Manager","USA","4 to 6 hours a day",12,"more than 10 years"]
[null,"ID1627",7123.1666749770275,"Analyst","India","1 or 2 hours a day",2.5,"2 - 5 years"]
[null,"ID1628",58318.59606648951,"Analyst","UK","4 to 6 hours a day",9,"5 - 10 years"]
[null,"ID1629",12109.383347460946,"Manager","India","1 or 2 hours a day",2,"2 - 5 years"]
[null,"ID1630",55000,"Analyst","USA","4 to 6 hours a day",1,"less than 2 years"]
[null,"ID1631",60000,"Manager","Indonesia","2 to 3 hours per day",16,"more than 10 years"]
[null,"ID1632",5698.5333399816218,"Manager","India","4 to 6 hours a day",5,"5 - 10 years"]
[null,"ID1633",9376.2513877177607,"Engineer","Mauritius","4 to 6 hours a day",7,"5 - 10 years"]
[null,"ID1634",94570.696324037053,"Analyst","UK","4 to 6 hours a day",5,"5 - 10 years"]
[null,"ID1635",36000,"Consultant","Azerbaijan","4 to 6 hours a day",5,"5 - 10 years"]
[null,"ID1636",65889.291743537498,"Manager","India","All the 8 hours baby, all the 8!",4,"2 - 5 years"]
[null,"ID1637",106000,"Analyst","Denmark","1 or 2 hours a day",7,"5 - 10 years"]
[null,"ID1638",82888.5550559455,"Controller","Denmark","4 to 6 hours a day",18,"more than 10 years"]
[null,"ID1639",59819.107020370408,"Analyst","New Zealand","2 to 3 hours per day",10,"more than 10 years"]
[null,"ID1640",6545,"Manager","India","All the 8 hours baby, all the 8!",9,"5 - 10 years"]
[null,"ID1641",17807.916687442568,"Manager","India","2 to 3 hours per day",13,{"$f":"IF(ISBLANK(G1602),NA(),VLOOKUP(G1602,experienceCode,2,1))","v":"more than 10 years"}]
[null,"ID1642",54000,"CXO or Top Mgmt.","USA","4 to 6 hours a day",10,"more than 10 years"]
[null,"ID1643",100000,"Consultant","USA","2 to 3 hours per day",4,"2 - 5 years"]
[null,"ID1644",49168.076151516347,"Analyst","Canada","4 to 6 hours a day",5,"5 - 10 years"]
[null,"ID1645",4019,"Specialist","Philippines","2 to 3 hours per day",3,"2 - 5 years"]
[null,"ID1646",15000,"Analyst","Pakistan","4 to 6 hours a day",5,"5 - 10 years"]
[null,"ID1647",17807.916687442568,"Analyst","India","All the 8 hours baby, all the 8!",4,"2 - 5 years"]
[null,"ID1648",12000,"Reporting","India","All the 8 hours baby, all the 8!",3,"2 - 5 years"]
[null,"ID1649",2225.989585930321,"Analyst","India","2 to 3 hours per day",4,"2 - 5 years"]
[null,"ID1650",86000,"Analyst","Philippines","All the 8 hours baby, all the 8!",3,"2 - 5 years"]
[null,"ID1651",6054.6916737304728,"Manager","India","4 to 6 hours a day",5,"5 - 10 years"]
[null,"ID1652",3360,"Analyst","India","1 or 2 hours a day",3,"2 - 5 years"]
[null,"ID1653",10000,"CXO or Top Mgmt.","India","All the 8 hours baby, all the 8!",1,"less than 2 years"]
[null,"ID1654",70000,"Analyst","USA","4 to 6 hours a day",9,"5 - 10 years"]
[null,"ID1655",155000,"Manager","USA","1 or 2 hours a day",14,"more than 10 years"]
[null,"ID1656",225000,"CXO or Top Mgmt.","USA","4 to 6 hours a day",15,"more than 10 years"]
[null,"ID1657",10000,"Reporting","India","All the 8 hours baby, all the 8!",2,"2 - 5 years"]
[null,"ID1658",5342.3750062327708,"Analyst","India","4 to 6 hours a day",8,"5 - 10 years"]
[null,"ID1659",85672.4111378214,"Consultant","Australia","4 to 6 hours a day",6,"5 - 10 years"]
[null,"ID1660",4273.9000049862161,"Controller","India","2 to 3 hours per day",15,"more than 10 years"]
[null,"ID1661",8903.9583437212841,"Manager","India","All the 8 hours baby, all the 8!",20,"more than 10 years"]
[null,"ID1662",66199.48742682593,"Manager","UK","4 to 6 hours a day",23,"more than 10 years"]
[null,"ID1663",5698.5333399816218,"Analyst","India","4 to 6 hours a day",2.5,"2 - 5 years"]
[null,"ID1664",34675.92198548025,"Manager","UK","4 to 6 hours a day",17,"more than 10 years"]
[null,"ID1665",31200,"Reporting","Israel","All the 8 hours baby, all the 8!",11,"more than 10 years"]
[null,"ID1666",55068.245289698301,"Consultant","Canada","All the 8 hours baby, all the 8!",1,"less than 2 years"]
[null,"ID1667",13000,"Analyst","Slovakia","All the 8 hours baby, all the 8!",6,"5 - 10 years"]
[null,"ID1668",92000,"Reporting","USA","2 to 3 hours per day",12,"more than 10 years"]
[null,"ID1669",85000,"Manager","USA","All the 8 hours baby, all the 8!",10,"more than 10 years"]
[null,"ID1670",11000,"Analyst","Tunisia","4 to 6 hours a day",8,"5 - 10 years"]
[null,"ID1671",38111.983169748237,"Analyst","Spain","1 or 2 hours a day",12,"more than 10 years"]
[null,"ID1672",49000,"Analyst","USA","2 to 3 hours per day",3,"2 - 5 years"]
[null,"ID1673",59000,"Manager","USA","1 or 2 hours a day",3,"2 - 5 years"]
[null,"ID1674",55000,"Analyst","USA","4 to 6 hours a day",15,"more than 10 years"]
[null,"ID1675",75000,"Accountant","USA","4 to 6 hours a day",10,"more than 10 years"]
[null,"ID1677",50307.817784067665,"Manager","Europe","1 or 2 hours a day",5,"5 - 10 years"]
[null,"ID1678",30500,"Analyst","Brazil","All the 8 hours baby, all the 8!",8,"5 - 10 years"]
[null,"ID1679",80000,"Specialist","USA","2 to 3 hours per day",2,"2 - 5 years"]
[null,"ID1680",12000,"Analyst","USA","2 to 3 hours per day",1,"less than 2 years"]
[null,"ID1681",48500,"Analyst","USA","4 to 6 hours a day",6,"5 - 10 years"]
[null,"ID1682",63047.130882691366,"Specialist","UK","2 to 3 hours per day",25,"more than 10 years"]
[null,"ID1683",3419.1200039889732,"Analyst","India","4 to 6 hours a day",5,"5 - 10 years"]
[null,"ID1684",87734.690296543267,"Manager","New Zealand","4 to 6 hours a day",6,"5 - 10 years"]
[null,"ID1685",56628.754645950656,"Analyst","New Zealand","All the 8 hours baby, all the 8!",6,"5 - 10 years"]
[null,"ID1686",8013.5625093491553,"Reporting","India","All the 8 hours baby, all the 8!",4,"2 - 5 years"]
[null,"ID1687",3561.5833374885137,"Analyst","India","1 or 2 hours a day",16,"more than 10 years"]
[null,"ID1688",62000,"Engineer","USA","2 to 3 hours per day",12,"more than 10 years"]
[null,"ID1689",26678.388218823762,"Analyst","Portugal","4 to 6 hours a day",5,"5 - 10 years"]
[null,"ID1690",70928.022243027779,"Analyst","UK","All the 8 hours baby, all the 8!",5,"5 - 10 years"]
[null,"ID1691",41923.181486723057,"Analyst","France","4 to 6 hours a day",6,"5 - 10 years"]
[null,"ID1692",90000,"Analyst","USA","2 to 3 hours per day",8,"5 - 10 years"]
[null,"ID1693",67700.452577525488,"Analyst","Norway","All the 8 hours baby, all the 8!",5,"5 - 10 years"]
[null,"ID1694",85000,"Analyst","USA","4 to 6 hours a day",12,"more than 10 years"]
[null,"ID1695",78808.913603364199,"CXO or Top Mgmt.","UK","4 to 6 hours a day",10,"more than 10 years"]
[null,"ID1696",65000,"Analyst","USA","4 to 6 hours a day",8,"5 - 10 years"]
[null,"ID1697",75000,"CXO or Top Mgmt.","USA","2 to 3 hours per day",3,"2 - 5 years"]
[null,"ID1698",92000,"Analyst","USA","4 to 6 hours a day",9,"5 - 10 years"]
[null,"ID1699",50815.977559664309,"Analyst","Germany","2 to 3 hours per day",3,"2 - 5 years"]
[null,"ID1700",55954.328658388586,"Accountant","UK","4 to 6 hours a day",8,"5 - 10 years"]
[null,"ID1701",45000,"Analyst","USA","2 to 3 hours per day",4,"2 - 5 years"]
[null,"ID1702",7123.1666749770275,"Analyst","India","4 to 6 hours a day",4,"2 - 5 years"]
[null,"ID1703",49443.946165553374,"Analyst","Belgium","4 to 6 hours a day",1.5,"less than 2 years"]
[null,"ID1704",45000,"CXO or Top Mgmt.","Mexico","4 to 6 hours a day",5,"5 - 10 years"]
[null,"ID1705",60000,"Analyst","USA","All the 8 hours baby, all the 8!",1,"less than 2 years"]
[null,"ID1706",65000,"Analyst","USA","All the 8 hours baby, all the 8!",4,{"$f":"IF(ISBLANK(G1666),NA(),VLOOKUP(G1666,experienceCode,2,1))","v":"2 - 5 years"}]
[null,"ID1707",73000,"Manager","USA","2 to 3 hours per day",6,"5 - 10 years"]
[null,"ID1708",54000,"Analyst","USA","All the 8 hours baby, all the 8!",6,"5 - 10 years"]
[null,"ID1710",81000,"Analyst","USA","4 to 6 hours a day",6,"5 - 10 years"]
[null,"ID1711",10000,"Analyst","USA","4 to 6 hours a day",2,"2 - 5 years"]
[null,"ID1712",42000,"Accountant","USA","4 to 6 hours a day",1,"less than 2 years"]
[null,"ID1713",81592.772512210868,"Specialist","Australia","4 to 6 hours a day",5,"5 - 10 years"]
[null,"ID1714",35401.014829091764,"Analyst","Canada","All the 8 hours baby, all the 8!",2,"2 - 5 years"]
[null,"ID1716",8903.9583437212841,"Analyst","India","4 to 6 hours a day",4,"2 - 5 years"]
[null,"ID1717",10684.750012465542,"Analyst","India","All the 8 hours baby, all the 8!",5,"5 - 10 years"]
[null,"ID1718",8400,"Analyst","Indonesia","4 to 6 hours a day",14,"more than 10 years"]
[null,"ID1719",9794.354178093412,"Manager","India","4 to 6 hours a day",13,"more than 10 years"]
[null,"ID1720",14400,"Engineer","India","1 or 2 hours a day",8,"5 - 10 years"]
[null,"ID1721",2671.1875031163854,"Reporting","India","All the 8 hours baby, all the 8!",3,"2 - 5 years"]
[null,"ID1722",22000,"Manager","India","All the 8 hours baby, all the 8!",6,"5 - 10 years"]
[null,"ID1723",100000,"Analyst","Russia","All the 8 hours baby, all the 8!",6,"5 - 10 years"]
[null,"ID1724",63047.130882691366,"Manager","UK","4 to 6 hours a day",15,"more than 10 years"]
[null,"ID1725",56742.417794422225,"Manager","UK","1 or 2 hours a day",25,"more than 10 years"]
[null,"ID1726",25000,"Analyst","India","All the 8 hours baby, all the 8!",8,"5 - 10 years"]
[null,"ID1727",8903.9583437212841,"Analyst","India","4 to 6 hours a day",2,"2 - 5 years"]
[null,"ID1729",42556.81334581667,"Analyst","UK","4 to 6 hours a day",2,"2 - 5 years"]
[null,"ID1730",131770.4440860638,"Accountant","Canada","All the 8 hours baby, all the 8!",20,"more than 10 years"]
[null,"ID1731",68835.306612122877,"Analyst","Canada","All the 8 hours baby, all the 8!",2,"2 - 5 years"]
[null,"ID1732",6000,"Reporting","Armenia","All the 8 hours baby, all the 8!",5,"5 - 10 years"]
[null,"ID1733",78808.913603364199,"Analyst","UK","2 to 3 hours per day",2,"2 - 5 years"]
[null,"ID1734",7497.1329254133216,"Analyst","India","4 to 6 hours a day",4,"2 - 5 years"]
[null,"ID1735",10000,"Manager","India","4 to 6 hours a day",11,"more than 10 years"]
[null,"ID1736",6410.8500074793246,"Consultant","India","1 or 2 hours a day",2,"2 - 5 years"]
[null,"ID1737",63047.130882691366,"Analyst","UK","4 to 6 hours a day",5,"5 - 10 years"]
[null,"ID1738",61194.579384158147,"Analyst","Australia","2 to 3 hours per day",3,"2 - 5 years"]
[null,"ID1739",115061.01386091174,"Controller","UK","4 to 6 hours a day",8,"5 - 10 years"]
[null,"ID1740",45000,"Analyst","USA","All the 8 hours baby, all the 8!",2,"2 - 5 years"]
[null,"ID1741",36000,"Analyst","USA","4 to 6 hours a day",4,"2 - 5 years"]
[null,"ID1742",68000,"Analyst","USA","4 to 6 hours a day",2.5,"2 - 5 years"]
[null,"ID1743",75000,"Analyst","USA","All the 8 hours baby, all the 8!",5,"5 - 10 years"]
[null,"ID1744",88000,"Analyst","USA","All the 8 hours baby, all the 8!",10,"more than 10 years"]
[null,"ID1745",4594.4425053601826,"Analyst","India","4 to 6 hours a day",4,"2 - 5 years"]
[null,"ID1746",69000,"Analyst","USA","All the 8 hours baby, all the 8!",15,"more than 10 years"]
[null,"ID1747",30000,"Manager","USA","4 to 6 hours a day",1,"less than 2 years"]
[null,"ID1748",80000,"Manager","USA","4 to 6 hours a day",7,"5 - 10 years"]
[null,"ID1749",75000,"Accountant","USA","All the 8 hours baby, all the 8!",1,"less than 2 years"]
[null,"ID1750",31200,"Analyst","Brazil","4 to 6 hours a day",4,"2 - 5 years"]
[null,"ID1751",85000,"Accountant","USA","4 to 6 hours a day",20,"more than 10 years"]
[null,"ID1752",16917.52085307044,"Manager","India","2 to 3 hours per day",9,"5 - 10 years"]
[null,"ID1753",3205.4250037396623,"Reporting","India","4 to 6 hours a day",2,"2 - 5 years"]
[null,"ID1754",60000,"Manager","USA","All the 8 hours baby, all the 8!",2,"2 - 5 years"]
[null,"ID1755",60000,"Manager","USA","All the 8 hours baby, all the 8!",2,"2 - 5 years"]
[null,"ID1756",14246.333349954055,"Manager","India","2 to 3 hours per day",0,"less than 2 years"]
[null,"ID1757",14246.333349954055,"Manager","India","2 to 3 hours per day",0,"less than 2 years"]
[null,"ID1758",28995,"Manager","India","4 to 6 hours a day",6,"5 - 10 years"]
[null,"ID1759",21903.737525554359,"Analyst","India","All the 8 hours baby, all the 8!",3,"2 - 5 years"]
[null,"ID1760",20122.945856810104,"Analyst","India","All the 8 hours baby, all the 8!",3,"2 - 5 years"]
[null,"ID1761",70928.022243027779,"Analyst","UK","All the 8 hours baby, all the 8!",20,"more than 10 years"]
[null,"ID1762",67000,"Manager","USA","4 to 6 hours a day",16,"more than 10 years"]
[null,"ID1763",30000,"Analyst","USA","2 to 3 hours per day",4,"2 - 5 years"]
[null,"ID1764",148102.22862117883,"Manager","Switzerland","2 to 3 hours per day",6,"5 - 10 years"]
[null,"ID1765",71500,"Manager","USA","All the 8 hours baby, all the 8!",11,"more than 10 years"]
[null,"ID1766",67000,"Manager","USA","Excel ?!? What Excel?",6,"5 - 10 years"]
[null,"ID1767",40000,"Analyst","USA","4 to 6 hours a day",5,"5 - 10 years"]
[null,"ID1768",65000,"Manager","USA","4 to 6 hours a day",2,"2 - 5 years"]
[null,"ID1769",72000,"Consultant","USA","2 to 3 hours per day",13,"more than 10 years"]
[null,"ID1770",52500,"Manager","USA","All the 8 hours baby, all the 8!",3,"2 - 5 years"]
[null,"ID1771",5320,"Manager","India","2 to 3 hours per day",5,"5 - 10 years"]
[null,"ID1772",18000,"Accountant","UAE","All the 8 hours baby, all the 8!",3,"2 - 5 years"]
[null,"ID1773",2493.1083362419595,"Misc.","India","4 to 6 hours a day",5,{"$f":"IF(ISBLANK(G1730),NA(),VLOOKUP(G1730,experienceCode,2,1))","v":"5 - 10 years"}]
[null,"ID1774",21342.710575059013,"Accountant","Portugal","4 to 6 hours a day",15,"more than 10 years"]
[null,"ID1775",85000,"Manager","USA","2 to 3 hours per day",15,"more than 10 years"]
[null,"ID1776",80000,"Engineer","Brazil","1 or 2 hours a day",9,"5 - 10 years"]
[null,"ID1777",8903.9583437212841,"Analyst","India","All the 8 hours baby, all the 8!",0,"less than 2 years"]
[null,"ID1778",125000,"Manager","USA","All the 8 hours baby, all the 8!",10,"more than 10 years"]
[null,"ID1779",23150.291693675339,"Manager","India","All the 8 hours baby, all the 8!",9,"5 - 10 years"]
[null,"ID1780",12000,"Engineer","India","2 to 3 hours per day",7,"5 - 10 years"]
[null,"ID1781",30000,"Analyst","malaysia","1 or 2 hours a day",12,"more than 10 years"]
[null,"ID1782",91468.759607395754,"Manager","Croatia","1 or 2 hours a day",3,"2 - 5 years"]
[null,"ID1783",35148.775467100437,"Analyst","UK","All the 8 hours baby, all the 8!",4,"2 - 5 years"]
[null,"ID1784",49153.119414418252,"Manager","UK","4 to 6 hours a day",7,"5 - 10 years"]
[null,"ID1785",2671.1875031163854,"Engineer","India","2 to 3 hours per day",1,"less than 2 years"]
[null,"ID1786",42556.81334581667,"Manager","UK","4 to 6 hours a day",3,"2 - 5 years"]
[null,"ID1787",42556.81334581667,"Manager","UK","4 to 6 hours a day",3,"2 - 5 years"]
[null,"ID1788",74461,"Misc.","USA","1 or 2 hours a day",9,"5 - 10 years"]
[null,"ID1789",41768.724209783031,"Manager","UK","4 to 6 hours a day",16,"more than 10 years"]
[null,"ID1790",8547.8000099724322,"Analyst","India","4 to 6 hours a day",1,"less than 2 years"]
[null,"ID1791",2400,"Analyst","India","2 to 3 hours per day",3,"2 - 5 years"]
[null,"ID1792",3000,"Analyst","Bangladesh","1 or 2 hours a day",12,"more than 10 years"]
[null,"ID1793",11000,"Analyst","India","4 to 6 hours a day",2,"2 - 5 years"]
[null,"ID1794",40000,"Analyst","USA","2 to 3 hours per day",2,"2 - 5 years"]
[null,"ID1795",3600,"Analyst","India","4 to 6 hours a day",1,"less than 2 years"]
[null,"ID1796",56600,"Manager","USA","4 to 6 hours a day",12,"more than 10 years"]
[null,"ID1797",33600,"Analyst","Singapore","All the 8 hours baby, all the 8!",2,"2 - 5 years"]
[null,"ID1798",33600,"Analyst","Singapore","All the 8 hours baby, all the 8!",2,"2 - 5 years"]
[null,"ID1799",100000,"Analyst","USA","All the 8 hours baby, all the 8!",12,"more than 10 years"]
[null,"ID1800",39334.460921213074,"Analyst","Canada","1 or 2 hours a day",1,"less than 2 years"]
[null,"ID1801",7123.1666749770275,"Analyst","India","2 to 3 hours per day",3,"2 - 5 years"]
[null,"ID1802",65000,"Analyst","USA","4 to 6 hours a day",14,"more than 10 years"]
[null,"ID1803",65000,"Analyst","USA","2 to 3 hours per day",10,"more than 10 years"]
[null,"ID1804",65000,"Controller","USA","2 to 3 hours per day",13,"more than 10 years"]
[null,"ID1805",76702.198796365497,"Analyst","Canada","All the 8 hours baby, all the 8!",4,"2 - 5 years"]
[null,"ID1806",63000,"Analyst","USA","All the 8 hours baby, all the 8!",10,"more than 10 years"]
[null,"ID1807",87000,"Misc.","USA","4 to 6 hours a day",3,"2 - 5 years"]
[null,"ID1808",45000,"Analyst","USA","4 to 6 hours a day",4,"2 - 5 years"]
[null,"ID1809",85000,"Analyst","USA","All the 8 hours baby, all the 8!",3,"2 - 5 years"]
[null,"ID1810",159105.90639881117,"Engineer","Australia","2 to 3 hours per day",12,"more than 10 years"]
[null,"ID1811",9972.4333449678379,"Manager","India","2 to 3 hours per day",4,"2 - 5 years"]
[null,"ID1812",14000,"Manager","India","4 to 6 hours a day",5,"5 - 10 years"]
[null,"ID1813",50437.70470615309,"Analyst","UK","4 to 6 hours a day",20,"more than 10 years"]
[null,"ID1814",50437.70470615309,"Analyst","UK","All the 8 hours baby, all the 8!",1,"less than 2 years"]
[null,"ID1815",13603.016099449767,"Manager","Pakistan","All the 8 hours baby, all the 8!",8,"5 - 10 years"]
[null,"ID1816",147886.90017838217,"Controller","Australia","2 to 3 hours per day",15,"more than 10 years"]
[null,"ID1818",4986.216672483919,"Analyst","India","All the 8 hours baby, all the 8!",8,"5 - 10 years"]
[null,"ID1819",4800,"Manager","India","All the 8 hours baby, all the 8!",3,"2 - 5 years"]
[null,"ID1820",8013.5625093491553,"Reporting","India","4 to 6 hours a day",4,"2 - 5 years"]
[null,"ID1821",80000,"Manager","USA","4 to 6 hours a day",2,"2 - 5 years"]
[null,"ID1822",57167.974754622352,"Analyst","Netherlands","2 to 3 hours per day",14,"more than 10 years"]
[null,"ID1823",20000,"Analyst","Canada","2 to 3 hours per day",2,"2 - 5 years"]
[null,"ID1824",70000,"Analyst","USA","2 to 3 hours per day",5,"5 - 10 years"]
[null,"ID1825",214000,"Controller","USA","All the 8 hours baby, all the 8!",20,"more than 10 years"]
[null,"ID1826",78000,"Engineer","USA","All the 8 hours baby, all the 8!",5,"5 - 10 years"]
[null,"ID1827",42307,"Analyst","USA","2 to 3 hours per day",25,"more than 10 years"]
[null,"ID1828",33250,"Manager","USA","All the 8 hours baby, all the 8!",20,"more than 10 years"]
[null,"ID1829",24391.669228638868,"Analyst","italy","4 to 6 hours a day",10,"more than 10 years"]
[null,"ID1830",120000,"Accountant","USA","4 to 6 hours a day",20,"more than 10 years"]
[null,"ID1831",20000,"Analyst","Hong Kong","1 or 2 hours a day",1,"less than 2 years"]
[null,"ID1832",15000,"Analyst","India","2 to 3 hours per day",0.3,"less than 2 years"]
[null,"ID1833",17807.916687442568,"Manager","India","2 to 3 hours per day",10,"more than 10 years"]
[null,"ID1834",16027.125018698311,"Manager","India","2 to 3 hours per day",6,"5 - 10 years"]
[null,"ID1835",56742.417794422225,"Manager","UK","All the 8 hours baby, all the 8!",7,"5 - 10 years"]
[null,"ID1836",21369.500024931083,"Manager","India","4 to 6 hours a day",7,"5 - 10 years"]
[null,"ID1837",7568.3645921630914,"Accountant","India","2 to 3 hours per day",6,"5 - 10 years"]
[null,"ID1838",78808.913603364199,"Accountant","UK","2 to 3 hours per day",10,{"$f":"IF(ISBLANK(G1794),NA(),VLOOKUP(G1794,experienceCode,2,1))","v":"more than 10 years"}]
[null,"ID1839",60000,"Analyst","USA","4 to 6 hours a day",15,"more than 10 years"]
[null,"ID1840",57000,"Accountant","USA","4 to 6 hours a day",9,"5 - 10 years"]
[null,"ID1841",40000,"Analyst","USA","2 to 3 hours per day",0,"less than 2 years"]
[null,"ID1842",80000,"Controller","USA","4 to 6 hours a day",9,"5 - 10 years"]
[null,"ID1843",118000,"CXO or Top Mgmt.","USA","4 to 6 hours a day",6,"5 - 10 years"]
[null,"ID1844",60000,"Analyst","UAE","4 to 6 hours a day",5,"5 - 10 years"]
[null,"ID1845",6720,"Accountant","India","4 to 6 hours a day",5,"5 - 10 years"]
[null,"ID1846",20640,"Manager","Singapore","4 to 6 hours a day",3,"2 - 5 years"]
[null,"ID1847",50000,"Analyst","USA","All the 8 hours baby, all the 8!",15,"more than 10 years"]
[null,"ID1848",24000,"Controller","Russia","All the 8 hours baby, all the 8!",23,"more than 10 years"]
[null,"ID1849",60000,"Analyst","USA","2 to 3 hours per day",3,"2 - 5 years"]
[null,"ID1850",37500,"Consultant","India","All the 8 hours baby, all the 8!",0,"less than 2 years"]
[null,"ID1851",40000,"Specialist","USA","4 to 6 hours a day",1,"less than 2 years"]
[null,"ID1852",85000,"CXO or Top Mgmt.","USA","2 to 3 hours per day",15,"more than 10 years"]
[null,"ID1853",30000,"Analyst","Brazil","2 to 3 hours per day",1,"less than 2 years"]
[null,"ID1854",52801.972114254015,"Engineer","UK","2 to 3 hours per day",7,"5 - 10 years"]
[null,"ID1855",29000,"Engineer","USA","All the 8 hours baby, all the 8!",1,"less than 2 years"]
[null,"ID1857",48000,"Accountant","USA","4 to 6 hours a day",1,"less than 2 years"]
[null,"ID1858",48000,"Accountant","USA","4 to 6 hours a day",1,"less than 2 years"]
[null,"ID1859",8400,"Analyst","Baltic","All the 8 hours baby, all the 8!",0.3,"less than 2 years"]
[null,"ID1860",4808.137505609493,"Manager","India","2 to 3 hours per day",5,"5 - 10 years"]
[null,"ID1861",24931.083362419595,"Manager","India","4 to 6 hours a day",10,"more than 10 years"]
[null,"ID1862",12465.541681209797,"Analyst","India","2 to 3 hours per day",4,"2 - 5 years"]
[null,"ID1863",31523.565441345683,"Accountant","UK","2 to 3 hours per day",10,"more than 10 years"]
[null,"ID1864",17807.916687442568,"Manager","India","All the 8 hours baby, all the 8!",10,"more than 10 years"]
[null,"ID1865",112000,"Manager","USA","2 to 3 hours per day",8,"5 - 10 years"]
[null,"ID1866",11000,"Manager","India","All the 8 hours baby, all the 8!",8,"5 - 10 years"]
[null,"ID1867",114335.9495092447,"Controller","Europe","2 to 3 hours per day",20,"more than 10 years"]
[null,"ID1868",16110,"Analyst","Colombia","All the 8 hours baby, all the 8!",10,"more than 10 years"]
[null,"ID1869",72000,"Manager","USA","4 to 6 hours a day",10,"more than 10 years"]
[null,"ID1870",60000,"Analyst","USA","All the 8 hours baby, all the 8!",10,"more than 10 years"]
[null,"ID1871",67000,"Analyst","USA","4 to 6 hours a day",6,"5 - 10 years"]
[null,"ID1872",54000,"Analyst","USA","4 to 6 hours a day",18,"more than 10 years"]
[null,"ID1873",38666,"Specialist","South Africa","All the 8 hours baby, all the 8!",10,"more than 10 years"]
[null,"ID1874",63000,"Analyst","USA","4 to 6 hours a day",6,"5 - 10 years"]
[null,"ID1875",63000,"Analyst","USA","All the 8 hours baby, all the 8!",1,"less than 2 years"]
[null,"ID1876",6410.8500074793246,"Analyst","India","All the 8 hours baby, all the 8!",2,"2 - 5 years"]
[null,"ID1877",10684.750012465542,"Manager","India","4 to 6 hours a day",12,"more than 10 years"]
[null,"ID1878",40000,"Manager","India","4 to 6 hours a day",5,"5 - 10 years"]
[null,"ID1879",6232.7708406048987,"Analyst","India","4 to 6 hours a day",6,"5 - 10 years"]
[null,"ID1880",41712.231189497601,"Misc.","India","2 to 3 hours per day",12,"more than 10 years"]
[null,"ID1881",12465.541681209797,"Manager","India","2 to 3 hours per day",9,"5 - 10 years"]
[null,"ID1882",32311.654577379326,"Analyst","UK","4 to 6 hours a day",20,"more than 10 years"]
[null,"ID1883",7123.1666749770275,"Analyst","India","1 or 2 hours a day",2,"2 - 5 years"]
[null,"ID1884",100000,"Manager","UAE","All the 8 hours baby, all the 8!",15,"more than 10 years"]
[null,"ID1885",59819.107020370408,"Accountant","New Zealand","4 to 6 hours a day",4,"2 - 5 years"]
[null,"ID1886",25000,"Analyst","India","All the 8 hours baby, all the 8!",1.5,"less than 2 years"]
[null,"ID1887",5000,"Analyst","India","2 to 3 hours per day",10,"more than 10 years"]
[null,"ID1888",64254.308353366054,"Accountant","Australia","All the 8 hours baby, all the 8!",3,"2 - 5 years"]
[null,"ID1889",76223.966339496474,"Manager","Germany","4 to 6 hours a day",6,"5 - 10 years"]
[null,"ID1890",102542.54233725216,"Engineer","Denmark","2 to 3 hours per day",20,"more than 10 years"]
[null,"ID1891",46000,"Analyst","USA","All the 8 hours baby, all the 8!",1,"less than 2 years"]
[null,"ID1892",5000,"Analyst","India","All the 8 hours baby, all the 8!",2,"2 - 5 years"]
[null,"ID1893",77819.106783521114,"Analyst","Australia","All the 8 hours baby, all the 8!",3,"2 - 5 years"]
[null,"ID1894",6232.7708406048987,"Manager","India","2 to 3 hours per day",27,"more than 10 years"]
[null,"ID1895",55166.239522354947,"Analyst","UK","All the 8 hours baby, all the 8!",34,"more than 10 years"]
[null,"ID1896",45000,"Accountant","USA","2 to 3 hours per day",5,"5 - 10 years"]
[null,"ID1897",60000,"Manager","Canada","2 to 3 hours per day",10,"more than 10 years"]
[null,"ID1898",43000,"Analyst","USA","4 to 6 hours a day",5,"5 - 10 years"]
[null,"ID1899",35571.184291765021,"Controller","Spain","4 to 6 hours a day",8,"5 - 10 years"]
[null,"ID1900",48000,"Analyst","USA","4 to 6 hours a day",12,"more than 10 years"]
[null,"ID1901",122389.15876831629,"Manager","Australia","1 or 2 hours a day",8,"5 - 10 years"]
[null,"ID1902",4000,"Analyst","India","2 to 3 hours per day",4,"2 - 5 years"]
[null,"ID1903",4451.9791718606421,"Reporting","India","4 to 6 hours a day",3,{"$f":"IF(ISBLANK(G1858),NA(),VLOOKUP(G1858,experienceCode,2,1))","v":"2 - 5 years"}]
[null,"ID1904",2953.8461538461538,"Reporting","Ethiopia","4 to 6 hours a day",3,"2 - 5 years"]
[null,"ID1905",39404.456801682099,"Analyst","UK","4 to 6 hours a day",3,"2 - 5 years"]
[null,"ID1906",75473.31457379504,"Analyst","Australia","4 to 6 hours a day",8,"5 - 10 years"]
[null,"ID1907",13355.937515581925,"Analyst","India","4 to 6 hours a day",5,"5 - 10 years"]
[null,"ID1908",25000,"Manager","India","4 to 6 hours a day",10,"more than 10 years"]
[null,"ID1909",7479.3250087258784,"Analyst","India","4 to 6 hours a day",2,"2 - 5 years"]
[null,"ID1910",62000,"Analyst","USA","4 to 6 hours a day",4,"2 - 5 years"]
[null,"ID1911",48000,"Analyst","USA","4 to 6 hours a day",1,"less than 2 years"]
[null,"ID1912",5000,"Misc.","India","4 to 6 hours a day",3,"2 - 5 years"]
[null,"ID1914",4914.9850057341491,"Reporting","India","All the 8 hours baby, all the 8!",6,"5 - 10 years"]
[null,"ID1915",75000,"Analyst","USA","1 or 2 hours a day",3,"2 - 5 years"]
[null,"ID1916",4451.9791718606421,"Analyst","India","Excel ?!? What Excel?",1.6,"less than 2 years"]
[null,"ID1917",8400,"Reporting","India","All the 8 hours baby, all the 8!",6,"5 - 10 years"]
[null,"ID1918",20000,"Manager","India","2 to 3 hours per day",5,"5 - 10 years"]
[null,"ID1919",110000,"CXO or Top Mgmt.","USA","4 to 6 hours a day",10,"more than 10 years"]
[null,"ID1920",50000,"Analyst","USA","All the 8 hours baby, all the 8!",3.5,"2 - 5 years"]
[null,"ID1921",46000,"Analyst","USA","4 to 6 hours a day",8,"5 - 10 years"]
[null,"ID1922",115000,"Analyst","USA","All the 8 hours baby, all the 8!",15,"more than 10 years"]
[null,"ID1924",3205.4250037396623,"Analyst","India","4 to 6 hours a day",3,"2 - 5 years"]
[null,"ID1925",76223.966339496474,"Manager","Europe","2 to 3 hours per day",20,"more than 10 years"]
[null,"ID1927",52500,"Analyst","South Africa","4 to 6 hours a day",21,"more than 10 years"]
[null,"ID1928",100800,"CXO or Top Mgmt.","Oman","4 to 6 hours a day",4,"2 - 5 years"]
[null,"ID1929",21000,"Misc.","India","All the 8 hours baby, all the 8!",5,"5 - 10 years"]
[null,"ID1930",40000,"Analyst","USA","1 or 2 hours a day",3,"2 - 5 years"]
[null,"ID1931",46359,"Analyst","USA","All the 8 hours baby, all the 8!",5,"5 - 10 years"]
[null,"ID1932",70000,"Analyst","USA","4 to 6 hours a day",10,"more than 10 years"]

{"sheet":"calcs","index":2,"n_rows":118,"n_cols":34,"rows_kept":118,"cut":false,"hidden":false,"merged":[]}
[null,null,null,null,null,null,null,null,null,null,null,null,"N","Average salary","Minimal salary","Maximum salary","Analyst","Manager","Accountant","Consultant","Reporting","CXO or Top Mgmt.","Engineer","Controller","Specialist","Other","1 or 2 hours a day","2 to 3 hours per day","4 to 6 hours a day","All the 8 hours baby, all the 8!","less than 2 years","2 - 5 years","5 - 10 years","more than 10 years"]
["Annual salary",0,null,null,"Results view",1,null,null,null,null,1,"Australia",{"$f":"COUNTIF(cleanCountry,L2)","v":81},{"$f":"AVERAGEIF(cleanCountry,L2,salary)","v":92857.629854916348},{"$f":"MIN(IF((cleanCountry=L2)*(salary),(salary)))","v":20000},{"$f":"MAX(IF((cleanCountry=L2)*(salary),(salary)))","v":203981.93128052715},{"$f":"AVERAGEIFS(salary,cleanCountry,$L2,jobs,Q$1)","v":86525.394195457935},95631.029699178704,92811.778732639854,103302.27805563841,85000,95191.567930912672,163695.49985262303,82952.652054081045,94851.598045445135,{"$f":"AVERAGEIFS(salary,cleanCountry,$L2,jobs,\"Misc.\")","v":{"$error":"#DIV/0!"}},{"$f":"AVERAGEIFS(salary,cleanCountry,$L2,daily,AA$1)","v":95361.552873646448},95628.80552809863,92107.69655215941,86349.260273434076,{"$f":"AVERAGEIFS(salary,cleanCountry,$L2,experienceR,AE$1)","v":63821.026955192305},69107.321969669923,96019.648027403833,106949.66591313887]
["Currency",0,null,null,"Chosen option",1,null,null,null,null,2,"Canada",58,89799.526836779929,{"$f":"MIN(IF((cleanCountry=L3)*(salary),(salary)))","v":20000},{"$f":"MAX(IF((cleanCountry=L3)*(salary),(salary)))","v":1229201.9037879086},63558.641342985735,70334.475671635926,680486.17393698625,100958.44969778023,{"$error":"#DIV/0!"},98336.152303032693,68835.306612122877,89485.898595759732,51356.055540258822,{"$error":"#DIV/0!"},51689.576581385809,79149.528440328111,120274.76972307677,62644.226356711122,47201.353105455688,47420.708282526313,61830.55707005765,98272.732040540723]
["Country",0,null,null,"Currency",60,null,{"$f":"INDEX(ShortCur,Cur,1)","v":"USD "},null,null,3,"India",565,13529.430894182482,{"$f":"MIN(IF((cleanCountry=L4)*(salary),(salary)))","v":2136.9500024931081},{"$f":"MAX(IF((cleanCountry=L4)*(salary),(salary)))","v":186983.12521814698},11264.716264070179,15642.546484974009,10766.881887825843,13928.395969712297,10314.751394359879,28659.371813410293,12397.82557404629,10468.177151120017,25575.072240782029,17551.33488143489,16770.946604512825,14167.288749398193,12473.728133694358,13088.548672619732,11392.997741956162,9984.8068800292476,13741.650758184494,18437.110281570938]
["Daily hours with excel",0,{"$f":"VLOOKUP(B5,G11:H15,2,0)","v":{"$error":"#N/A"}},null,null,null,null,null,null,null,4,"Netherlands",23,73006.431203838249,{"$f":"MIN(IF((cleanCountry=L5)*(salary),(salary)))","v":36206.384011260823},{"$f":"MAX(IF((cleanCountry=L5)*(salary),(salary)))","v":254079.88779832155},62090.772580714809,76859.166058992269,62564.631571458704,38111.983169748237,254079.88779832155,{"$error":"#DIV/0!"},64790.371388571999,71142.368583530042,{"$error":"#DIV/0!"},{"$error":"#DIV/0!"},48116.37875180714,63519.971949580387,64559.389672391699,117193.84008720021,{"$error":"#DIV/0!"},62567.172370336681,58650.107433445897,72765.656755574862]
["Job type",0,{"$f":"VLOOKUP(B6,G20:H29,2,0)","v":{"$error":"#N/A"}},null,null,null,null,null,null,null,5,"Pakistan",29,11873.552586779413,{"$f":"MIN(IF((cleanCountry=L6)*(salary),(salary)))","v":1783.166904422254},{"$f":"MAX(IF((cleanCountry=L6)*(salary),(salary)))","v":48000},14887,10382.341810335902,4633.3537123836695,12899.157665919436,1910.5359690238436,{"$error":"#DIV/0!"},{"$error":"#DIV/0!"},48000,{"$error":"#DIV/0!"},{"$error":"#DIV/0!"},8457.492502867075,12849.563548671966,11407.528554184761,12763.594562567459,12000,3523.1556472845969,15082.172950207187,12455.027817403708]
["Years of experience","x",{"$f":"VLOOKUP(B7,G16:H19,2,1)","v":{"$error":"#N/A"}},null,null,null,null,null,null,null,6,"South Africa",19,49555.624994016209,{"$f":"MIN(IF((cleanCountry=L7)*(salary),(salary)))","v":9509.8988293070688},{"$f":"MAX(IF((cleanCountry=L7)*(salary),(salary)))","v":131675.52225194403},44070.894052411735,64096.11386518865,36957.661442724799,82000,28500,69815.306791774667,{"$error":"#DIV/0!"},9509.8988293070688,38666,{"$error":"#DIV/0!"},{"$error":"#DIV/0!"},80468.374709521348,46842.003434942941,44880.261819097337,{"$error":"#DIV/0!"},21049.527260490759,39000,56514.857370212238]
[null,null,null,null,null,null,null,null,null,null,7,"UAE",19,43014.900191685309,{"$f":"MIN(IF((cleanCountry=L8)*(salary),(salary)))","v":12000},{"$f":"MAX(IF((cleanCountry=L8)*(salary),(salary)))","v":100000},31677.69952987742,50759.038190313899,27000,{"$error":"#DIV/0!"},{"$error":"#DIV/0!"},{"$error":"#DIV/0!"},36000,70250,{"$error":"#DIV/0!"},{"$error":"#DIV/0!"},36000,47442.050920418529,43830.114017072818,37964,{"$error":"#DIV/0!"},27000,41760,38425.300520288692]
[null,null,null,null,null,null,null,null,null,null,8,"UK",154,67240.730112795849,{"$f":"MIN(IF((cleanCountry=L9)*(salary),(salary)))","v":15761.782720672842},{"$f":"MAX(IF((cleanCountry=L9)*(salary),(salary)))","v":299473.87169278396},57469.44941484111,66390.12811100109,55820.304736452817,83902.612935800164,31939.07519316065,114272.92472487809,81372.725180708847,109281.69352999836,93624.989360796666,{"$error":"#DIV/0!"},69253.332828956292,74438.801726230449,66551.706016528318,57261.833070812085,43195.690938761276,48508.611292371621,59853.879751141329,72256.444261157434]
[null,null,null,null,null,null,null,null,null,null,9,"USA",617,72738.12965964344,{"$f":"MIN(IF((cleanCountry=L10)*(salary),(salary)))","v":10000},{"$f":"MAX(IF((cleanCountry=L10)*(salary),(salary)))","v":400000},62583.737373737371,77581.710344827588,64737.190476190473,98388.888888888891,58200,125615.38461538461,72056.153846153844,87813.23529411765,69800,83820.333333333328,80399.093023255817,76343.612903225803,69667.656028368801,73087.507462686568,50255.5,56053.178571428572,69595.898734177215,84244.258620689652]
["Value of 1 American Dollar","rate","short",null,"Countries Alphabetized",null,1,"I don't work with excel",null,null,null,null,"N","Average salary","Minimal salary","Maximum salary","Australia","Canada","India","Netherlands","Pakistan","South Africa","UAE","UK","USA",null,"1 - 2 hours a day","2 - 3 hours a day","4 - 6 hours a day","8 hours a day","less than 2 years","2 - 5 years","5 - 10 years","more than 10 years"]
["AED - UAE Dirham",3.6735099999999998,"AED ",null,"Albania",null,2,"1 - 2 hours a day",null,null,1,"Analyst",{"$f":"COUNTIF(jobs,L12)","v":743},{"$f":"AVERAGEIF(jobs,L12,salary)","v":46295.769417049465},{"$f":"MIN(IF((jobs=L12)*(salary),(salary)))","v":2136.9500024931081},{"$f":"MAX(IF((jobs=L12)*(salary),(salary)))","v":245840.3807575817},{"$f":"AVERAGEIFS(salary,jobs,$L12,cleanCountry,Q$11)","v":86525.394195457935},63558.641342985735,11264.716264070179,62090.772580714809,14887,44070.894052411735,31677.69952987742,57469.44941484111,62583.737373737371,null,{"$f":"AVERAGEIFS(salary,jobs,$L12,daily,AA$1)","v":43819.276613241374},48572.511802634959,47705.910945881275,42953.141493969306,{"$f":"AVERAGEIFS(salary,jobs,$L12,experienceR,AE$1)","v":29985.144452496188},32113.167990869872,44991.663021882152,57754.270401001217]
["ARS - Argentine Peso",4.4927299999999999,"ARS ",null,"Arabian Gulf",null,3,"2 - 3 hours a day",null,null,2,"Manager",558,46488.240712802522,{"$f":"MIN(IF((jobs=L13)*(salary),(salary)))","v":1805.7739622442759},{"$f":"MAX(IF((jobs=L13)*(salary),(salary)))","v":400000},95631.029699178704,70334.475671635926,15642.546484974009,76859.166058992269,10382.341810335902,64096.11386518865,50759.038190313899,66390.12811100109,77581.710344827588,null,57523.372511980735,48023.281907762757,47649.893196817437,35434.793367824735,18816.755272260274,29779.59077900786,30209.496011182167,57897.645557721371]
["AUD - Australian Dollar",0.98047899999999999,"AUD ",null,"Argentina",null,4,"4 - 6 hours a day",null,null,3,"Accountant",135,54196.440581630908,{"$f":"MIN(IF((jobs=L14)*(salary),(salary)))","v":1783.166904422254},{"$f":"MAX(IF((jobs=L14)*(salary),(salary)))","v":1229201.9037879086},92811.778732639854,680486.17393698625,10766.881887825843,62564.631571458704,4633.3537123836695,36957.661442724799,27000,55820.304736452817,64737.190476190473,null,21800.493274571108,37590.173381888562,69577.608917447331,49121.802390403333,51461.824405800704,20983.87428263704,38024.813853947533,52597.39540166434]
["BDT - Bangladesh Takha",81.827399999999997,"BDT ",null,"Armenia",null,5,"8 hours a day",null,null,4,"Consultant",90,62950.733221147333,{"$f":"MIN(IF((jobs=L15)*(salary),(salary)))","v":2564.3400029917298},{"$f":"MAX(IF((jobs=L15)*(salary),(salary)))","v":250000},103302.27805563841,100958.44969778023,13928.395969712297,38111.983169748237,12899.157665919436,82000,{"$error":"#DIV/0!"},83902.612935800164,98388.888888888891,null,45623.743608740042,64408.616233495886,62042.014526238476,70732.906092761841,23406.757394181619,41876.077014376817,71299.711206247492,69721.07054007714]
["BGN - Bulgarian Lev",1.53952,"BGN ",null,"Aruba",null,0,"less than 2 years",null,null,5,"Reporting",83,19574.158532349131,{"$f":"MIN(IF((jobs=L16)*(salary),(salary)))","v":1910.5359690238436},{"$f":"MAX(IF((jobs=L16)*(salary),(salary)))","v":254079.88779832155},85000,{"$error":"#DIV/0!"},10314.751394359879,254079.88779832155,1910.5359690238436,28500,{"$error":"#DIV/0!"},31939.07519316065,58200,null,13071.865628583842,29495.900281211096,17890.784526711308,18372.109624429639,8467.9861145737614,8713.9349760012465,19206.126951565031,48709.881412850176]
["BND - Brunei dollar",1.2686999999999999,"BND ",null,"Asia",null,2,"2 - 5 years",null,null,6,"CXO or Top Mgmt.",75,97265.875618660837,{"$f":"MIN(IF((jobs=L17)*(salary),(salary)))","v":2671.1875031163854},{"$f":"MAX(IF((jobs=L17)*(salary),(salary)))","v":300000},95191.567930912672,98336.152303032693,28659.371813410293,{"$error":"#DIV/0!"},{"$error":"#DIV/0!"},69815.306791774667,{"$error":"#DIV/0!"},114272.92472487809,125615.38461538461,null,79353.150650823431,120604.48681611959,92455.110590175551,80867.901459188884,11677.968757790963,62466.215862825222,61973.783302978991,110546.01870452715]
["BRL - Brazilian Real",2.0231400000000002,"BRL ",null,"Australia",null,5,"5 - 10 years",null,null,7,"Engineer",74,51715.151424567106,{"$f":"MIN(IF((jobs=L18)*(salary),(salary)))","v":2671.1875031163854},{"$f":"MAX(IF((jobs=L18)*(salary),(salary)))","v":231119.74856804207},163695.49985262303,68835.306612122877,12397.82557404629,64790.371388571999,{"$error":"#DIV/0!"},{"$error":"#DIV/0!"},36000,81372.725180708847,72056.153846153844,null,35352.128189328781,66672.181292013527,48909.206300963764,40859.416668744256,31057.000212233263,20289.647698607962,34472.221580402766,89451.227472423532]
["BWP - Botswana Pula",7.6569700000000003,"BWP ",null,"Austria",null,10,"more than 10 years",null,null,8,"Controller",67,65103.929025765538,{"$f":"MIN(IF((jobs=L19)*(salary),(salary)))","v":2564.3400029917298},{"$f":"MAX(IF((jobs=L19)*(salary),(salary)))","v":228671.89901848941},82952.652054081045,89485.898595759732,10468.177151120017,71142.368583530042,48000,9509.8988293070688,70250,109281.69352999836,87813.23529411765,null,37497.741410065893,77495.728807803403,63312.757112221705,60376.61241065192,46325,14547.076729816448,46502.913933642485,82873.855317971058]
["CAD - Canadian Dollar",1.01692,"CAD ",null,"Azerbaijan",null,1,"Analyst",null,null,9,"Specialist",51,59812.969274133829,{"$f":"MIN(IF((jobs=L20)*(salary),(salary)))","v":4019},{"$f":"MAX(IF((jobs=L20)*(salary),(salary)))","v":400000},94851.598045445135,51356.055540258822,25575.072240782029,{"$error":"#DIV/0!"},{"$error":"#DIV/0!"},38666,{"$error":"#DIV/0!"},93624.989360796666,69800,null,50194.807316444319,52440.784144524114,49273.750208691337,90591.378265071427,69649.615570119451,42009.5,42115.704645663667,56373.536602126296]
["CHF - Swiss Franc",0.94529300000000005,"CHF ",null,"Baltic",null,2,"Manager",null,null,10,"Misc.",7,45952.334217962794,{"$f":"MIN(IF((jobs=L21)*(salary),(salary)))","v":2493.1083362419595},{"$f":"MAX(IF((jobs=L21)*(salary),(salary)))","v":90000},{"$error":"#DIV/0!"},{"$error":"#DIV/0!"},17551.33488143489,{"$error":"#DIV/0!"},{"$error":"#DIV/0!"},{"$error":"#DIV/0!"},{"$error":"#DIV/0!"},{"$error":"#DIV/0!"},83820.333333333328,null,82230.5,41712.231189497601,31497.70277874732,21000,{"$error":"#DIV/0!"},46000,32651.369445413988,41712.231189497601]
["CLP - Chilean Peso",497.26799999999997,"CLP ",null,"Bangladesh",null,3,"Accountant"]
["CNY - Chinese Yuan",6.3609099999999996,"CNY ",null,"Belgium",null,4,"Consultant"]
["COP - Colombian Peso",1769.79,"COP ",null,"Bermuda",null,5,"Reporting"]
["CRC - Costarican colon",498.05,"CRC",null,"Bhutan",null,6,"CXO or Top Mgmt.",null,null,null,null,"Average pay","Help1","Help2",null,null,null,"Average pay","Help1","Help2"]
["DKK - Danish Krone",5.8512300000000002,"DKK ",null,"Bolivia",null,7,"Engineer",null,null,null,null,{"$f":"MAX(M27:M36,B2)","v":163695.49985262303},{"$f":"MAX(M27:M36,B2)","v":163695.49985262303},{"$f":"IF(CHOOSE(view,K26=$B$6,L26=$B$4),N24*0.025,0)","v":0},null,1,"1 or 2 hours a day",{"$f":"IFERROR(INDEX(IF(view=1,$AA$2:$AD$10,$AA$12:$AD$21),ChoOpt,Q26),0)*INDEX(RateCur,Cur,1)","v":95361.552873646448},{"$f":"IF(Q26=$B$5,IF($B$2-U26>0,$B$2-U26,0),0)*INDEX(RateCur,Cur,1)","v":0},{"$f":"IF(Q26=$B$5,$T$30*0.025,0)","v":0}]
["DOP - Dominican Peso",38.950000000000003,"DOP ",null,"Brasil",null,8,"Controller",null,null,1,{"$f":"IF(view=1,INDEX($L$12:$L$21,K27,1),INDEX($L$2:$L$10,K27,1))","v":"Analyst"},{"$f":"IFERROR(INDEX(IF(view=1,$Q$2:$Z$10,$Q$12:$Y$21),ChoOpt,K27),0)*INDEX(RateCur,Cur,1)","v":86525.394195457935},{"$f":"IF(CHOOSE(view,K27=$B$6,L27=$B$4),IF($B$2-O27>0,$B$2-O27,0),0)*INDEX(RateCur,Cur,1)","v":0},{"$f":"IF(CHOOSE(view,K27=$B$6,L27=$B$4),$N$26*0.025,0)","v":0},null,2,"2 to 3 hours per day",{"$f":"IFERROR(INDEX(IF(view=1,$AA$2:$AD$10,$AA$12:$AD$21),ChoOpt,Q27),0)*INDEX(RateCur,Cur,1)","v":95628.80552809863},{"$f":"IF(Q27=$B$5,IF($B$2-U27>0,$B$2-U27,0),0)*INDEX(RateCur,Cur,1)","v":0},{"$f":"IF(Q27=$B$5,$T$30*0.025,0)","v":0}]
["EGP - Egyptian Pound",6.0510000000000002,"EGP",null,"Brazil",null,9,"Specialist",null,null,2,"Manager",95631.029699178704,0,0,null,3,"4 to 6 hours a day",{"$f":"IFERROR(INDEX(IF(view=1,$AA$2:$AD$10,$AA$12:$AD$21),ChoOpt,Q28),0)*INDEX(RateCur,Cur,1)","v":92107.69655215941},{"$f":"IF(Q28=$B$5,IF($B$2-U28>0,$B$2-U28,0),0)*INDEX(RateCur,Cur,1)","v":0},0]
["ETB - Ethiopian Birr",17.68,"ETB ",null,"Bulgaria",null,10,"Misc.",null,null,3,"Accountant",92811.778732639854,0,0,null,4,"All the 8 hours baby, all the 8!",{"$f":"IFERROR(INDEX(IF(view=1,$AA$2:$AD$10,$AA$12:$AD$21),ChoOpt,Q29),0)*INDEX(RateCur,Cur,1)","v":86349.260273434076},{"$f":"IF(Q29=$B$5,IF($B$2-U29>0,$B$2-U29,0),0)*INDEX(RateCur,Cur,1)","v":0},0]
["EUR - Euro",0.78715400000000002,"EUR ",null,"Cambodia",null,null,null,null,null,4,"Consultant",103302.27805563841,0,0,null,null,null,{"$f":"MAX(S26:S29,B2)","v":95628.80552809863},{"$f":"MAX(S26:S29,B2)","v":95628.80552809863},0]
["GBP - British Pound",0.63444599999999995,"GBP ",null,"Canada",null,null,null,null,null,5,"Reporting",85000,0,0]
["HKD - Hong Kong Dollar",7.7588900000000001,"HKD ",null,"Cee",null,null,null,null,null,6,"CXO or Top Mgmt.",95191.567930912672,0,0]
["HRK - Croatian Kuna",5.9367099999999997,"HRK ",null,"Central America",null,null,null,null,null,7,"Engineer",163695.49985262303,0,0]
["HUF - Hungarian Forint",225.874,"HUF ",null,"China",null,null,null,null,null,8,"Controller",82952.652054081045,0,0]
["IDR - Indonesian Rupiah",9443.81,"IDR ",null,"Colombia",null,null,null,null,null,9,"Specialist",94851.598045445135,0,0,null,null,null,"Average pay","Help1","Help2"]
["ILS - Israeli New Shekel",3.86721,"ILS ",null,"Costa Rica",null,null,null,null,null,10,{"$f":"IFERROR(IF(view=1,INDEX($L$12:$L$21,K36,1),INDEX($L$2:$L$10,K36,1)),\"\")","v":"Misc."},0,0,0,null,1,"less than 2 years",{"$f":"IFERROR(INDEX(IF(view=1,$AE$2:$AH$10,$AE$12:$AH$21),ChoOpt,Q36),0)*INDEX(RateCur,Cur,1)","v":63821.026955192305},{"$f":"IF(R36=$C$7,IF($B$2-U36>0,$B$2-U36,0),0)*INDEX(RateCur,Cur,1)","v":{"$error":"#N/A"}},{"$f":"IF(R36=$C$7,$T$40*0.025,0)","v":{"$error":"#N/A"}}]
["INR - Indian Rupee",56.154800000000002,"INR ",null,"Croatia",null,null,null,null,null,null,null,null,null,null,null,2,"2 - 5 years",{"$f":"IFERROR(INDEX(IF(view=1,$AE$2:$AH$10,$AE$12:$AH$21),ChoOpt,Q37),0)*INDEX(RateCur,Cur,1)","v":69107.321969669923},{"$f":"IF(R37=$C$7,IF($B$2-U37>0,$B$2-U37,0),0)*INDEX(RateCur,Cur,1)","v":{"$error":"#N/A"}},{"$f":"IF(R37=$C$7,$T$40*0.025,0)","v":{"$error":"#N/A"}}]
["ISK - Iceland Krona",124.697,"ISK ",null,"Czech Republic",null,null,null,null,null,null,null,null,null,null,null,3,"5 - 10 years",{"$f":"IFERROR(INDEX(IF(view=1,$AE$2:$AH$10,$AE$12:$AH$21),ChoOpt,Q38),0)*INDEX(RateCur,Cur,1)","v":96019.648027403833},{"$f":"IF(R38=$C$7,IF($B$2-U38>0,$B$2-U38,0),0)*INDEX(RateCur,Cur,1)","v":{"$error":"#N/A"}},{"$error":"#N/A"}]
["JPY - Japanese Yen",78.904300000000006,"JPY ",null,"Denmark",null,null,null,null,null,null,null,null,null,null,null,4,"more than 10 years",{"$f":"IFERROR(INDEX(IF(view=1,$AE$2:$AH$10,$AE$12:$AH$21),ChoOpt,Q39),0)*INDEX(RateCur,Cur,1)","v":106949.66591313887},{"$f":"IF(R39=$C$7,IF($B$2-U39>0,$B$2-U39,0),0)*INDEX(RateCur,Cur,1)","v":{"$error":"#N/A"}},{"$error":"#N/A"}]
["KES - Kenyan Shilling",83.5,"KES",null,"Dominican Republic",null,null,null,null,null,null,null,null,null,null,null,null,null,{"$f":"MAX(S36:S39,B2)","v":106949.66591313887},{"$f":"MAX(S36:S39,B2)","v":106949.66591313887},0]
["KRW - South Korean Won",1151.0899999999999,"KRW ",null,"Dubai"]
["KWD - Kuwaiti Dinar",0.27939999999999998,"KWD ",null,"Egypt",null,null,null,null,null,"Respondents in sample",{"$f":"INDEX(CHOOSE(view,$M$2:$P$10,$M$12:$P$21),ChoOpt,1)","v":81}]
["KZT - Kazakhstani Tenge",148.88,"KZT ",null,"Estonia",null,null,null,null,null,"Average salary",{"$f":"INDEX(CHOOSE(view,$M$2:$P$10,$M$12:$P$21),ChoOpt,2)*INDEX(RateCur,Cur,1)","v":92857.629854916348},{"$f":"ROUND(L43,0)&\" \"&$H$4","v":"92858 USD "}]
["LKR - Sri Lanka Rupee",132.90700000000001,"LKR ",null,"Ethiopia",null,null,null,null,null,"Minimal salary",{"$f":"INDEX(CHOOSE(view,$M$2:$P$10,$M$12:$P$21),ChoOpt,3)*INDEX(RateCur,Cur,1)","v":20000},{"$f":"ROUND(L44,0)&\" \"&$H$4","v":"20000 USD "}]
["LTL - Lithuanian Litas",2.7178800000000001,"LTL ",null,"Europe",null,null,null,null,null,"Maximum salry",{"$f":"INDEX(CHOOSE(view,$M$2:$P$10,$M$12:$P$21),ChoOpt,4)*INDEX(RateCur,Cur,1)","v":203981.93128052715},{"$f":"ROUND(L45,0)&\" \"&$H$4","v":"203982 USD "}]
["LVL - Latvian Lat",0.548489,"LVL ",null,"Finland"]
["LYD - Libyan Dinar",1.9323999999999999,"LYD ",null,"France",null,null,null,null,null,{"$f":"IF(view=1,\"Working in \",\"Working as \")&INDEX(CHOOSE(view,L2:L10,L12:L21),ChoOpt,1)","v":"Working in Australia"}]
["MAD - Moroccan Dirham",8.73,"MAD ",null,"Germany"]
["MNT - Mongolian Tughrik",1322,"MNT",null,"Ghana"]
["MUR - Mauritius Rupee",30.715900000000001,"MUR ",null,"Greece"]
["MXN - Mexican Peso",13.6899,"MXN ",null,"Guyana"]
["MYR - Malaysian Ringgit",3.1565599999999998,"MYR ",null,"Hong Kong"]
["NAIRA - Nigerian Naira",162.25,"NAIRA ",null,"Hungary"]
["NOK - Norwegian Kroner",5.9083800000000002,"NOK ",null,"Iceland"]
["NPR - Nepalese Rupee",89.65,"NPR ",null,"India"]
["NZD - New Zealand Dollar",1.2537799999999999,"NZD ",null,"Indonesia"]
["OMR - Omani Rial",0.38450000000000001,"OMR ",null,"Iran"]
["PHP - Philippine Peso",42.185099999999998,"PHP ",null,"Ireland"]
["PKR - Pakistan Rupee",94.214399999999998,"PKR ",null,"Israel"]
["PLN - Polish Zloty",3.3298399999999999,"PLN ",null,"Italy"]
["QAR - Qatari Rial",3.64,"QAR ",null,"Japan"]
["RON - Romanian Leu",3.5135399999999999,"RON ",null,"Kenya"]
["RUB - Russian Ruble",32.5458,"RUB ",null,"Kuwait"]
["SAR - Saudi Riyal",3.75,"SAR ",null,"Kuwait "]
["SEK - Swedish Krona",6.9611099999999997,"SEK ",null,"Latin America"]
["SGD - Singapore Dollar",1.2677099999999999,"SGD ",null,"Lesotho"]
["THB - Thai Baht",31.500299999999999,"THB ",null,"Libya"]
["TRY - Turkish Lira",1.79447,"TRY ",null,"Lithuania"]
["TTD - Trinidad/Tobago Dollar",6.3912199999999997,"TTD ",null,"Malaysia"]
["TWD - Taiwan Dollar",29.859400000000001,"TWD ",null,"Mauritius"]
["USD - American Dollar",1,"USD ",null,"Mexico"]
["VEF - Venezuelan Bolivar",4.2940199999999997,"VEF ",null,"Mongolia"]
["ZAR - South African Rand",8.2019800000000007,"ZAR ",null,"Montenegro"]
[null,null,null,null,"Morocco"]
["Source: Xrates on 6/21/2012","and xe.com",null,null,"Mozambique"]
[null,null,null,null,"Myanmar"]
[null,null,null,null,"Mys"]
[null,null,null,null,"Netherlands"]
[null,null,null,null,"New Zealand"]
[null,null,null,null,"Nigeria"]
[null,null,null,null,"Norway"]
[null,null,null,null,"Oman"]
[null,null,null,null,"Pakistan"]
[null,null,null,null,"Panama"]
[null,null,null,null,"Paraguay"]
[null,null,null,null,"Peru"]
[null,null,null,null,"Philippines"]
[null,null,null,null,"Poland"]
[null,null,null,null,"Portugal"]
[null,null,null,null,"Qatar"]
[null,null,null,null,"Republic Of Georgia"]
[null,null,null,null,"Republica Dominicana"]
[null,null,null,null,"Romania"]
[null,null,null,null,"Russia"]
[null,null,null,null,"Saudi Arabia"]
[null,null,null,null,"Self-Employed"]
[null,null,null,null,"Singapore"]
[null,null,null,null,"Slovakia"]
[null,null,null,null,"Slovenia"]
[null,null,null,null,"Somalia"]
[null,null,null,null,"South Africa"]
[null,null,null,null,"Spain"]
[null,null,null,null,"Sri Lanka"]
[null,null,null,null,"Sweden"]
[null,null,null,null,"Switzerland"]
[null,null,null,null,"Thailand"]
[null,null,null,null,"Tunisia"]
[null,null,null,null,"Turkey"]
[null,null,null,null,"Uae"]
[null,null,null,null,"Uganda"]
[null,null,null,null,"Uk"]
[null,null,null,null,"Ukraine"]
[null,null,null,null,"Uruguay"]
[null,null,null,null,"Usa"]
[null,null,null,null,"Viet Nam"]
[null,null,null,null,"Vietnam"]
[null,null,null,null,"Zambia"]
[null,null,null,null,"Zimbabwe"]