{"text_format":"1","workbook":"xlsx","n_sheets":4,"sheets":["Data","Reference","Brains","Dashboard"],"not_rendered":{"charts":2,"images":0,"macros":1,"external_links":0,"defined_names":22,"comments":1,"pivot_tables":0},"unopened":[],"bounds":{"document_bytes":16777216,"sheet_cells":100000,"rows_first":2000,"rows_last":500,"rows_between":2000,"halvings":0,"cell_chars":16384,"cell_head_chars":4096},"cells_cut":0,"cells_raw":0,"read":"whole","date_system":"1900"}

{"sheet":"Data","index":0,"n_rows":1884,"n_cols":22,"rows_kept":1884,"cut":false,"hidden":false,"merged":[]}
["Unique ID","Timestamp","Your Salary","clean Salary (in local currency)","Currency","Salary in USD","Salary in USD (PPP)","Selected Salary","Your Job Title","Job Type","Where do you work","clean Country","refHours","How many hours of a day you work on Excel","refYears","refSalary","avgHours","Years of Experience","chartHours","chartYears","chartJob","chartSalary"]
["ID0950","2012-05-28T00:48:23",20000,20000,"USD",20000,20000,{"$f":"OFFSET(F2,0,Brains!$D$1,1,1)","v":20000},"Financial Modeller","Accountant","Zambia","Zambia","All 8","All the 8 hours baby, all the 8!","0-5 yrs",{"$f":"IF(H2<15000,\"0-14.9K\",IF(H2<30000,\"15-29.9K\",IF(H2<50000,\"30-49.9K\",IF(H2<75000,\"50-74.9K\",IF(H2<100000,\"75-99.9K\",IF(H2<150000,\"100-149.9K\",IF(H2<250000,\"150-249.9K\",\"250K+\")))))))","v":"15-29.9K"},8,2,5,1,1,{"$f":"IF(H2<15000,1,IF(H2<30000,2,IF(H2<50000,3,IF(H2<75000,4,IF(H2<100000,5,IF(H2<150000,6,IF(H2<250000,7,8)))))))","v":2}]
["ID1888","2012-06-17T13:26:38","AUD63000",63000,"AUD",64254.308353366054,40076.335877862599,{"$f":"OFFSET(F3,0,Brains!$D$1,1,1)","v":40076.335877862599},"Financial Modelling adviser","Accountant","Australia","Australia","All 8","All the 8 hours baby, all the 8!","0-5 yrs","30-49.9K",8,3,5,1,1,{"$f":"IF(H3<15000,1,IF(H3<30000,2,IF(H3<50000,3,IF(H3<75000,4,IF(H3<100000,5,IF(H3<150000,6,IF(H3<250000,7,8)))))))","v":3}]
["ID1772","2012-06-09T20:38:03",1500,18000,"USD",18000,18000,{"$f":"OFFSET(F4,0,Brains!$D$1,1,1)","v":18000},"accountant","Accountant","uae","UAE","All 8","All the 8 hours baby, all the 8!","0-5 yrs","15-29.9K",8,3,5,1,1,2]
["ID1536","2012-05-31T11:08:38","Rs. 200000/-",200000,"INR",3561.5833374885137,9959.167413604222,{"$f":"OFFSET(F5,0,Brains!$D$1,1,1)","v":9959.167413604222},"Accounts Executive","Accountant","India","India","All 8","All the 8 hours baby, all the 8!","0-5 yrs","0-14.9K",8,3,5,1,1,1]
["ID0635","2012-05-26T11:31:52",78000,78000,"AUD",79552.953199405587,49618.320610687028,{"$f":"OFFSET(F6,0,Brains!$D$1,1,1)","v":49618.320610687028},"Corporate Accountant","Accountant","Australia","Australia","All 8","All the 8 hours baby, all the 8!","0-5 yrs","30-49.9K",8,4,5,1,1,3]
["ID0733","2012-05-26T15:21:41",180000,180000,"INR",3205.4250037396623,8963.2506722437993,{"$f":"OFFSET(F7,0,Brains!$D$1,1,1)","v":8963.2506722437993},"Accountant","Accountant","India","India","All 8","All the 8 hours baby, all the 8!","0-5 yrs","0-14.9K",8,4,5,1,1,1]
["ID1061","2012-05-28T14:34:34",408000,408000,"INR",7265.630008476568,20316.701523752614,{"$f":"OFFSET(F8,0,Brains!$D$1,1,1)","v":20316.701523752614},"Sr Exec - Finance","Accountant","India","India","All 8","All the 8 hours baby, all the 8!","0-5 yrs","15-29.9K",8,5,5,1,1,2]
["ID1151","2012-05-28T20:19:57",6000,6000,"USD",6000,6000,{"$f":"OFFSET(F9,0,Brains!$D$1,1,1)","v":6000},"Assistant Accountant","Accountant","Zambia","Zambia","All 8","All the 8 hours baby, all the 8!","0-5 yrs","0-14.9K",8,5,5,1,1,1]
["ID0785","2012-05-26T19:29:23","2.25 lakhs per year(prof income)",2250000,"INR",40067.812546745779,112040.6334030475,{"$f":"OFFSET(F10,0,Brains!$D$1,1,1)","v":112040.6334030475},"company secretary","Accountant","India","India","1 or 2","1 or 2 hours a day","0-5 yrs","100-149.9K",1.5,5,2,1,1,6]
["ID1048","2012-05-28T13:46:17",252000,252000,"INR",4487.5950052355274,12548.55094114132,{"$f":"OFFSET(F11,0,Brains!$D$1,1,1)","v":12548.55094114132},"Accounts Exec","Accountant","India","India","1 or 2","1 or 2 hours a day","0-5 yrs","0-14.9K",1.5,5,2,1,1,1]
["ID1184","2012-05-28T22:54:24","Rs. 350000",350000,"INR",6232.7708406048987,17428.542973807391,{"$f":"OFFSET(F12,0,Brains!$D$1,1,1)","v":17428.542973807391},"officer accounts","Accountant","India","India","2 to 3","2 to 3 hours per day","0-5 yrs","15-29.9K",2.5,1.5,3,1,1,2]
["ID0766","2012-05-26T17:10:20",120000,120000,"INR",2136.9500024931081,5975.5004481625338,{"$f":"OFFSET(F13,0,Brains!$D$1,1,1)","v":5975.5004481625338},"ACCOUNTANT","Accountant","India","India","2 to 3","2 to 3 hours per day","0-5 yrs","0-14.9K",2.5,2,3,1,1,1]
["ID0659","2012-05-26T12:27:20",200000,200000,"PKR",2122.8177433598262,4892.0089034562043,{"$f":"OFFSET(F14,0,Brains!$D$1,1,1)","v":4892.0089034562043},"Accounts Officer","Accountant","Pakistan","Pakistan","2 to 3","2 to 3 hours per day","0-5 yrs","0-14.9K",2.5,2,3,1,1,1]
["ID1442","2012-05-30T09:42:01",70000,70000,"AUD",71393.675948184507,44529.262086513998,{"$f":"OFFSET(F15,0,Brains!$D$1,1,1)","v":44529.262086513998},"Assistant Accountant","Accountant","Australia","Australia","2 to 3","2 to 3 hours per day","0-5 yrs","30-49.9K",2.5,5,3,1,1,3]
["ID1156","2012-05-28T20:51:37","Â£37500",37500,"GBP",59106.685202523156,55637.982195845696,{"$f":"OFFSET(F16,0,Brains!$D$1,1,1)","v":55637.982195845696},"Corporate Finance Executive","Accountant","UK","UK","2 to 3","2 to 3 hours per day","0-5 yrs","50-74.9K",2.5,5,3,1,1,4]
["ID1149","2012-05-28T19:53:14","Â£30000",30000,"GBP",47285.348162018527,44510.385756676558,{"$f":"OFFSET(F17,0,Brains!$D$1,1,1)","v":44510.385756676558},"Reporting Accountant","Accountant","UK","UK","2 to 3","2 to 3 hours per day","0-5 yrs","30-49.9K",2.5,5,3,1,1,3]
["ID1896","2012-06-19T00:23:24",45000,45000,"USD",45000,45000,{"$f":"OFFSET(F18,0,Brains!$D$1,1,1)","v":45000},"Senior Accountant","Accountant","USA","USA","2 to 3","2 to 3 hours per day","0-5 yrs","30-49.9K",2.5,5,3,1,1,3]
["ID0767","2012-05-26T17:24:41",30232,30232,"USD",30232,30232,{"$f":"OFFSET(F19,0,Brains!$D$1,1,1)","v":30232},"Accounts Supervisor","Accountant","KSA","USA","2 to 3","2 to 3 hours per day","0-5 yrs","30-49.9K",2.5,5,3,1,1,3]
["ID0810","2012-05-26T21:56:49",13100,13100,"USD",13100,13100,{"$f":"OFFSET(F20,0,Brains!$D$1,1,1)","v":13100},"accountant","Accountant","India","India","2 to 3","2 to 3 hours per day","0-5 yrs","0-14.9K",2.5,5,3,1,1,1]
["ID1032","2012-05-28T12:58:44","3 Lakh ",300000,"INR",5342.3750062327708,14938.751120406334,{"$f":"OFFSET(F21,0,Brains!$D$1,1,1)","v":14938.751120406334},"ACCOUNTS","Accountant","India","India","2 to 3","2 to 3 hours per day","0-5 yrs","0-14.9K",2.5,5,3,1,1,1]
["ID1244","2012-05-29T04:25:02",56000,56000,"USD",56000,56000,{"$f":"OFFSET(F22,0,Brains!$D$1,1,1)","v":56000},"Accountant","Accountant","USA","USA","4 to 6","4 to 6 hours a day","0-5 yrs","50-74.9K",5,1,4,1,1,4]
["ID1857","2012-06-15T09:00:08",48000,48000,"USD",48000,48000,{"$f":"OFFSET(F23,0,Brains!$D$1,1,1)","v":48000},"Accountant","Accountant","USA","USA","4 to 6","4 to 6 hours a day","0-5 yrs","30-49.9K",5,1,4,1,1,3]
["ID1858","2012-06-15T09:01:23",48000,48000,"USD",48000,48000,{"$f":"OFFSET(F24,0,Brains!$D$1,1,1)","v":48000},"Accountant","Accountant","USA","USA","4 to 6","4 to 6 hours a day","0-5 yrs","30-49.9K",5,1,4,1,1,3]
["ID1712","2012-06-06T08:25:56",42000,42000,"USD",42000,42000,{"$f":"OFFSET(F25,0,Brains!$D$1,1,1)","v":42000},"Staff Accountant","Accountant","USA","USA","4 to 6","4 to 6 hours a day","0-5 yrs","30-49.9K",5,1,4,1,1,3]
["ID0714","2012-05-26T14:20:23","15000 USD",15000,"USD",15000,15000,{"$f":"OFFSET(F26,0,Brains!$D$1,1,1)","v":15000},"Audit - senior assistant","Accountant","Lithuania","Lithuania","4 to 6","4 to 6 hours a day","0-5 yrs","15-29.9K",5,2,4,1,1,2]
["ID1317","2012-05-29T15:18:45",250,3000,"USD",3000,3000,{"$f":"OFFSET(F27,0,Brains!$D$1,1,1)","v":3000},"FANANCE","Accountant","SRI LANKA","Sri Lanka","4 to 6","4 to 6 hours a day","0-5 yrs","0-14.9K",5,2,4,1,1,1]
["ID0884","2012-05-27T12:57:51","Rs.60000/-",720000,"INR",12821.700014958649,35853.002688975197,{"$f":"OFFSET(F28,0,Brains!$D$1,1,1)","v":35853.002688975197},"Article (Internship) - CA","Accountant","India","India","4 to 6","4 to 6 hours a day","0-5 yrs","30-49.9K",5,3,4,1,1,3]
["ID0636","2012-05-26T11:36:04","Rs. 200000",200000,"INR",3561.5833374885137,9959.167413604222,{"$f":"OFFSET(F29,0,Brains!$D$1,1,1)","v":9959.167413604222},"Auditor","Accountant","India","India","4 to 6","4 to 6 hours a day","0-5 yrs","0-14.9K",5,3,4,1,1,1]
["ID1885","2012-06-17T11:38:53",75000,75000,"NZD",59819.107020370408,43478.260869565216,{"$f":"OFFSET(F30,0,Brains!$D$1,1,1)","v":43478.260869565216},"Commercial Accountant","Accountant","New Zealand","New Zealand","4 to 6","4 to 6 hours a day","0-5 yrs","30-49.9K",5,4,4,1,1,3]
{"$rows_left_out":1855}
{"sheet":"Reference","index":1,"n_rows":105,"n_cols":22,"rows_kept":105,"cut":false,"hidden":false,"merged":[]}
["Named Lists",null,null,null,null,null,null,null,null,null,null,"Country Data"]
["JobType","Country","Hours","Experience","Salary","Fields","Fields1","CountryAll","Rank","Type Range","Fields2","Country","Avg Salary","Rank1","Rank ppp","Avg Hours","Rank","Avg Exp","Rank","Common Job","Participants","Rank"]
["Accountant","Albania","Excel??","0-5 yrs","0-14.9K","Country","JobType","All",1,"Count","JobType","All",{"$f":"SUM(List1[Selected Salary])/Reference!U3","v":52505.971745271469},null,null,4.8175783324482211,null,6.1373340414232613,null,"Analyst",1883]
["Analyst","Arabian Gulf","1 or 2","6-10 yrs","15-29.9K","JobType","Hours","Albania",2,"Percentage","Hours","Albania",{"$f":"SUMIF(List1[clean Country],Reference!L4,List1[Selected Salary])/Reference!U4","v":20571},61,67,5,40,8,29,"CXO or Top Mgmt.",1,57]
["Consultant","Argentina","2 to 3","11-20 yrs","30-49.9K","Hours","Experience","Arabian Gulf",3,null,"Experience","Arabian Gulf",{"$f":"SUMIF(List1[clean Country],Reference!L5,List1[Selected Salary])/Reference!U5","v":21000},60,64,1.5,99,0,92,"Analyst",1,58]
["Controller","Armenia","4 to 6","21-30 yrs","50-74.9K","Experience","Salary","Argentina",4,null,null,"Argentina",{"$f":"SUMIF(List1[clean Country],Reference!L6,List1[Selected Salary])/Reference!U6","v":24000},57,60,5,41,21,1,"Manager",1,59]
["CXO or Top Mgmt.","Aruba","All 8","31-40 yrs","75-99.9K","Salary",null,"Armenia",5,null,"Fields3","Armenia",{"$f":"SUMIF(List1[clean Country],Reference!L7,List1[Selected Salary])/Reference!U7","v":6000},95,96,8,1,5,60,"Reporting",1,60]
["Engineer","Asia",null,null,"100-149.9K",null,null,"Aruba",6,null,"Hours","Aruba",{"$f":"SUMIF(List1[clean Country],Reference!L8,List1[Selected Salary])/Reference!U8","v":5000},98,99,1.5,100,13,11,"Consultant",1,61]
["Manager","Australia",null,null,"150-249.9K",null,null,"Asia",7,null,"Experience","Asia",{"$f":"SUMIF(List1[clean Country],Reference!L9,List1[Selected Salary])/Reference!U9","v":12000},82,86,8,2,3,77,"Manager",1,62]
["Misc.","Austria",null,null,"250K+",null,null,"Australia",8,null,"Salary","Australia",{"$f":"SUMIF(List1[clean Country],Reference!L10,List1[Selected Salary])/Reference!U10","v":60028.558037256924},8,24,4.1728395061728394,77,9.5,22,"Analyst",81,4]
["Reporting","Azerbaijan",null,null,null,null,null,"Austria",9,null,null,"Austria",{"$f":"SUMIF(List1[clean Country],Reference!L11,List1[Selected Salary])/Reference!U11","v":50247.973750458514},30,31,5,42,20,2,"Manager",1,63]
["Specialist","Baltic",null,null,null,null,null,"Azerbaijan",10,null,null,"Azerbaijan",{"$f":"SUMIF(List1[clean Country],Reference!L12,List1[Selected Salary])/Reference!U12","v":36000},42,45,5,43,5,61,"Consultant",1,64]
[null,"Bangladesh",null,null,null,null,null,"Baltic",11,null,null,"Baltic",{"$f":"SUMIF(List1[clean Country],Reference!L13,List1[Selected Salary])/Reference!U13","v":8400},93,94,8,3,0.3,91,"Analyst",1,65]
[null,"Belgium",null,null,null,null,null,"Bangladesh",12,null,null,"Bangladesh",{"$f":"SUMIF(List1[clean Country],Reference!L14,List1[Selected Salary])/Reference!U14","v":23468.633673033502},89,62,2,97,6,48,"Analyst",2,46]
[null,"Bermuda",null,null,null,null,null,"Belgium",13,null,null,"Belgium",{"$f":"SUMIF(List1[clean Country],Reference!L15,List1[Selected Salary])/Reference!U15","v":41241.024455688828},40,41,3.5,85,7.875,36,"Analyst",4,34]
[null,"Bhutan",null,null,null,null,null,"Bermuda",14,null,null,"Bermuda",{"$f":"SUMIF(List1[clean Country],Reference!L16,List1[Selected Salary])/Reference!U16","v":78000},14,11,5,44,0,93,"Accountant",1,66]
[null,"Bolivia",null,null,null,null,null,"Bhutan",15,null,null,"Bhutan",{"$f":"SUMIF(List1[clean Country],Reference!L17,List1[Selected Salary])/Reference!U17","v":4800},99,100,5,45,2,81,"Analyst",1,67]
[null,"Brazil",null,null,null,null,null,"Bolivia",16,null,null,"Bolivia",{"$f":"SUMIF(List1[clean Country],Reference!L18,List1[Selected Salary])/Reference!U18","v":9600},91,93,8,4,2,82,"Analyst",1,68]
[null,"Bulgaria",null,null,null,null,null,"Brazil",17,null,null,"Brazil",{"$f":"SUMIF(List1[clean Country],Reference!L19,List1[Selected Salary])/Reference!U19","v":43374.281914893618},38,36,5.6749999999999998,27,4,68,"Analyst",20,8]
[null,"Cambodia",null,null,null,null,null,"Bulgaria",18,null,null,"Bulgaria",{"$f":"SUMIF(List1[clean Country],Reference!L20,List1[Selected Salary])/Reference!U20","v":14400},74,81,8,5,15,9,"Analyst",1,69]
[null,"Canada",null,null,null,null,null,"Cambodia",19,null,null,"Cambodia",{"$f":"SUMIF(List1[clean Country],Reference!L21,List1[Selected Salary])/Reference!U21","v":3000},101,102,2.5,91,2,83,"Consultant",1,70]
[null,"CEE",null,null,null,null,null,"Canada",20,null,null,"Canada",{"$f":"SUMIF(List1[clean Country],Reference!L22,List1[Selected Salary])/Reference!U22","v":74417.255145690273},9,15,4.5517241379310347,71,3.6206896551724137,72,"Analyst",58,5]
[null,"Central America",null,null,null,null,null,"CEE",21,null,null,"CEE",{"$f":"SUMIF(List1[clean Country],Reference!L23,List1[Selected Salary])/Reference!U23","v":86528.970469265827},10,9,5.25,30,20,3,"Manager",2,47]
[null,"China",null,null,null,null,null,"Central America",22,null,null,"Central America",{"$f":"SUMIF(List1[clean Country],Reference!L24,List1[Selected Salary])/Reference!U24","v":95000},7,6,2.5,92,0,94,"CXO or Top Mgmt.",1,71]
[null,"Colombia",null,null,null,null,null,"China",23,null,null,"China",{"$f":"SUMIF(List1[clean Country],Reference!L25,List1[Selected Salary])/Reference!U25","v":20826.097215667767},70,65,5,46,8,30,"Accountant",2,48]
[null,"Costa Rica",null,null,null,null,null,"Colombia",24,null,null,"Colombia",{"$f":"SUMIF(List1[clean Country],Reference!L26,List1[Selected Salary])/Reference!U26","v":12362},81,85,4.8,66,5.6,57,"Analyst",5,28]
[null,"Croatia",null,null,null,null,null,"Costa Rica",25,null,null,"Costa Rica",{"$f":"SUMIF(List1[clean Country],Reference!L27,List1[Selected Salary])/Reference!U27","v":35591.712215584084},53,48,8,6,0,95,"Analyst",1,72]
[null,"Czech Republic",null,null,null,null,null,"Croatia",26,null,null,"Croatia",{"$f":"SUMIF(List1[clean Country],Reference!L28,List1[Selected Salary])/Reference!U28","v":43148.784250275108},36,37,4,81,2.6666666666666665,80,"Manager",3,39]
[null,"Denmark",null,null,null,null,null,"Czech Republic",27,null,null,"Czech Republic",{"$f":"SUMIF(List1[clean Country],Reference!L29,List1[Selected Salary])/Reference!U29","v":36000},43,46,2.5,93,9,26,"Controller",1,73]
[null,"Dominican Republic",null,null,null,null,null,"Denmark",28,null,null,"Denmark",{"$f":"SUMIF(List1[clean Country],Reference!L30,List1[Selected Salary])/Reference!U30","v":62446.005065622834},12,22,4.083333333333333,79,17,6,"Analyst",6,23]
{"$rows_left_out":76}
{"sheet":"Brains","index":2,"n_rows":24,"n_cols":12,"rows_kept":24,"cut":false,"hidden":false,"merged":[]}
["PPP",null,true,{"$f":"--C1","v":1}]
[null,null,{"$f":"Dashboard!$L$17","v":"Percentage"},{"$f":"MATCH($C$2,TypeRange,0)","v":2}]
[{"$f":"G5 & \"- \" &C7&\" vs \"&C10","v":"Salary Earned - India vs All"}]
["Chart 2"]
["Field",1,{"$f":"Dashboard!$L$11","v":"Salary"},{"$f":"COUNTA(INDIRECT(C5))","v":8},{"$f":"CHOOSE(MATCH(C5,Fields1,0),\"$J$2:$J$1884\",\"$M$2:$M$1884\",\"$O$2:$O$1884\",\"$P$2:$P$1884\")","v":"$P$2:$P$1884"},null,{"$f":"CHOOSE(MATCH(C5,Fields1,0),\"Job Title \",\"Hours per Day in Excel \",\"Years of Experience \",\"Salary Earned \")","v":"Salary Earned "}]
["Labels",null,{"$f":"IF(COLUMN()>$D$5+2,\"\",INDEX(INDIRECT($C$5),COLUMN()-2))","v":"0-14.9K"},{"$f":"IF(COLUMN()>$D$5+2,\"\",INDEX(INDIRECT($C$5),COLUMN()-2))","v":"15-29.9K"},"30-49.9K","50-74.9K","75-99.9K","100-149.9K","150-249.9K","250K+","",""]
["Country1",44,{"$f":"Dashboard!$L$13","v":"India"},{"$f":"SUM((Data!$H$2:$H$1884)*(Data!$L$2:$L$1884=C7))","v":16811172.234438807},{"$f":"D7/SUM(C8:L8)","v":29754.287140599659}]
[null,null,{"$f":"IF($C$7=0,\"\",IF(C6=\"\",\"\",IF($C$7=\"All\",COUNTIF(INDIRECT(\"Data!\"&$E$5),C$6),SUM((INDIRECT(\"Data!\"&$E$5)=C$6)*(Data!$L$2:$L$1884=$C$7)))))","v":208},{"$f":"IF($C$7=0,\"\",IF(D6=\"\",\"\",IF($C$7=\"All\",COUNTIF(INDIRECT(\"Data!\"&$E$5),D$6),SUM((INDIRECT(\"Data!\"&$E$5)=D$6)*(Data!$L$2:$L$1884=$C$7)))))","v":201},{"$f":"IF($C$7=0,\"\",IF(E6=\"\",\"\",IF($C$7=\"All\",COUNTIF(INDIRECT(\"Data!\"&$E$5),E$6),SUM((INDIRECT(\"Data!\"&$E$5)=E$6)*(Data!$L$2:$L$1884=$C$7)))))","v":91},{"$f":"IF($C$7=0,\"\",IF(F6=\"\",\"\",IF($C$7=\"All\",COUNTIF(INDIRECT(\"Data!\"&$E$5),F$6),SUM((INDIRECT(\"Data!\"&$E$5)=F$6)*(Data!$L$2:$L$1884=$C$7)))))","v":37},{"$f":"IF($C$7=0,\"\",IF(G6=\"\",\"\",IF($C$7=\"All\",COUNTIF(INDIRECT(\"Data!\"&$E$5),G$6),SUM((INDIRECT(\"Data!\"&$E$5)=G$6)*(Data!$L$2:$L$1884=$C$7)))))","v":9},{"$f":"IF($C$7=0,\"\",IF(H6=\"\",\"\",IF($C$7=\"All\",COUNTIF(INDIRECT(\"Data!\"&$E$5),H$6),SUM((INDIRECT(\"Data!\"&$E$5)=H$6)*(Data!$L$2:$L$1884=$C$7)))))","v":10},{"$f":"IF($C$7=0,\"\",IF(I6=\"\",\"\",IF($C$7=\"All\",COUNTIF(INDIRECT(\"Data!\"&$E$5),I$6),SUM((INDIRECT(\"Data!\"&$E$5)=I$6)*(Data!$L$2:$L$1884=$C$7)))))","v":6},{"$f":"IF($C$7=0,\"\",IF(J6=\"\",\"\",IF($C$7=\"All\",COUNTIF(INDIRECT(\"Data!\"&$E$5),J$6),SUM((INDIRECT(\"Data!\"&$E$5)=J$6)*(Data!$L$2:$L$1884=$C$7)))))","v":3},{"$f":"IF($C$7=0,\"\",IF(K6=\"\",\"\",IF($C$7=\"All\",COUNTIF(INDIRECT(\"Data!\"&$E$5),K$6),SUM((INDIRECT(\"Data!\"&$E$5)=K$6)*(Data!$L$2:$L$1884=$C$7)))))","v":""},{"$f":"IF($C$7=0,\"\",IF(L6=\"\",\"\",IF($C$7=\"All\",COUNTIF(INDIRECT(\"Data!\"&$E$5),L$6),SUM((INDIRECT(\"Data!\"&$E$5)=L$6)*(Data!$L$2:$L$1884=$C$7)))))","v":""}]
[null,null,{"$f":"IF(C8=\"\",\"\",C8/SUM($C$8:$L$8))","v":0.36814159292035398},{"$f":"IF(D8=\"\",\"\",D8/SUM($C$8:$L$8))","v":0.35575221238938054},0.16106194690265488,6.5486725663716813E-2,1.5929203539823009E-2,1.7699115044247787E-2,1.0619469026548672E-2,5.3097345132743362E-3,"",""]
["Country2",1,{"$f":"Dashboard!$L$15","v":"All"}]
[null,null,{"$f":"IF($C$10=0,\"\",IF(C6=\"\",\"\",IF($C$10=\"All\",COUNTIF(INDIRECT(\"Data!\"&$E$5),C$6),SUM((INDIRECT(\"Data!\"&$E$5)=C$6)*(Data!$L$2:$L$1884=$C$10)))))","v":298},{"$f":"IF($C$10=0,\"\",IF(D6=\"\",\"\",IF($C$10=\"All\",COUNTIF(INDIRECT(\"Data!\"&$E$5),D$6),SUM((INDIRECT(\"Data!\"&$E$5)=D$6)*(Data!$L$2:$L$1884=$C$10)))))","v":323},{"$f":"IF($C$10=0,\"\",IF(E6=\"\",\"\",IF($C$10=\"All\",COUNTIF(INDIRECT(\"Data!\"&$E$5),E$6),SUM((INDIRECT(\"Data!\"&$E$5)=E$6)*(Data!$L$2:$L$1884=$C$10)))))","v":426},{"$f":"IF($C$10=0,\"\",IF(F6=\"\",\"\",IF($C$10=\"All\",COUNTIF(INDIRECT(\"Data!\"&$E$5),F$6),SUM((INDIRECT(\"Data!\"&$E$5)=F$6)*(Data!$L$2:$L$1884=$C$10)))))","v":433},{"$f":"IF($C$10=0,\"\",IF(G6=\"\",\"\",IF($C$10=\"All\",COUNTIF(INDIRECT(\"Data!\"&$E$5),G$6),SUM((INDIRECT(\"Data!\"&$E$5)=G$6)*(Data!$L$2:$L$1884=$C$10)))))","v":222},{"$f":"IF($C$10=0,\"\",IF(H6=\"\",\"\",IF($C$10=\"All\",COUNTIF(INDIRECT(\"Data!\"&$E$5),H$6),SUM((INDIRECT(\"Data!\"&$E$5)=H$6)*(Data!$L$2:$L$1884=$C$10)))))","v":130},{"$f":"IF($C$10=0,\"\",IF(I6=\"\",\"\",IF($C$10=\"All\",COUNTIF(INDIRECT(\"Data!\"&$E$5),I$6),SUM((INDIRECT(\"Data!\"&$E$5)=I$6)*(Data!$L$2:$L$1884=$C$10)))))","v":39},{"$f":"IF($C$10=0,\"\",IF(J6=\"\",\"\",IF($C$10=\"All\",COUNTIF(INDIRECT(\"Data!\"&$E$5),J$6),SUM((INDIRECT(\"Data!\"&$E$5)=J$6)*(Data!$L$2:$L$1884=$C$10)))))","v":12},{"$f":"IF($C$10=0,\"\",IF(K6=\"\",\"\",IF($C$10=\"All\",COUNTIF(INDIRECT(\"Data!\"&$E$5),K$6),SUM((INDIRECT(\"Data!\"&$E$5)=K$6)*(Data!$L$2:$L$1884=$C$10)))))","v":""},{"$f":"IF($C$10=0,\"\",IF(L6=\"\",\"\",IF($C$10=\"All\",COUNTIF(INDIRECT(\"Data!\"&$E$5),L$6),SUM((INDIRECT(\"Data!\"&$E$5)=L$6)*(Data!$L$2:$L$1884=$C$10)))))","v":""}]
[null,null,{"$f":"IF(C11=\"\",\"\",C11/SUM($C$11:$L$11))","v":0.15825809877854488},{"$f":"IF(D11=\"\",\"\",D11/SUM($C$11:$L$11))","v":0.17153478491768454},0.22623473181093998,0.2299522039298991,0.11789697291556028,6.9038767923526284E-2,2.0711630377057887E-2,6.3728093467870419E-3,"",""]
[]
["By the Numbers",null,{"$f":"IF(D15=1,B15,IF(D16=1,B16,IF(D17=1,B17,IF(D19=1,B19,B15))))","v":"USA"},{"$f":"Dashboard!P10","v":"USA"}]
[{"$f":"Dashboard!R11","v":17},{"$f":"INDEX(Reference!$L$4:$L$105,MATCH(A15,OFFSET(Reference!$N$4,0,Brains!$D$1,102,1),0))","v":"USA"},null,{"$f":"COUNTIF($B$15:$B$19,B15)","v":4},{"$f":"VLOOKUP(C14,Reference!$L:$V,3+Brains!D1,FALSE)","v":17},{"$f":"VLOOKUP(D14,Reference!$L:$V,3+Brains!D1,FALSE)","v":17}]
[{"$f":"Dashboard!R12","v":67},{"$f":"INDEX(Reference!$L$4:$L$105,MATCH(A16,OFFSET(Reference!$Q$4,0,0,102,1),0))","v":"USA"},null,{"$f":"COUNTIF($B$15:$B$19,B16)","v":4},{"$f":"VLOOKUP(C14,Reference!$L:$V,6,FALSE)","v":67},{"$f":"VLOOKUP(D14,Reference!$L:$V,6,FALSE)","v":67}]
[{"$f":"Dashboard!R13","v":56},{"$f":"INDEX(Reference!$L$4:$L$105,MATCH(A17,OFFSET(Reference!$S$4,0,0,102,1),0))","v":"USA"},null,4,{"$f":"VLOOKUP(C14,Reference!$L:$V,8,FALSE)","v":56},{"$f":"VLOOKUP(D14,Reference!$L:$V,8,FALSE)","v":56}]
[{"$f":"Dashboard!R14","v":0},null,null,0]
[{"$f":"Dashboard!R15","v":1},{"$f":"INDEX(Reference!$L$4:$L$105,MATCH(A19,OFFSET(Reference!$V$4,0,0,102,1),0))","v":"USA"},null,4,{"$f":"VLOOKUP(C14,Reference!$L:$V,11,FALSE)","v":1},{"$f":"VLOOKUP(D14,Reference!$L:$V,11,FALSE)","v":1}]
[{"$f":"\"A Closer Look - \" &C22& \": \"&C23&\"/\"&C24","v":"A Closer Look - UK: JobType/Salary"}]
["Bubble Chart"]
["Country",null,{"$f":"Dashboard!$C$29","v":"UK"}]
["Field 1",null,{"$f":"Dashboard!$C$32","v":"JobType"}]
["Field 2",null,{"$f":"Dashboard!$C$35","v":"Salary"}]

{"sheet":"Dashboard","index":3,"n_rows":35,"n_cols":18,"rows_kept":35,"cut":false,"hidden":false,"merged":[[28,2,28,3],[31,2,31,3],[34,2,34,3],[21,8,22,16],[3,1,4,8]]}
["Excel Salary Summary"]
[]
[]
[null,{"$f":"Brains!A3","v":"Salary Earned - India vs All"}]
[]
[]
[]
[null,null,null,null,null,null,null,null,null,null,null,"Filters",null,null,null,"By the Numbers"]
[]
[null,null,null,null,null,null,null,null,null,null,null,null,null,null,null,"USA","Value","Rank"]
[null,null,null,null,null,null,null,null,null,null,null,"Salary",null,null,null,"Average Salary",{"$f":"VLOOKUP($P$10,Reference!$L:$M,2,FALSE)","v":72701.336569579289},17]
[null,null,null,null,null,null,null,null,null,null,null,null,null,null,null,"Average Hours p/ Day",{"$f":"VLOOKUP($P$10,Reference!$L:$P,5,FALSE)","v":4.7556634304207117},67]
[null,null,null,null,null,null,null,null,null,null,null,"India",null,null,null,"Average Years Exp",{"$f":"VLOOKUP($P$10,Reference!$L:$R,7,FALSE)","v":5.6456310679611654},56]
[null,null,null,null,null,null,null,null,null,null,null,null,null,null,null,"Most Common Job"]
[null,null,null,null,null,null,null,null,null,null,null,"All",null,null,null,"Survey Participants",{"$f":"VLOOKUP($P$10,Reference!$L:$U,10,FALSE)","v":618},1]
[]
[null,null,null,null,null,null,null,null,null,null,null,"Percentage"]
[]
[]
[]
[]
[null,null,null,null,null,null,null,null,{"$f":"Brains!A20","v":"A Closer Look - UK: JobType/Salary"}]
[]
[]
[]
[null,null,"Filters"]
[]
[null,null,"Country:"]
[null,null,"UK"]
[]
{"$rows_left_out":5}