{"text_format":"1","workbook":"xlsx","n_sheets":4,"sheets":["Data","Reference","Brains","Dashboard"],"not_rendered":{"charts":2,"images":0,"macros":1,"external_links":0,"defined_names":22,"comments":1,"pivot_tables":0},"unopened":[],"bounds":{"document_bytes":16777216,"sheet_cells":100000,"rows_first":2000,"rows_last":500,"rows_between":2000,"halvings":0,"cell_chars":16384,"cell_head_chars":4096},"cells_cut":0,"cells_raw":0,"read":"whole","date_system":"1900"}

{"sheet":"Data","index":0,"n_rows":1884,"n_cols":22,"rows_kept":1884,"cut":false,"hidden":false,"merged":[]}
["Unique ID","Timestamp","Your Salary","clean Salary (in local currency)","Currency","Salary in USD","Salary in USD (PPP)","Selected Salary","Your Job Title","Job Type","Where do you work","clean Country","refHours","How many hours of a day you work on Excel","refYears","refSalary","avgHours","Years of Experience","chartHours","chartYears","chartJob","chartSalary"]
["ID0950","2012-05-28T00:48:23",20000,20000,"USD",20000,20000,{"$f":"OFFSET(F2,0,Brains!$D$1,1,1)","v":20000},"Financial Modeller","Accountant","Zambia","Zambia","All 8","All the 8 hours baby, all the 8!","0-5 yrs",{"$f":"IF(H2<15000,\"0-14.9K\",IF(H2<30000,\"15-29.9K\",IF(H2<50000,\"30-49.9K\",IF(H2<75000,\"50-74.9K\",IF(H2<100000,\"75-99.9K\",IF(H2<150000,\"100-149.9K\",IF(H2<250000,\"150-249.9K\",\"250K+\")))))))","v":"15-29.9K"},8,2,5,1,1,{"$f":"IF(H2<15000,1,IF(H2<30000,2,IF(H2<50000,3,IF(H2<75000,4,IF(H2<100000,5,IF(H2<150000,6,IF(H2<250000,7,8)))))))","v":2}]
["ID1888","2012-06-17T13:26:38","AUD63000",63000,"AUD",64254.308353366054,40076.335877862599,{"$f":"OFFSET(F3,0,Brains!$D$1,1,1)","v":40076.335877862599},"Financial Modelling adviser","Accountant","Australia","Australia","All 8","All the 8 hours baby, all the 8!","0-5 yrs","30-49.9K",8,3,5,1,1,{"$f":"IF(H3<15000,1,IF(H3<30000,2,IF(H3<50000,3,IF(H3<75000,4,IF(H3<100000,5,IF(H3<150000,6,IF(H3<250000,7,8)))))))","v":3}]
["ID1772","2012-06-09T20:38:03",1500,18000,"USD",18000,18000,{"$f":"OFFSET(F4,0,Brains!$D$1,1,1)","v":18000},"accountant","Accountant","uae","UAE","All 8","All the 8 hours baby, all the 8!","0-5 yrs","15-29.9K",8,3,5,1,1,2]
["ID1536","2012-05-31T11:08:38","Rs. 200000/-",200000,"INR",3561.5833374885137,9959.167413604222,{"$f":"OFFSET(F5,0,Brains!$D$1,1,1)","v":9959.167413604222},"Accounts Executive","Accountant","India","India","All 8","All the 8 hours baby, all the 8!","0-5 yrs","0-14.9K",8,3,5,1,1,1]
["ID0635","2012-05-26T11:31:52",78000,78000,"AUD",79552.953199405587,49618.320610687028,{"$f":"OFFSET(F6,0,Brains!$D$1,1,1)","v":49618.320610687028},"Corporate Accountant","Accountant","Australia","Australia","All 8","All the 8 hours baby, all the 8!","0-5 yrs","30-49.9K",8,4,5,1,1,3]
["ID0733","2012-05-26T15:21:41",180000,180000,"INR",3205.4250037396623,8963.2506722437993,{"$f":"OFFSET(F7,0,Brains!$D$1,1,1)","v":8963.2506722437993},"Accountant","Accountant","India","India","All 8","All the 8 hours baby, all the 8!","0-5 yrs","0-14.9K",8,4,5,1,1,1]
["ID1061","2012-05-28T14:34:34",408000,408000,"INR",7265.630008476568,20316.701523752614,{"$f":"OFFSET(F8,0,Brains!$D$1,1,1)","v":20316.701523752614},"Sr Exec - Finance","Accountant","India","India","All 8","All the 8 hours baby, all the 8!","0-5 yrs","15-29.9K",8,5,5,1,1,2]
["ID1151","2012-05-28T20:19:57",6000,6000,"USD",6000,6000,{"$f":"OFFSET(F9,0,Brains!$D$1,1,1)","v":6000},"Assistant Accountant","Accountant","Zambia","Zambia","All 8","All the 8 hours baby, all the 8!","0-5 yrs","0-14.9K",8,5,5,1,1,1]
["ID0785","2012-05-26T19:29:23","2.25 lakhs per year(prof income)",2250000,"INR",40067.812546745779,112040.6334030475,{"$f":"OFFSET(F10,0,Brains!$D$1,1,1)","v":112040.6334030475},"company secretary","Accountant","India","India","1 or 2","1 or 2 hours a day","0-5 yrs","100-149.9K",1.5,5,2,1,1,6]
["ID1048","2012-05-28T13:46:17",252000,252000,"INR",4487.5950052355274,12548.55094114132,{"$f":"OFFSET(F11,0,Brains!$D$1,1,1)","v":12548.55094114132},"Accounts Exec","Accountant","India","India","1 or 2","1 or 2 hours a day","0-5 yrs","0-14.9K",1.5,5,2,1,1,1]
["ID1184","2012-05-28T22:54:24","Rs. 350000",350000,"INR",6232.7708406048987,17428.542973807391,{"$f":"OFFSET(F12,0,Brains!$D$1,1,1)","v":17428.542973807391},"officer accounts","Accountant","India","India","2 to 3","2 to 3 hours per day","0-5 yrs","15-29.9K",2.5,1.5,3,1,1,2]
["ID0766","2012-05-26T17:10:20",120000,120000,"INR",2136.9500024931081,5975.5004481625338,{"$f":"OFFSET(F13,0,Brains!$D$1,1,1)","v":5975.5004481625338},"ACCOUNTANT","Accountant","India","India","2 to 3","2 to 3 hours per day","0-5 yrs","0-14.9K",2.5,2,3,1,1,1]
["ID0659","2012-05-26T12:27:20",200000,200000,"PKR",2122.8177433598262,4892.0089034562043,{"$f":"OFFSET(F14,0,Brains!$D$1,1,1)","v":4892.0089034562043},"Accounts Officer","Accountant","Pakistan","Pakistan","2 to 3","2 to 3 hours per day","0-5 yrs","0-14.9K",2.5,2,3,1,1,1]
["ID1442","2012-05-30T09:42:01",70000,70000,"AUD",71393.675948184507,44529.262086513998,{"$f":"OFFSET(F15,0,Brains!$D$1,1,1)","v":44529.262086513998},"Assistant Accountant","Accountant","Australia","Australia","2 to 3","2 to 3 hours per day","0-5 yrs","30-49.9K",2.5,5,3,1,1,3]
["ID1156","2012-05-28T20:51:37","Â£37500",37500,"GBP",59106.685202523156,55637.982195845696,{"$f":"OFFSET(F16,0,Brains!$D$1,1,1)","v":55637.982195845696},"Corporate Finance Executive","Accountant","UK","UK","2 to 3","2 to 3 hours per day","0-5 yrs","50-74.9K",2.5,5,3,1,1,4]
["ID1149","2012-05-28T19:53:14","Â£30000",30000,"GBP",47285.348162018527,44510.385756676558,{"$f":"OFFSET(F17,0,Brains!$D$1,1,1)","v":44510.385756676558},"Reporting Accountant","Accountant","UK","UK","2 to 3","2 to 3 hours per day","0-5 yrs","30-49.9K",2.5,5,3,1,1,3]
["ID1896","2012-06-19T00:23:24",45000,45000,"USD",45000,45000,{"$f":"OFFSET(F18,0,Brains!$D$1,1,1)","v":45000},"Senior Accountant","Accountant","USA","USA","2 to 3","2 to 3 hours per day","0-5 yrs","30-49.9K",2.5,5,3,1,1,3]
["ID0767","2012-05-26T17:24:41",30232,30232,"USD",30232,30232,{"$f":"OFFSET(F19,0,Brains!$D$1,1,1)","v":30232},"Accounts Supervisor","Accountant","KSA","USA","2 to 3","2 to 3 hours per day","0-5 yrs","30-49.9K",2.5,5,3,1,1,3]
["ID0810","2012-05-26T21:56:49",13100,13100,"USD",13100,13100,{"$f":"OFFSET(F20,0,Brains!$D$1,1,1)","v":13100},"accountant","Accountant","India","India","2 to 3","2 to 3 hours per day","0-5 yrs","0-14.9K",2.5,5,3,1,1,1]
["ID1032","2012-05-28T12:58:44","3 Lakh ",300000,"INR",5342.3750062327708,14938.751120406334,{"$f":"OFFSET(F21,0,Brains!$D$1,1,1)","v":14938.751120406334},"ACCOUNTS","Accountant","India","India","2 to 3","2 to 3 hours per day","0-5 yrs","0-14.9K",2.5,5,3,1,1,1]
["ID1244","2012-05-29T04:25:02",56000,56000,"USD",56000,56000,{"$f":"OFFSET(F22,0,Brains!$D$1,1,1)","v":56000},"Accountant","Accountant","USA","USA","4 to 6","4 to 6 hours a day","0-5 yrs","50-74.9K",5,1,4,1,1,4]
["ID1857","2012-06-15T09:00:08",48000,48000,"USD",48000,48000,{"$f":"OFFSET(F23,0,Brains!$D$1,1,1)","v":48000},"Accountant","Accountant","USA","USA","4 to 6","4 to 6 hours a day","0-5 yrs","30-49.9K",5,1,4,1,1,3]
["ID1858","2012-06-15T09:01:23",48000,48000,"USD",48000,48000,{"$f":"OFFSET(F24,0,Brains!$D$1,1,1)","v":48000},"Accountant","Accountant","USA","USA","4 to 6","4 to 6 hours a day","0-5 yrs","30-49.9K",5,1,4,1,1,3]
["ID1712","2012-06-06T08:25:56",42000,42000,"USD",42000,42000,{"$f":"OFFSET(F25,0,Brains!$D$1,1,1)","v":42000},"Staff Accountant","Accountant","USA","USA","4 to 6","4 to 6 hours a day","0-5 yrs","30-49.9K",5,1,4,1,1,3]
["ID0714","2012-05-26T14:20:23","15000 USD",15000,"USD",15000,15000,{"$f":"OFFSET(F26,0,Brains!$D$1,1,1)","v":15000},"Audit - senior assistant","Accountant","Lithuania","Lithuania","4 to 6","4 to 6 hours a day","0-5 yrs","15-29.9K",5,2,4,1,1,2]
["ID1317","2012-05-29T15:18:45",250,3000,"USD",3000,3000,{"$f":"OFFSET(F27,0,Brains!$D$1,1,1)","v":3000},"FANANCE","Accountant","SRI LANKA","Sri Lanka","4 to 6","4 to 6 hours a day","0-5 yrs","0-14.9K",5,2,4,1,1,1]
["ID0884","2012-05-27T12:57:51","Rs.60000/-",720000,"INR",12821.700014958649,35853.002688975197,{"$f":"OFFSET(F28,0,Brains!$D$1,1,1)","v":35853.002688975197},"Article (Internship) - CA","Accountant","India","India","4 to 6","4 to 6 hours a day","0-5 yrs","30-49.9K",5,3,4,1,1,3]
["ID0636","2012-05-26T11:36:04","Rs. 200000",200000,"INR",3561.5833374885137,9959.167413604222,{"$f":"OFFSET(F29,0,Brains!$D$1,1,1)","v":9959.167413604222},"Auditor","Accountant","India","India","4 to 6","4 to 6 hours a day","0-5 yrs","0-14.9K",5,3,4,1,1,1]
["ID1885","2012-06-17T11:38:53",75000,75000,"NZD",59819.107020370408,43478.260869565216,{"$f":"OFFSET(F30,0,Brains!$D$1,1,1)","v":43478.260869565216},"Commercial Accountant","Accountant","New Zealand","New Zealand","4 to 6","4 to 6 hours a day","0-5 yrs","30-49.9K",5,4,4,1,1,3]
["ID0705","2012-05-26T13:57:11",720000,720000,"INR",12821.700014958649,35853.002688975197,{"$f":"OFFSET(F31,0,Brains!$D$1,1,1)","v":35853.002688975197},"Cost Accountant","Accountant","India","India","4 to 6","4 to 6 hours a day","0-5 yrs","30-49.9K",5,4,4,1,1,3]
["ID0890","2012-05-27T13:41:05",10000,10000,"USD",10000,10000,{"$f":"OFFSET(F32,0,Brains!$D$1,1,1)","v":10000},"Finance Staff","Accountant","Viet Nam","Vietnam","4 to 6","4 to 6 hours a day","0-5 yrs","0-14.9K",5,4,4,1,1,1]
["ID1448","2012-05-30T11:43:50",300000,300000,"INR",5342.3750062327708,14938.751120406334,{"$f":"OFFSET(F33,0,Brains!$D$1,1,1)","v":14938.751120406334},"accountant","Accountant","India","India","4 to 6","4 to 6 hours a day","0-5 yrs","0-14.9K",5,4,4,1,1,1]
["ID1082","2012-05-28T15:34:12",140000,140000,"INR",2493.1083362419595,6971.4171895229556,{"$f":"OFFSET(F34,0,Brains!$D$1,1,1)","v":6971.4171895229556},"Accountant","Accountant","India","India","4 to 6","4 to 6 hours a day","0-5 yrs","0-14.9K",5,4,4,1,1,1]
["ID0952","2012-05-28T01:29:19",3000,36000,"USD",36000,36000,{"$f":"OFFSET(F35,0,Brains!$D$1,1,1)","v":36000},"Accountant","Accountant","United Arab Emirates","UAE","4 to 6","4 to 6 hours a day","0-5 yrs","30-49.9K",5,4.5,4,1,1,3]
["ID1255","2012-05-29T06:26:05",80000,80000,"AUD",81592.772512210868,50890.585241730281,{"$f":"OFFSET(F36,0,Brains!$D$1,1,1)","v":50890.585241730281},"systems accountant","Accountant","Australia","Australia","4 to 6","4 to 6 hours a day","0-5 yrs","50-74.9K",5,5,4,1,1,4]
["ID1845","2012-06-14T18:27:04",560,6720,"USD",6720,6720,{"$f":"OFFSET(F37,0,Brains!$D$1,1,1)","v":6720},"accoutant","Accountant","India","India","4 to 6","4 to 6 hours a day","0-5 yrs","0-14.9K",5,5,4,1,1,1]
["ID0840","2012-05-27T00:02:45",85000,85000,"USD",85000,85000,{"$f":"OFFSET(F38,0,Brains!$D$1,1,1)","v":85000},"actuary","Accountant","USA","USA","All 8","All the 8 hours baby, all the 8!","0-5 yrs","75-99.9K",8,1,5,1,1,5]
["ID1749","2012-06-08T06:42:32",75000,75000,"USD",75000,75000,{"$f":"OFFSET(F39,0,Brains!$D$1,1,1)","v":75000},"actuary","Accountant","USA","USA","All 8","All the 8 hours baby, all the 8!","0-5 yrs","75-99.9K",8,1,5,1,1,5]
["ID1006","2012-05-28T10:29:41","$45,000  USD",45000,"USD",45000,45000,{"$f":"OFFSET(F40,0,Brains!$D$1,1,1)","v":45000},"Staff accountant -- Auditing","Accountant","USA","USA","All 8","All the 8 hours baby, all the 8!","0-5 yrs","30-49.9K",8,3,5,1,1,3]
["ID1209","2012-05-29T00:12:23",23000,23000,"USD",23000,23000,{"$f":"OFFSET(F41,0,Brains!$D$1,1,1)","v":23000},"Chief Accountant","Accountant","Saudi Arabia","Saudi Arabia","All 8","All the 8 hours baby, all the 8!","11-20 yrs","15-29.9K",8,14,5,3,1,2]
["ID1176","2012-05-28T22:45:49","Â£43000",43000,"GBP",67775.665698893223,63798.219584569728,{"$f":"OFFSET(F42,0,Brains!$D$1,1,1)","v":63798.219584569728},"Head of Finance","Accountant","UK","UK","All 8","All the 8 hours baby, all the 8!","11-20 yrs","50-74.9K",8,15,5,3,1,4]
["ID1335","2012-05-29T16:55:43",80000,80000,"NZD",63807.047488395103,46376.811594202904,{"$f":"OFFSET(F43,0,Brains!$D$1,1,1)","v":46376.811594202904},"accountant","Accountant","new zealand","New Zealand","All 8","All the 8 hours baby, all the 8!","11-20 yrs","30-49.9K",8,15,5,3,1,3]
["ID1508","2012-05-31T00:36:30",50000,50000,"EUR",63519.971949580387,62809.967188073148,{"$f":"OFFSET(F44,0,Brains!$D$1,1,1)","v":62809.967188073148},"accountant","Accountant","italy","Italy","All 8","All the 8 hours baby, all the 8!","11-20 yrs","50-74.9K",8,15,5,3,1,4]
["ID1158","2012-05-28T21:14:25","R366252",366252,"ZAR",44654.095718350931,64571.932299012697,{"$f":"OFFSET(F45,0,Brains!$D$1,1,1)","v":64571.932299012697},"Accountant","Accountant","South Africa","South Africa","All 8","All the 8 hours baby, all the 8!","11-20 yrs","50-74.9K",8,15,5,3,1,4]
["ID1730","2012-06-07T08:36:51",134000,134000,"CAD",131770.4440860638,107285.82866293033,{"$f":"OFFSET(F46,0,Brains!$D$1,1,1)","v":107285.82866293033},"Senior Production Accountant","Accountant","Canada","Canada","All 8","All the 8 hours baby, all the 8!","11-20 yrs","100-149.9K",8,20,5,3,1,6]
["ID0772","2012-05-26T17:47:10","$1,589.00/per month",19068,"USD",19068,19068,{"$f":"OFFSET(F47,0,Brains!$D$1,1,1)","v":19068},"Accounting Head","Accountant","Philippines","Philippines","All 8","All the 8 hours baby, all the 8!","11-20 yrs","15-29.9K",8,20,5,3,1,2]
["ID1099","2012-05-28T16:10:52","Rs. 20000",240000,"INR",4273.9000049862161,11951.000896325068,{"$f":"OFFSET(F48,0,Brains!$D$1,1,1)","v":11951.000896325068},"Accountant","Accountant","India","India","All 8","All the 8 hours baby, all the 8!","11-20 yrs","0-14.9K",8,20,5,3,1,1]
["ID0699","2012-05-26T13:42:21",180000,180000,"INR",3205.4250037396623,8963.2506722437993,{"$f":"OFFSET(F49,0,Brains!$D$1,1,1)","v":8963.2506722437993},"accounts","Accountant","India","India","2 to 3","2 to 3 hours per day","11-20 yrs","0-14.9K",2.5,14,3,3,1,1]
["ID1220","2012-05-29T01:03:19","40,000 US",40000,"USD",40000,40000,{"$f":"OFFSET(F50,0,Brains!$D$1,1,1)","v":40000},"Staff Accountant","Accountant","USA","USA","2 to 3","2 to 3 hours per day","11-20 yrs","30-49.9K",2.5,15,3,3,1,3]
["ID0671","2012-05-26T12:53:43","Us$24000",24000,"USD",24000,24000,{"$f":"OFFSET(F51,0,Brains!$D$1,1,1)","v":24000},"Accountant","Accountant","UAE","UAE","2 to 3","2 to 3 hours per day","11-20 yrs","15-29.9K",2.5,15,3,3,1,2]
["ID1050","2012-05-28T14:00:56",194,2400,"USD",2400,2400,{"$f":"OFFSET(F52,0,Brains!$D$1,1,1)","v":2400},"Accounts Officer","Accountant","Pakistan","Pakistan","2 to 3","2 to 3 hours per day","11-20 yrs","0-14.9K",2.5,15,3,3,1,1]
["ID1059","2012-05-28T14:30:05","ZAR240000",240000,"ZAR",29261.227167098674,42313.11706629055,{"$f":"OFFSET(F53,0,Brains!$D$1,1,1)","v":42313.11706629055},"Bookkeeper","Accountant","South Africa","South Africa","2 to 3","2 to 3 hours per day","11-20 yrs","30-49.9K",2.5,20,3,3,1,3]
["ID1530","2012-05-31T09:28:05",38000,38000,"USD",38000,38000,{"$f":"OFFSET(F54,0,Brains!$D$1,1,1)","v":38000},"Accountant","Accountant","USA","USA","4 to 6","4 to 6 hours a day","11-20 yrs","30-49.9K",5,11,4,3,1,3]
["ID1296","2012-05-29T13:15:17",140000,140000,"USD",140000,140000,{"$f":"OFFSET(F55,0,Brains!$D$1,1,1)","v":140000},"Senior Accountant","Accountant","USA","USA","4 to 6","4 to 6 hours a day","11-20 yrs","100-149.9K",5,12,4,3,1,6]
["ID1266","2012-05-29T08:59:41",107000,107000,"USD",107000,107000,{"$f":"OFFSET(F56,0,Brains!$D$1,1,1)","v":107000},"Certified Public Accountant","Accountant","USA","USA","4 to 6","4 to 6 hours a day","11-20 yrs","100-149.9K",5,12,4,3,1,6]
["ID1515","2012-05-31T02:24:37",64300,64300,"USD",64300,64300,{"$f":"OFFSET(F57,0,Brains!$D$1,1,1)","v":64300},"Financial Analst","Accountant","USA","USA","4 to 6","4 to 6 hours a day","11-20 yrs","50-74.9K",5,15,4,3,1,4]
["ID1416","2012-05-30T00:22:28",50000,50000,"USD",50000,50000,{"$f":"OFFSET(F58,0,Brains!$D$1,1,1)","v":50000},"Accounting Supervisor","Accountant","USA","USA","4 to 6","4 to 6 hours a day","11-20 yrs","50-74.9K",5,15,4,3,1,4]
["ID1581","2012-06-01T06:17:19",50000,50000,"USD",50000,50000,{"$f":"OFFSET(F59,0,Brains!$D$1,1,1)","v":50000},"Staff Accountant","Accountant","USA","USA","4 to 6","4 to 6 hours a day","11-20 yrs","50-74.9K",5,15,4,3,1,4]
["ID0892","2012-05-27T13:45:47",36500,36500,"USD",36500,36500,{"$f":"OFFSET(F60,0,Brains!$D$1,1,1)","v":36500},"Accountant","Accountant","Saudi Arabia","Saudi Arabia","4 to 6","4 to 6 hours a day","11-20 yrs","30-49.9K",5,15,4,3,1,3]
["ID1774","2012-06-10T01:48:44",1400,16800,"EUR",21342.710575059013,21104.148975192576,{"$f":"OFFSET(F61,0,Brains!$D$1,1,1)","v":21104.148975192576},"account","Accountant","portugal","Portugal","4 to 6","4 to 6 hours a day","11-20 yrs","15-29.9K",5,15,4,3,1,2]
["ID1830","2012-06-13T06:19:24",120000,120000,"USD",120000,120000,{"$f":"OFFSET(F62,0,Brains!$D$1,1,1)","v":120000},"Financial Modeler","Accountant","USA","USA","4 to 6","4 to 6 hours a day","11-20 yrs","100-149.9K",5,20,4,3,1,6]
["ID1751","2012-06-08T09:46:59",85000,85000,"USD",85000,85000,{"$f":"OFFSET(F63,0,Brains!$D$1,1,1)","v":85000},"Actuary","Accountant","USA","USA","4 to 6","4 to 6 hours a day","11-20 yrs","75-99.9K",5,20,4,3,1,5]
["ID0973","2012-05-28T07:00:25",95000,95000,"NZD",75770.868892469181,55072.463768115944,{"$f":"OFFSET(F64,0,Brains!$D$1,1,1)","v":55072.463768115944},"Cost Accountant","Accountant","New Zealand","New Zealand","4 to 6","4 to 6 hours a day","11-20 yrs","50-74.9K",5,20,4,3,1,4]
["ID1200","2012-05-28T23:47:10",19000,19000,"USD",19000,19000,{"$f":"OFFSET(F65,0,Brains!$D$1,1,1)","v":19000},"Accountant","Accountant","UK","UK","4 to 6","4 to 6 hours a day","11-20 yrs","15-29.9K",5,20,4,3,1,2]
["ID1254","2012-05-29T06:24:36",63000,63000,"USD",63000,63000,{"$f":"OFFSET(F66,0,Brains!$D$1,1,1)","v":63000},"Senior Staff Accountant","Accountant","USA","USA","All 8","All the 8 hours baby, all the 8!","11-20 yrs",{"$f":"IF(H66<15000,\"0-14.9K\",IF(H66<30000,\"15-29.9K\",IF(H66<50000,\"30-49.9K\",IF(H66<75000,\"50-74.9K\",IF(H66<100000,\"75-99.9K\",IF(H66<150000,\"100-149.9K\",IF(H66<250000,\"150-249.9K\",\"250K+\")))))))","v":"50-74.9K"},8,16,5,3,1,{"$f":"IF(H66<15000,1,IF(H66<30000,2,IF(H66<50000,3,IF(H66<75000,4,IF(H66<100000,5,IF(H66<150000,6,IF(H66<250000,7,8)))))))","v":4}]
["ID1228","2012-05-29T01:45:13",4100,49200,"USD",49200,49200,{"$f":"OFFSET(F67,0,Brains!$D$1,1,1)","v":49200},"Chief Accountant","Accountant","QATAR","Qatar","2 to 3","2 to 3 hours per day","21-30 yrs","30-49.9K",2.5,25,3,4,1,3]
["ID0581","2012-05-26T07:32:19",130000,130000,"AUD",132588.25533234264,82697.201017811705,{"$f":"OFFSET(F68,0,Brains!$D$1,1,1)","v":82697.201017811705},"Accountant","Accountant","Australia","Australia","2 to 3","2 to 3 hours per day","21-30 yrs","75-99.9K",2.5,27,3,4,1,5]
["ID0941","2012-05-27T23:47:25","30000 $",30000,"USD",30000,30000,{"$f":"OFFSET(F69,0,Brains!$D$1,1,1)","v":30000},"Financial Expert","Accountant","Iran","Iran","2 to 3","2 to 3 hours per day","21-30 yrs","30-49.9K",2.5,30,3,4,1,3]
["ID1472","2012-05-30T16:49:15","Â£25000",25000,"GBP",39404.456801682099,37091.988130563797,{"$f":"OFFSET(F70,0,Brains!$D$1,1,1)","v":37091.988130563797},"Assistant Financial Accountant","Accountant","UK","UK","4 to 6","4 to 6 hours a day","31-40 yrs","30-49.9K",5,35,4,5,1,3]
["ID0729","2012-05-26T15:05:42",600000,600000,"INR",10684.750012465542,29877.502240812668,{"$f":"OFFSET(F71,0,Brains!$D$1,1,1)","v":29877.502240812668},"Sr Financial Execative","Accountant","India","India","All 8","All the 8 hours baby, all the 8!","6-10 yrs","15-29.9K",8,7,5,2,1,2]
["ID0849","2012-05-27T01:30:55","30000 eur",30000,"EUR",38111.983169748237,37685.980312843887,{"$f":"OFFSET(F72,0,Brains!$D$1,1,1)","v":37685.980312843887},"financialcotroller","Accountant","portugal","Portugal","All 8","All the 8 hours baby, all the 8!","6-10 yrs","30-49.9K",8,8,5,2,1,3]
["ID0910","2012-05-27T16:10:27",60000,60000,"USD",60000,60000,{"$f":"OFFSET(F73,0,Brains!$D$1,1,1)","v":60000},"Cost accountant","Accountant","Singapore","Singapore","All 8","All the 8 hours baby, all the 8!","6-10 yrs","50-74.9K",8,10,5,2,1,4]
["ID1205","2012-05-29T00:03:43",34000,34000,"GBP",53590.061250287661,50445.103857566763,{"$f":"OFFSET(F74,0,Brains!$D$1,1,1)","v":50445.103857566763},"investment accountant","Accountant","UK","UK","All 8","All the 8 hours baby, all the 8!","6-10 yrs","50-74.9K",8,10,5,2,1,4]
["ID1206","2012-05-29T00:03:48",34000,34000,"GBP",53590.061250287661,50445.103857566763,{"$f":"OFFSET(F75,0,Brains!$D$1,1,1)","v":50445.103857566763},"investment accountant","Accountant","UK","UK","All 8","All the 8 hours baby, all the 8!","6-10 yrs","50-74.9K",8,10,5,2,1,4]
["ID1246","2012-05-29T04:33:37","GBP 34000",34000,"GBP",53590.061250287661,50445.103857566763,{"$f":"OFFSET(F76,0,Brains!$D$1,1,1)","v":50445.103857566763},"Investment Accountant","Accountant","UK","UK","All 8","All the 8 hours baby, all the 8!","6-10 yrs","50-74.9K",8,10,5,2,1,4]
["ID0771","2012-05-26T17:47:00",205000,205000,"INR",3650.6229209257262,10208.146598944328,{"$f":"OFFSET(F77,0,Brains!$D$1,1,1)","v":10208.146598944328},"BRANCH ACCOUNTANT","Accountant","India","India","All 8","All the 8 hours baby, all the 8!","6-10 yrs","0-14.9K",8,10,5,2,1,1]
["ID0780","2012-05-26T18:44:00","Dhs 2800 + Accomodation",33600,"AED",9146.5655463031271,6349.2063492063498,{"$f":"OFFSET(F78,0,Brains!$D$1,1,1)","v":6349.2063492063498},"Accountant","Accountant","Dubai","Dubai","1 or 2","1 or 2 hours a day","6-10 yrs","0-14.9K",1.5,7,2,2,1,1]
["ID0689","2012-05-26T13:18:32","33,500 US $",33500,"USD",33500,33500,{"$f":"OFFSET(F79,0,Brains!$D$1,1,1)","v":33500},"Sr. Executive Finance & Accounts","Accountant","Dubai","Dubai","1 or 2","1 or 2 hours a day","6-10 yrs","30-49.9K",1.5,10,2,2,1,3]
["ID1837","2012-06-13T20:39:18",425000,425000,"INR",7568.3645921630914,21163.230753908974,{"$f":"OFFSET(F80,0,Brains!$D$1,1,1)","v":21163.230753908974},"accountant","Accountant","India","India","2 to 3","2 to 3 hours per day","6-10 yrs","15-29.9K",2.5,6,3,2,1,2]
["ID1620","2012-06-02T07:42:02",85000,85000,"USD",85000,85000,{"$f":"OFFSET(F81,0,Brains!$D$1,1,1)","v":85000},"Senior Accountant","Accountant","USA","USA","2 to 3","2 to 3 hours per day","6-10 yrs","75-99.9K",2.5,8,3,2,1,5]
["ID1233","2012-05-29T02:19:27","Â£29000",29000,"GBP",45709.169889951241,43026.706231454002,{"$f":"OFFSET(F82,0,Brains!$D$1,1,1)","v":43026.706231454002},"Financial Accountant","Accountant","UK","UK","2 to 3","2 to 3 hours per day","6-10 yrs","30-49.9K",2.5,8,3,2,1,3]
["ID1437","2012-05-30T02:39:50",25000,25000,"USD",25000,25000,{"$f":"OFFSET(F83,0,Brains!$D$1,1,1)","v":25000},"Accountant","Accountant","India","India","2 to 3","2 to 3 hours per day","6-10 yrs","15-29.9K",2.5,8,3,2,1,2]
["ID1113","2012-05-28T16:58:03","Rs. 600000",600000,"INR",10684.750012465542,29877.502240812668,{"$f":"OFFSET(F84,0,Brains!$D$1,1,1)","v":29877.502240812668},"Company Secretary","Accountant","India","India","2 to 3","2 to 3 hours per day","6-10 yrs","15-29.9K",2.5,8,3,2,1,2]
["ID0894","2012-05-27T14:04:31","Rs. 400000",400000,"INR",7123.1666749770275,19918.334827208444,{"$f":"OFFSET(F85,0,Brains!$D$1,1,1)","v":19918.334827208444},"Accountancy","Accountant","India","India","2 to 3","2 to 3 hours per day","6-10 yrs","15-29.9K",2.5,8,3,2,1,2]
["ID1838","2012-06-13T23:32:36",50000,50000,"GBP",78808.913603364199,74183.976261127595,{"$f":"OFFSET(F86,0,Brains!$D$1,1,1)","v":74183.976261127595},"Assistant Financial Accountant","Accountant","UK","UK","2 to 3","2 to 3 hours per day","6-10 yrs","50-74.9K",2.5,10,3,2,1,4]
["ID1109","2012-05-28T16:41:27",40000,40000,"EUR",50815.977559664309,50247.973750458514,{"$f":"OFFSET(F87,0,Brains!$D$1,1,1)","v":50247.973750458514},"Actuary","Accountant","Portugal","Portugal","2 to 3","2 to 3 hours per day","6-10 yrs","50-74.9K",2.5,10,3,2,1,4]
["ID1241","2012-05-29T04:03:07",25000,25000,"GBP",39404.456801682099,37091.988130563797,{"$f":"OFFSET(F88,0,Brains!$D$1,1,1)","v":37091.988130563797},"Senior Accounts Clerk","Accountant","UK","UK","2 to 3","2 to 3 hours per day","6-10 yrs","30-49.9K",2.5,10,3,2,1,3]
["ID1863","2012-06-15T17:35:32",20000,20000,"GBP",31523.565441345683,29673.590504451036,{"$f":"OFFSET(F89,0,Brains!$D$1,1,1)","v":29673.590504451036},"Accountant","Accountant","UK","UK","2 to 3","2 to 3 hours per day","6-10 yrs","15-29.9K",2.5,10,3,2,1,2]
["ID1596","2012-06-01T18:58:42",177600,177600,"USD",177600,177600,{"$f":"OFFSET(F90,0,Brains!$D$1,1,1)","v":177600},"Accountant","Accountant","Lesotho","Lesotho","4 to 6","4 to 6 hours a day","6-10 yrs","150-249.9K",5,6,4,2,1,7]
["ID0796","2012-05-26T20:57:13","Rs. 8000",1152000,"INR",20514.720023933838,57364.804302360324,{"$f":"OFFSET(F91,0,Brains!$D$1,1,1)","v":57364.804302360324},"Cashier","Accountant","India","India","4 to 6","4 to 6 hours a day","6-10 yrs","50-74.9K",5,6,4,2,1,4]
["ID1475","2012-05-30T17:04:53","$AUD 125,000 +",125000,"AUD",127488.70705032947,79516.53944020356,{"$f":"OFFSET(F92,0,Brains!$D$1,1,1)","v":79516.53944020356},"Financial Application Developer","Accountant","Australia","Australia","4 to 6","4 to 6 hours a day","6-10 yrs","75-99.9K",5,7,4,2,1,5]
["ID0601","2012-05-26T08:55:17",45000,45000,"USD",45000,45000,{"$f":"OFFSET(F93,0,Brains!$D$1,1,1)","v":45000},"Head Accounts","Accountant","USA","USA","4 to 6","4 to 6 hours a day","6-10 yrs","30-49.9K",5,7,4,2,1,3]
["ID1124","2012-05-28T17:34:16",242304,242304,"INR",4314.929445034084,12065.730504929788,{"$f":"OFFSET(F94,0,Brains!$D$1,1,1)","v":12065.730504929788},"accountant","Accountant","India","India","4 to 6","4 to 6 hours a day","6-10 yrs","0-14.9K",5,7,4,2,1,1]
["ID1700","2012-06-05T23:09:44","Â£35500",35500,"GBP",55954.328658388586,52670.62314540059,{"$f":"OFFSET(F95,0,Brains!$D$1,1,1)","v":52670.62314540059},"Assistant Accountant","Accountant","UK","UK","4 to 6","4 to 6 hours a day","6-10 yrs","50-74.9K",5,8,4,2,1,4]
["ID1453","2012-05-30T13:06:12",30000,30000,"USD",30000,30000,{"$f":"OFFSET(F96,0,Brains!$D$1,1,1)","v":30000},"Accounting Specialist","Accountant","UAE","UAE","4 to 6","4 to 6 hours a day","6-10 yrs","30-49.9K",5,8,4,2,1,3]
["ID0754","2012-05-26T16:34:18","INR240000",240000,"INR",4273.9000049862161,11951.000896325068,{"$f":"OFFSET(F97,0,Brains!$D$1,1,1)","v":11951.000896325068},"SR. ACCOUNTS EXECUTIVE","Accountant","India","India","4 to 6","4 to 6 hours a day","6-10 yrs","0-14.9K",5,8,4,2,1,1]
["ID1840","2012-06-14T02:44:43",57000,57000,"USD",57000,57000,{"$f":"OFFSET(F98,0,Brains!$D$1,1,1)","v":57000},"Staff Accountant","Accountant","USA","USA","4 to 6","4 to 6 hours a day","6-10 yrs","50-74.9K",5,9,4,2,1,4]
["ID0909","2012-05-27T16:10:04",80000,80000,"GBP",126094.26176538273,118694.36201780415,{"$f":"OFFSET(F99,0,Brains!$D$1,1,1)","v":118694.36201780415},"Financial Modeller","Accountant","UK","UK","4 to 6","4 to 6 hours a day","6-10 yrs","100-149.9K",5,10,4,2,1,6]
["ID1675","2012-06-05T02:21:01",75000,75000,"USD",75000,75000,{"$f":"OFFSET(F100,0,Brains!$D$1,1,1)","v":75000},"Accountant","Accountant","USA","USA","4 to 6","4 to 6 hours a day","6-10 yrs","75-99.9K",5,10,4,2,1,5]
["ID0593","2012-05-26T08:10:43",8000,96000,"CNY",15092.18020692008,22652.194431335531,{"$f":"OFFSET(F101,0,Brains!$D$1,1,1)","v":22652.194431335531},"finance","Accountant","china","China","4 to 6","4 to 6 hours a day","6-10 yrs","15-29.9K",5,10,4,2,1,2]
["ID1154","2012-05-28T20:43:31",168000,168000,"PKR",1783.166904422254,4109.2874789032112,{"$f":"OFFSET(F102,0,Brains!$D$1,1,1)","v":4109.2874789032112},"Accounts Assistant","Accountant","Pakistan","Pakistan","4 to 6","4 to 6 hours a day","6-10 yrs","0-14.9K",5,10,4,2,1,1]
["ID0441","2012-05-26T02:40:39","INR 40L",4000000,"INR",71231.666749770273,199183.34827208446,{"$f":"OFFSET(F103,0,Brains!$D$1,1,1)","v":199183.34827208446},"Sr Mgr Finance","Accountant","India","India","All 8","All the 8 hours baby, all the 8!",null,"150-249.9K",8,null,5,null,1,7]
["ID0528","2012-05-26T04:50:21","EUR 49248",49248,"EUR",62564.631571458704,61865.305281564528,{"$f":"OFFSET(F104,0,Brains!$D$1,1,1)","v":61865.305281564528},"Financial Advisor","Accountant","Netherlands","Netherlands","All 8","All the 8 hours baby, all the 8!",null,"50-74.9K",8,null,5,null,1,4]
["ID0155","2012-05-26T00:45:11",15500,15500,"USD",15500,15500,{"$f":"OFFSET(F105,0,Brains!$D$1,1,1)","v":15500},"Proces auditor","Accountant","Mexico","Mexico","All 8","All the 8 hours baby, all the 8!",null,"15-29.9K",8,null,5,null,1,2]
["ID0010","2012-05-25T03:38:57","PKR 8,000",1152000,"PKR",12227.430201752599,28177.971283907737,{"$f":"OFFSET(F106,0,Brains!$D$1,1,1)","v":28177.971283907737},"Audit Trainee ","Accountant","Pakistan","Pakistan","All 8","All the 8 hours baby, all the 8!",null,"15-29.9K",8,null,5,null,1,2]
["ID0484","2012-05-26T03:25:57",110000,110000,"USD",110000,110000,{"$f":"OFFSET(F107,0,Brains!$D$1,1,1)","v":110000},"Senior consultant accounting","Accountant","Norway","Norway","2 to 3","2 to 3 hours per day",null,"100-149.9K",2.5,null,3,null,1,6]
["ID0243","2012-05-26T01:02:51",79000,79000,"USD",79000,79000,{"$f":"OFFSET(F108,0,Brains!$D$1,1,1)","v":79000},"Director of Finance and Accounting","Accountant","USA","USA","2 to 3","2 to 3 hours per day",null,"75-99.9K",2.5,null,3,null,1,5]
["ID0051","2012-05-25T06:05:17",57000,57000,"USD",57000,57000,{"$f":"OFFSET(F109,0,Brains!$D$1,1,1)","v":57000},"Senior Accounting Supervisor","Accountant","USA","USA","2 to 3","2 to 3 hours per day",null,"50-74.9K",2.5,null,3,null,1,4]
["ID0219","2012-05-26T00:56:37","45k",45000,"USD",45000,45000,{"$f":"OFFSET(F110,0,Brains!$D$1,1,1)","v":45000},"Accounting Assistant","Accountant","USA","USA","2 to 3","2 to 3 hours per day",null,"30-49.9K",2.5,null,3,null,1,3]
["ID0423","2012-05-26T02:20:15","8500 USD",8500,"USD",8500,8500,{"$f":"OFFSET(F111,0,Brains!$D$1,1,1)","v":8500},"Accounting Coordinator","Accountant","Romania","Romania","2 to 3","2 to 3 hours per day",null,"0-14.9K",2.5,null,3,null,1,1]
["ID0054","2012-05-25T06:10:18",4320,4320,"USD",4320,4320,{"$f":"OFFSET(F112,0,Brains!$D$1,1,1)","v":4320},"Financial Planner","Accountant","India","India","2 to 3","2 to 3 hours per day",null,"0-14.9K",2.5,null,3,null,1,1]
["ID0477","2012-05-26T03:17:19",1250000,1250000,"CAD",1229201.9037879086,1000800.6405124099,{"$f":"OFFSET(F113,0,Brains!$D$1,1,1)","v":1000800.6405124099},"Account Executive","Accountant","Canada","Canada","4 to 6","4 to 6 hours a day",null,"250K+",5,null,4,null,1,8]
["ID0220","2012-05-26T00:56:54",78000,78000,"USD",78000,78000,{"$f":"OFFSET(F114,0,Brains!$D$1,1,1)","v":78000},"Tax Professional","Accountant","Bermuda","Bermuda","4 to 6","4 to 6 hours a day",null,"75-99.9K",5,null,4,null,1,5]
["ID0268","2012-05-26T01:08:42","$77,000 USD",77000,"USD",77000,77000,{"$f":"OFFSET(F115,0,Brains!$D$1,1,1)","v":77000},"senior accounting coordinator","Accountant","USA","USA","4 to 6","4 to 6 hours a day",null,"75-99.9K",5,null,4,null,1,5]
["ID0237","2012-05-26T01:02:04",65250,65250,"USD",65250,65250,{"$f":"OFFSET(F116,0,Brains!$D$1,1,1)","v":65250},"Accountant","Accountant","USA","USA","4 to 6","4 to 6 hours a day",null,"50-74.9K",5,null,4,null,1,4]
["ID0052","2012-05-25T06:07:15",40000,40000,"GBP",63047.130882691366,59347.181008902073,{"$f":"OFFSET(F117,0,Brains!$D$1,1,1)","v":59347.181008902073},"Senior Accountant","Accountant","UK","UK","4 to 6","4 to 6 hours a day",null,"50-74.9K",5,null,4,null,1,4]
["ID0519","2012-05-26T04:33:27",61000,61000,"USD",61000,61000,{"$f":"OFFSET(F118,0,Brains!$D$1,1,1)","v":61000},"Senior Accountant","Accountant","USA","USA","4 to 6","4 to 6 hours a day",null,"50-74.9K",5,null,4,null,1,4]
["ID0186","2012-05-26T00:50:38",60000,60000,"USD",60000,60000,{"$f":"OFFSET(F119,0,Brains!$D$1,1,1)","v":60000},"Senior Staff Accountant","Accountant","USA","USA","4 to 6","4 to 6 hours a day",null,"50-74.9K",5,null,4,null,1,4]
["ID0459","2012-05-26T03:03:29","Â£38000",38000,"GBP",59894.774338556796,56379.821958456974,{"$f":"OFFSET(F120,0,Brains!$D$1,1,1)","v":56379.821958456974},"Commercial Accountant","Accountant","UK","UK","4 to 6","4 to 6 hours a day",null,"50-74.9K",5,null,4,null,1,4]
["ID0044","2012-05-25T05:35:28",58000,58000,"USD",58000,58000,{"$f":"OFFSET(F121,0,Brains!$D$1,1,1)","v":58000},"Senior Accountant","Accountant","USA","USA","4 to 6","4 to 6 hours a day",null,"50-74.9K",5,null,4,null,1,4]
["ID0409","2012-05-26T02:11:40","Â£35000",35000,"GBP",55166.239522354947,51928.783382789312,{"$f":"OFFSET(F122,0,Brains!$D$1,1,1)","v":51928.783382789312},"Mgmt Accountant","Accountant","UK","UK","4 to 6","4 to 6 hours a day",null,"50-74.9K",5,null,4,null,1,4]
["ID0390","2012-05-26T02:00:46",55000,55000,"USD",55000,55000,{"$f":"OFFSET(F123,0,Brains!$D$1,1,1)","v":55000},"Accountant","Accountant","USA","USA","4 to 6","4 to 6 hours a day",null,"50-74.9K",5,null,4,null,1,4]
["ID0414","2012-05-26T02:14:48",52000,52000,"USD",52000,52000,{"$f":"OFFSET(F124,0,Brains!$D$1,1,1)","v":52000},"Sr. Accountant","Accountant","USA","USA","4 to 6","4 to 6 hours a day",null,"50-74.9K",5,null,4,null,1,4]
["ID0129","2012-05-26T00:42:32","36000 usd",36000,"USD",36000,36000,{"$f":"OFFSET(F125,0,Brains!$D$1,1,1)","v":36000},"senior accountant","Accountant","Turkey","Turkey","4 to 6","4 to 6 hours a day",null,"30-49.9K",5,null,4,null,1,3]
["ID0287","2012-05-26T01:17:11","AED100000",100000,"AED",27221.92126875931,18896.447467876042,{"$f":"OFFSET(F126,0,Brains!$D$1,1,1)","v":18896.447467876042},"Accountant","Accountant","Dubai","Dubai","4 to 6","4 to 6 hours a day",null,"15-29.9K",5,null,4,null,1,2]
["ID0168","2012-05-26T00:48:04",22880,22880,"USD",22880,22880,{"$f":"OFFSET(F127,0,Brains!$D$1,1,1)","v":22880},"Accounting ","Accountant","USA","USA","4 to 6","4 to 6 hours a day",null,"15-29.9K",5,null,4,null,1,2]
["ID0222","2012-05-26T00:57:35","INR 350k",350000,"INR",6232.7708406048987,17428.542973807391,{"$f":"OFFSET(F128,0,Brains!$D$1,1,1)","v":17428.542973807391},"Jr. Executive Finance","Accountant","India","India","4 to 6","4 to 6 hours a day",null,"15-29.9K",5,null,4,null,1,2]
["ID0335","2012-05-26T01:33:03",150000,150000,"USD",150000,150000,{"$f":"OFFSET(F129,0,Brains!$D$1,1,1)","v":150000},"financial planning","Accountant","USA","USA","All 8","All the 8 hours baby, all the 8!",null,"150-249.9K",8,null,5,null,1,7]
["ID0158","2012-05-26T00:45:49",100000,100000,"USD",100000,100000,{"$f":"OFFSET(F130,0,Brains!$D$1,1,1)","v":100000},"COST ACCOUNTANT","Accountant","USA","USA","All 8","All the 8 hours baby, all the 8!",null,{"$f":"IF(H130<15000,\"0-14.9K\",IF(H130<30000,\"15-29.9K\",IF(H130<50000,\"30-49.9K\",IF(H130<75000,\"50-74.9K\",IF(H130<100000,\"75-99.9K\",IF(H130<150000,\"100-149.9K\",IF(H130<250000,\"150-249.9K\",\"250K+\")))))))","v":"100-149.9K"},8,null,5,null,1,{"$f":"IF(H130<15000,1,IF(H130<30000,2,IF(H130<50000,3,IF(H130<75000,4,IF(H130<100000,5,IF(H130<150000,6,IF(H130<250000,7,8)))))))","v":6}]
["ID0122","2012-05-26T00:41:43",70000,70000,"USD",70000,70000,{"$f":"OFFSET(F131,0,Brains!$D$1,1,1)","v":70000},"Sr. Acct","Accountant","USA","USA","All 8","All the 8 hours baby, all the 8!",null,"50-74.9K",8,null,5,null,1,4]
["ID0128","2012-05-26T00:42:11",65000,65000,"USD",65000,65000,{"$f":"OFFSET(F132,0,Brains!$D$1,1,1)","v":65000},"sr accountant","Accountant","USA","USA","All 8","All the 8 hours baby, all the 8!",null,"50-74.9K",8,null,5,null,1,4]
["ID0153","2012-05-26T00:45:00",65000,65000,"USD",65000,65000,{"$f":"OFFSET(F133,0,Brains!$D$1,1,1)","v":65000},"Sr Accountant","Accountant","USA","USA","All 8","All the 8 hours baby, all the 8!",null,"50-74.9K",8,null,5,null,1,4]
["ID0264","2012-05-26T01:08:19",62400,62400,"USD",62400,62400,{"$f":"OFFSET(F134,0,Brains!$D$1,1,1)","v":62400},"financial accountant","Accountant","USA","USA","All 8","All the 8 hours baby, all the 8!",null,"50-74.9K",8,null,5,null,1,4]
["ID0545","2012-05-26T05:29:58",43000,43000,"USD",43000,43000,{"$f":"OFFSET(F135,0,Brains!$D$1,1,1)","v":43000},"Accountant","Accountant","USA","USA","All 8","All the 8 hours baby, all the 8!",null,"30-49.9K",8,null,5,null,1,3]
["ID0114","2012-05-26T00:41:28",37900,37900,"USD",37900,37900,{"$f":"OFFSET(F136,0,Brains!$D$1,1,1)","v":37900},"Accounting Coordinator","Accountant","USA","USA","All 8","All the 8 hours baby, all the 8!",null,"30-49.9K",8,null,5,null,1,3]
["ID1072","2012-05-28T14:56:27",15600,15600,"GBP",24588.381044249632,23145.400593471808,{"$f":"OFFSET(F137,0,Brains!$D$1,1,1)","v":23145.400593471808},"business data analyst","Analyst","UK","UK","All 8","All the 8 hours baby, all the 8!","0-5 yrs","15-29.9K",8,0,5,1,2,2]
["ID1777","2012-06-10T04:16:05",500000,500000,"INR",8903.9583437212841,24897.918534010558,{"$f":"OFFSET(F138,0,Brains!$D$1,1,1)","v":24897.918534010558},"equity research trainee","Analyst","India","India","All 8","All the 8 hours baby, all the 8!","0-5 yrs","15-29.9K",8,0,5,1,2,2]
["ID1859","2012-06-15T15:07:11",700,8400,"USD",8400,8400,{"$f":"OFFSET(F139,0,Brains!$D$1,1,1)","v":8400},"Analyst","Analyst","Baltic","Baltic","All 8","All the 8 hours baby, all the 8!","0-5 yrs","0-14.9K",8,0.3,5,1,2,1]
["ID1327","2012-05-29T16:07:59",9000,9000,"USD",9000,9000,{"$f":"OFFSET(F140,0,Brains!$D$1,1,1)","v":9000},"Data Analyst","Analyst","India","India","All 8","All the 8 hours baby, all the 8!","0-5 yrs","0-14.9K",8,0.6,5,1,2,1]
["ID0626","2012-05-26T11:05:45",100000,100000,"AUD",101990.96564026357,63613.231552162855,{"$f":"OFFSET(F141,0,Brains!$D$1,1,1)","v":63613.231552162855},"Business Analyst","Analyst","Australia","Australia","All 8","All the 8 hours baby, all the 8!","0-5 yrs","50-74.9K",8,1,5,1,2,4]
["ID1814","2012-06-12T18:28:39",32000,32000,"GBP",50437.70470615309,47477.744807121657,{"$f":"OFFSET(F142,0,Brains!$D$1,1,1)","v":47477.744807121657},"Financial Analyst","Analyst","UK","UK","All 8","All the 8 hours baby, all the 8!","0-5 yrs","30-49.9K",8,1,5,1,2,3]
["ID1615","2012-06-02T03:29:19","Â£21500Uk",21500,"GBP",33887.832849446611,31899.109792284864,{"$f":"OFFSET(F143,0,Brains!$D$1,1,1)","v":31899.109792284864},"Data Analyst","Analyst","UK","UK","All 8","All the 8 hours baby, all the 8!","0-5 yrs","30-49.9K",8,1,5,1,2,3]
["ID1612","2012-06-02T03:08:50",1800000,1800000,"INR",32054.250037396621,89632.506722438004,{"$f":"OFFSET(F144,0,Brains!$D$1,1,1)","v":89632.506722438004},"analyst","Analyst","India","India","All 8","All the 8 hours baby, all the 8!","0-5 yrs","75-99.9K",8,1,5,1,2,5]
["ID0937","2012-05-27T23:10:01","Rs.7,00,000",700000,"INR",12465.541681209797,34857.085947614782,{"$f":"OFFSET(F145,0,Brains!$D$1,1,1)","v":34857.085947614782},"Business Analyst","Analyst","India","India","All 8","All the 8 hours baby, all the 8!","0-5 yrs","30-49.9K",8,1,5,1,2,3]
["ID1125","2012-05-28T17:38:46",210000,210000,"INR",3739.6625043629392,10457.125784284433,{"$f":"OFFSET(F146,0,Brains!$D$1,1,1)","v":10457.125784284433},"information Analyst","Analyst","India","India","All 8","All the 8 hours baby, all the 8!","0-5 yrs","0-14.9K",8,1,5,1,2,1]
["ID0818","2012-05-26T22:29:21",144000,144000,"INR",2564.3400029917298,7170.6005377950405,{"$f":"OFFSET(F147,0,Brains!$D$1,1,1)","v":7170.6005377950405},"BPO information process enabler","Analyst","India","India","All 8","All the 8 hours baby, all the 8!","0-5 yrs","0-14.9K",8,1,5,1,2,1]
["ID0747","2012-05-26T16:12:09","GBP21798",21798,"GBP",34357.533974522659,32341.246290801184,{"$f":"OFFSET(F148,0,Brains!$D$1,1,1)","v":32341.246290801184},"Data Analyst","Analyst","UK","UK","All 8","All the 8 hours baby, all the 8!","0-5 yrs","30-49.9K",8,1.5,5,1,2,3]
["ID1886","2012-06-17T12:00:57",25000,25000,"USD",25000,25000,{"$f":"OFFSET(F149,0,Brains!$D$1,1,1)","v":25000},"Data Analyst","Analyst","India","India","All 8","All the 8 hours baby, all the 8!","0-5 yrs","15-29.9K",8,1.5,5,1,2,2]
["ID1731","2012-06-07T09:25:45",70000,70000,"CAD",68835.306612122877,56044.83586869495,{"$f":"OFFSET(F150,0,Brains!$D$1,1,1)","v":56044.83586869495},"Financial Analyst","Analyst","Canada","Canada","All 8","All the 8 hours baby, all the 8!","0-5 yrs","50-74.9K",8,2,5,1,2,4]
["ID1714","2012-06-06T11:21:08",36000,36000,"CAD",35401.014829091764,28823.058446757401,{"$f":"OFFSET(F151,0,Brains!$D$1,1,1)","v":28823.058446757401},"data organizer","Analyst","Canada","Canada","All 8","All the 8 hours baby, all the 8!","0-5 yrs","15-29.9K",8,2,5,1,2,2]
["ID1797","2012-06-11T22:21:25",33600,33600,"USD",33600,33600,{"$f":"OFFSET(F152,0,Brains!$D$1,1,1)","v":33600},"Executive","Analyst","Singapore","Singapore","All 8","All the 8 hours baby, all the 8!","0-5 yrs","30-49.9K",8,2,5,1,2,3]
["ID1798","2012-06-11T22:22:00",33600,33600,"USD",33600,33600,{"$f":"OFFSET(F153,0,Brains!$D$1,1,1)","v":33600},"Executive","Analyst","Singapore","Singapore","All 8","All the 8 hours baby, all the 8!","0-5 yrs","30-49.9K",8,2,5,1,2,3]
["ID1460","2012-05-30T13:47:51","zar22000",264000,"ZAR",32187.34988380854,46544.428772919608,{"$f":"OFFSET(F154,0,Brains!$D$1,1,1)","v":46544.428772919608},"Analyst","Analyst","SouthAfrica","South Africa","All 8","All the 8 hours baby, all the 8!","0-5 yrs","30-49.9K",8,2,5,1,2,3]
["ID0692","2012-05-26T13:24:05","4500 rs. per month",648000,"INR",11539.530013462785,32267.70242007768,{"$f":"OFFSET(F155,0,Brains!$D$1,1,1)","v":32267.70242007768},"COMPUTER OPERATOR","Analyst","India","India","All 8","All the 8 hours baby, all the 8!","0-5 yrs","30-49.9K",8,2,5,1,2,3]
["ID1524","2012-05-31T05:37:29",800,9600,"USD",9600,9600,{"$f":"OFFSET(F156,0,Brains!$D$1,1,1)","v":9600},"Reporting Analyst","Analyst","Bolivia","Bolivia","All 8","All the 8 hours baby, all the 8!","0-5 yrs","0-14.9K",8,2,5,1,2,1]
["ID1260","2012-05-29T07:57:04",800000,9600000,"MONGOLIAN",7261.724659606657,10432.16322858065,{"$f":"OFFSET(F157,0,Brains!$D$1,1,1)","v":10432.16322858065},"Analyst","Analyst","Mongolia","Mongolia","All 8","All the 8 hours baby, all the 8!","0-5 yrs","0-14.9K",8,2,5,1,2,1]
["ID0702","2012-05-26T13:46:52","370000 inr",370000,"INR",6588.9291743537506,18424.45971516781,{"$f":"OFFSET(F158,0,Brains!$D$1,1,1)","v":18424.45971516781},"Operations Analyst","Analyst","India","India","All 8","All the 8 hours baby, all the 8!","0-5 yrs","15-29.9K",8,2,5,1,2,2]
["ID0703","2012-05-26T13:47:06","370000 inr",370000,"INR",6588.9291743537506,18424.45971516781,{"$f":"OFFSET(F159,0,Brains!$D$1,1,1)","v":18424.45971516781},"Operations Analyst","Analyst","India","India","All 8","All the 8 hours baby, all the 8!","0-5 yrs","15-29.9K",8,2,5,1,2,2]
["ID1876","2012-06-16T14:10:51","INR 360000",360000,"INR",6410.8500074793246,17926.501344487599,{"$f":"OFFSET(F160,0,Brains!$D$1,1,1)","v":17926.501344487599},"Analyst","Analyst","India","India","All 8","All the 8 hours baby, all the 8!","0-5 yrs","15-29.9K",8,2,5,1,2,2]
["ID1892","2012-06-18T08:19:01",5000,5000,"USD",5000,5000,{"$f":"OFFSET(F161,0,Brains!$D$1,1,1)","v":5000},"analyst ","Analyst","India","India","All 8","All the 8 hours baby, all the 8!","0-5 yrs","0-14.9K",8,2,5,1,2,1]
["ID0781","2012-05-26T18:56:52",570000,570000,"INR",10150.512511842264,28383.627128772034,{"$f":"OFFSET(F162,0,Brains!$D$1,1,1)","v":28383.627128772034},"Analyst","Analyst","India","India","All 8","All the 8 hours baby, all the 8!","0-5 yrs","15-29.9K",8,2.4,5,1,2,2]
["ID0822","2012-05-26T22:45:14","R$3.000,00",300000,"BRL",148284.35006969364,159574.46808510637,{"$f":"OFFSET(F163,0,Brains!$D$1,1,1)","v":159574.46808510637},"Market Intelligence Analyst","Analyst","Brazil","Brazil","All 8","All the 8 hours baby, all the 8!","0-5 yrs","150-249.9K",8,3,5,1,2,7]
["ID1650","2012-06-03T19:40:18",86000,86000,"USD",86000,86000,{"$f":"OFFSET(F164,0,Brains!$D$1,1,1)","v":86000},"Analyst","Analyst","Philippines","Philippines","All 8","All the 8 hours baby, all the 8!","0-5 yrs","75-99.9K",8,3,5,1,2,5]
["ID1893","2012-06-18T14:27:59","$AUD 76300",76300,"AUD",77819.106783521114,48536.895674300256,{"$f":"OFFSET(F165,0,Brains!$D$1,1,1)","v":48536.895674300256},"Operations Analyst","Analyst","Australia","Australia","All 8","All the 8 hours baby, all the 8!","0-5 yrs","30-49.9K",8,3,5,1,2,3]
["ID1104","2012-05-28T16:26:14",43912.03,43912,"GBP",69213.140283018583,65151.3353115727,{"$f":"OFFSET(F166,0,Brains!$D$1,1,1)","v":65151.3353115727},"Senior Data Analyst","Analyst","UK","UK","All 8","All the 8 hours baby, all the 8!","0-5 yrs","50-74.9K",8,3,5,1,2,4]
["ID1607","2012-06-01T23:29:43","Â£20000",20000,"GBP",31523.565441345683,29673.590504451036,{"$f":"OFFSET(F167,0,Brains!$D$1,1,1)","v":29673.590504451036},"Operations Analyst","Analyst","UK","UK","All 8","All the 8 hours baby, all the 8!","0-5 yrs","15-29.9K",8,3,5,1,2,2]
["ID1759","2012-06-08T18:52:06",1230000,1230000,"INR",21903.737525554359,61248.879593665966,{"$f":"OFFSET(F168,0,Brains!$D$1,1,1)","v":61248.879593665966},"Financial Analyst ","Analyst","India","India","All 8","All the 8 hours baby, all the 8!","0-5 yrs","50-74.9K",8,3,5,1,2,4]
["ID1760","2012-06-08T18:52:44",1130000,1130000,"INR",20122.945856810104,56269.29588686386,{"$f":"OFFSET(F169,0,Brains!$D$1,1,1)","v":56269.29588686386},"Financial Analyst ","Analyst","India","India","All 8","All the 8 hours baby, all the 8!","0-5 yrs","50-74.9K",8,3,5,1,2,4]
["ID1165","2012-05-28T22:33:29",600000,600000,"DOP",15404.364569961488,24760.647078243645,{"$f":"OFFSET(F170,0,Brains!$D$1,1,1)","v":24760.647078243645},"Analista de Produccion","Analyst","Republica Dominicana","Dominican Republic","All 8","All the 8 hours baby, all the 8!","0-5 yrs","15-29.9K",8,3,5,1,2,2]
["ID1338","2012-05-29T17:09:52",300000,300000,"INR",5342.3750062327708,14938.751120406334,{"$f":"OFFSET(F171,0,Brains!$D$1,1,1)","v":14938.751120406334},"Financial Modelling Analyst","Analyst","India","India","All 8","All the 8 hours baby, all the 8!","0-5 yrs","0-14.9K",8,3,5,1,2,1]
["ID1112","2012-05-28T16:53:13","Rs. 15000",180000,"INR",3205.4250037396623,8963.2506722437993,{"$f":"OFFSET(F172,0,Brains!$D$1,1,1)","v":8963.2506722437993},"Logistics Operation Analyst","Analyst","India","India","All 8","All the 8 hours baby, all the 8!","0-5 yrs","0-14.9K",8,3,5,1,2,1]
["ID0851","2012-05-27T01:46:00",650000,650000,"INR",11575.14584683767,32367.294094213721,{"$f":"OFFSET(F173,0,Brains!$D$1,1,1)","v":32367.294094213721},"Financial Analyist","Analyst","India","India","All 8","All the 8 hours baby, all the 8!","0-5 yrs","30-49.9K",8,3.5,5,1,2,3]
["ID1805","2012-06-12T03:45:25",78000,78000,"CAD",76702.198796365497,62449.95996797437,{"$f":"OFFSET(F174,0,Brains!$D$1,1,1)","v":62449.95996797437},"SFA","Analyst","Canada","Canada","All 8","All the 8 hours baby, all the 8!","0-5 yrs","50-74.9K",8,4,5,1,2,4]
["ID1783","2012-06-10T20:30:23","Â£22300",22300,"GBP",35148.775467100437,33086.053412462905,{"$f":"OFFSET(F175,0,Brains!$D$1,1,1)","v":33086.053412462905},"Analysis & insight consultant","Analyst","UK","UK","All 8","All the 8 hours baby, all the 8!","0-5 yrs","30-49.9K",8,4,5,1,2,3]
["ID0996","2012-05-28T09:38:29",35000,35000,"CAD",34417.653306061438,28022.417934347475,{"$f":"OFFSET(F176,0,Brains!$D$1,1,1)","v":28022.417934347475},"Reporting Analyst","Analyst","Canada","Canada","All 8","All the 8 hours baby, all the 8!","0-5 yrs","15-29.9K",8,4,5,1,2,2]
["ID1546","2012-05-31T17:21:45",34000,34000,"USD",34000,34000,{"$f":"OFFSET(F177,0,Brains!$D$1,1,1)","v":34000},"Sr Analyst","Analyst","India","India","All 8","All the 8 hours baby, all the 8!","0-5 yrs","30-49.9K",8,4,5,1,2,3]
["ID1567","2012-06-01T00:23:54",30000,30000,"USD",30000,30000,{"$f":"OFFSET(F178,0,Brains!$D$1,1,1)","v":30000},"SME","Analyst","India","India","All 8","All the 8 hours baby, all the 8!","0-5 yrs","30-49.9K",8,4,5,1,2,3]
["ID1487","2012-05-30T19:43:43",25000,25000,"USD",25000,25000,{"$f":"OFFSET(F179,0,Brains!$D$1,1,1)","v":25000},"data analyst","Analyst","India","India","All 8","All the 8 hours baby, all the 8!","0-5 yrs","15-29.9K",8,4,5,1,2,2]
["ID1595","2012-06-01T18:18:31","Rs 1000000",1000000,"INR",17807.916687442568,49795.837068021116,{"$f":"OFFSET(F180,0,Brains!$D$1,1,1)","v":49795.837068021116},"Senior Analyst","Analyst","India","India","All 8","All the 8 hours baby, all the 8!","0-5 yrs","30-49.9K",8,4,5,1,2,3]
["ID1647","2012-06-03T14:52:21","INR 1000000",1000000,"INR",17807.916687442568,49795.837068021116,{"$f":"OFFSET(F181,0,Brains!$D$1,1,1)","v":49795.837068021116},"Senior Associate, Finance","Analyst","India","India","All 8","All the 8 hours baby, all the 8!","0-5 yrs","30-49.9K",8,4,5,1,2,3]
["ID1621","2012-06-02T11:11:18","U$13,000",13000,"USD",13000,13000,{"$f":"OFFSET(F182,0,Brains!$D$1,1,1)","v":13000},"Dss Analyst","Analyst","Brazil","Brazil","All 8","All the 8 hours baby, all the 8!","0-5 yrs","0-14.9K",8,4,5,1,2,1]
["ID0802","2012-05-26T21:13:02",600000,600000,"INR",10684.750012465542,29877.502240812668,{"$f":"OFFSET(F183,0,Brains!$D$1,1,1)","v":29877.502240812668},"MIS Analyst","Analyst","India","India","All 8","All the 8 hours baby, all the 8!","0-5 yrs","15-29.9K",8,4,5,1,2,2]
["ID1294","2012-05-29T13:06:30",8000,8000,"USD",8000,8000,{"$f":"OFFSET(F184,0,Brains!$D$1,1,1)","v":8000},"Data Analyst","Analyst","India","India","All 8","All the 8 hours baby, all the 8!","0-5 yrs","0-14.9K",8,4,5,1,2,1]
["ID0828","2012-05-26T23:03:59","30000 Rs",360000,"INR",6410.8500074793246,17926.501344487599,{"$f":"OFFSET(F185,0,Brains!$D$1,1,1)","v":17926.501344487599},"Application Developer","Analyst","India","India","All 8","All the 8 hours baby, all the 8!","0-5 yrs","15-29.9K",8,4,5,1,2,2]
["ID0787","2012-05-26T19:34:12",240000,240000,"INR",4273.9000049862161,11951.000896325068,{"$f":"OFFSET(F186,0,Brains!$D$1,1,1)","v":11951.000896325068},"Analyst","Analyst","India","India","All 8","All the 8 hours baby, all the 8!","0-5 yrs","0-14.9K",8,4,5,1,2,1]
["ID1690","2012-06-05T19:37:13","Â£45000",45000,"GBP",70928.022243027779,66765.578635014841,{"$f":"OFFSET(F187,0,Brains!$D$1,1,1)","v":66765.578635014841},"Data Analyst","Analyst","UK","UK","All 8","All the 8 hours baby, all the 8!","0-5 yrs","50-74.9K",8,5,5,1,2,4]
["ID1693","2012-06-05T21:07:16","400 000 NOK",400000,"NOK",67700.452577525488,38095.238095238092,{"$f":"OFFSET(F188,0,Brains!$D$1,1,1)","v":38095.238095238092},"Economic analyst","Analyst","Norway","Norway","All 8","All the 8 hours baby, all the 8!","0-5 yrs","30-49.9K",8,5,5,1,2,3]
["ID0712","2012-05-26T14:16:14","inr 2300000",2300000,"INR",40958.208381117904,114530.42525644857,{"$f":"OFFSET(F189,0,Brains!$D$1,1,1)","v":114530.42525644857},"analyst","Analyst","India","India","All 8","All the 8 hours baby, all the 8!","0-5 yrs","100-149.9K",8,5,5,1,2,6]
["ID1093","2012-05-28T16:01:05","Â£23000",23000,"GBP",36252.100257547536,34124.629080118691,{"$f":"OFFSET(F190,0,Brains!$D$1,1,1)","v":34124.629080118691},"Data Analyst","Analyst","UK","UK","All 8","All the 8 hours baby, all the 8!","0-5 yrs","30-49.9K",8,5,5,1,2,3]
["ID0740","2012-05-26T15:53:10",10000,120000,"EGYPT",19831.432821021317,41753.653444676405,{"$f":"OFFSET(F191,0,Brains!$D$1,1,1)","v":41753.653444676405},"Estimator","Analyst","Egypt","Egypt","All 8","All the 8 hours baby, all the 8!","0-5 yrs","30-49.9K",8,5,5,1,2,3]
["ID0761","2012-05-26T17:04:23","INR 700000",700000,"INR",12465.541681209797,34857.085947614782,{"$f":"OFFSET(F192,0,Brains!$D$1,1,1)","v":34857.085947614782},"Sales Management Analyst","Analyst","India","India","All 8","All the 8 hours baby, all the 8!","0-5 yrs","30-49.9K",8,5,5,1,2,3]
["ID0823","2012-05-26T22:48:11",600000,600000,"INR",10684.750012465542,29877.502240812668,{"$f":"OFFSET(F193,0,Brains!$D$1,1,1)","v":29877.502240812668},"Reporting Analyst","Analyst","India","India","All 8","All the 8 hours baby, all the 8!","0-5 yrs","15-29.9K",8,5,5,1,2,2]
["ID1717","2012-06-06T17:41:41",600000,600000,"INR",10684.750012465542,29877.502240812668,{"$f":"OFFSET(F194,0,Brains!$D$1,1,1)","v":29877.502240812668},"admin","Analyst","India","India","All 8","All the 8 hours baby, all the 8!","0-5 yrs",{"$f":"IF(H194<15000,\"0-14.9K\",IF(H194<30000,\"15-29.9K\",IF(H194<50000,\"30-49.9K\",IF(H194<75000,\"50-74.9K\",IF(H194<100000,\"75-99.9K\",IF(H194<150000,\"100-149.9K\",IF(H194<250000,\"150-249.9K\",\"250K+\")))))))","v":"15-29.9K"},8,5,5,1,2,{"$f":"IF(H194<15000,1,IF(H194<30000,2,IF(H194<50000,3,IF(H194<75000,4,IF(H194<100000,5,IF(H194<150000,6,IF(H194<250000,7,8)))))))","v":2}]
["ID0739","2012-05-26T15:51:11",410000,410000,"INR",7301.2458418514525,20416.293197888655,{"$f":"OFFSET(F195,0,Brains!$D$1,1,1)","v":20416.293197888655},"MIS Analyst","Analyst","India","India","All 8","All the 8 hours baby, all the 8!","0-5 yrs","15-29.9K",8,5,5,1,2,2]
["ID0708","2012-05-26T14:04:35","Rs 10000",120000,"INR",2136.9500024931081,5975.5004481625338,{"$f":"OFFSET(F196,0,Brains!$D$1,1,1)","v":5975.5004481625338},"Intern","Analyst","India","India","1 or 2","1 or 2 hours a day","0-5 yrs","0-14.9K",1.5,0,2,1,2,1]
["ID1800","2012-06-12T01:55:12",40000,40000,"CAD",39334.460921213074,32025.620496397114,{"$f":"OFFSET(F197,0,Brains!$D$1,1,1)","v":32025.620496397114},"Machine Scheduler","Analyst","Canada","Canada","1 or 2","1 or 2 hours a day","0-5 yrs","30-49.9K",1.5,1,2,1,2,3]
["ID1831","2012-06-13T11:58:30",20000,20000,"USD",20000,20000,{"$f":"OFFSET(F198,0,Brains!$D$1,1,1)","v":20000},"Personal Assistant","Analyst","Hong Kong","Hong Kong","1 or 2","1 or 2 hours a day","0-5 yrs","15-29.9K",1.5,1,2,1,2,2]
["ID1194","2012-05-28T23:17:31",56000,56000,"USD",56000,56000,{"$f":"OFFSET(F199,0,Brains!$D$1,1,1)","v":56000},"Analyst","Analyst","USA","USA","1 or 2","1 or 2 hours a day","0-5 yrs","50-74.9K",1.5,2,2,1,2,4]
["ID1274","2012-05-29T09:52:02","48000 $AUD",48000,"AUD",48955.663507326513,30534.35114503817,{"$f":"OFFSET(F200,0,Brains!$D$1,1,1)","v":30534.35114503817},"Research Assistant","Analyst","Australia","Australia","1 or 2","1 or 2 hours a day","0-5 yrs","30-49.9K",1.5,2,2,1,2,3]
["ID1883","2012-06-17T01:34:46","4,00,000",400000,"INR",7123.1666749770275,19918.334827208444,{"$f":"OFFSET(F201,0,Brains!$D$1,1,1)","v":19918.334827208444},"technical analyst","Analyst","India","India","1 or 2","1 or 2 hours a day","0-5 yrs","15-29.9K",1.5,2,2,1,2,2]
["ID1245","2012-05-29T04:30:10","IDR 4000000",48000000,"IDR",5082.6943786459069,6691.5583342871123,{"$f":"OFFSET(F202,0,Brains!$D$1,1,1)","v":6691.5583342871123},"Office Instructor","Analyst","Indonesia","Indonesia","1 or 2","1 or 2 hours a day","0-5 yrs","0-14.9K",1.5,2,2,1,2,1]
["ID1627","2012-06-02T20:50:40",400000,400000,"INR",7123.1666749770275,19918.334827208444,{"$f":"OFFSET(F203,0,Brains!$D$1,1,1)","v":19918.334827208444},"application dev","Analyst","India","India","1 or 2","1 or 2 hours a day","0-5 yrs","15-29.9K",1.5,2.5,2,1,2,2]
["ID1915","2012-06-20T00:55:28",75000,75000,"USD",75000,75000,{"$f":"OFFSET(F204,0,Brains!$D$1,1,1)","v":75000},"Data Analyst","Analyst","USA","USA","1 or 2","1 or 2 hours a day","0-5 yrs","75-99.9K",1.5,3,2,1,2,5]
["ID1930","2012-06-21T04:06:15",40000,40000,"USD",40000,40000,{"$f":"OFFSET(F205,0,Brains!$D$1,1,1)","v":40000},"Corporate Trainer","Analyst","USA","USA","1 or 2","1 or 2 hours a day","0-5 yrs","30-49.9K",1.5,3,2,1,2,3]
["ID1652","2012-06-04T02:03:53","280$/ month",3360,"USD",3360,3360,{"$f":"OFFSET(F206,0,Brains!$D$1,1,1)","v":3360},"service executive","Analyst","India","India","1 or 2","1 or 2 hours a day","0-5 yrs","0-14.9K",1.5,3,2,1,2,1]
["ID0686","2012-05-26T13:16:21",13000,13000,"USD",13000,13000,{"$f":"OFFSET(F207,0,Brains!$D$1,1,1)","v":13000},"Analyst","Analyst","India","India","1 or 2","1 or 2 hours a day","0-5 yrs","0-14.9K",1.5,4,2,1,2,1]
["ID1537","2012-05-31T13:25:49","85,000 AUD",85000,"AUD",86692.320794224041,54071.246819338427,{"$f":"OFFSET(F208,0,Brains!$D$1,1,1)","v":54071.246819338427},"Demand Planner","Analyst","Australia","Australia","1 or 2","1 or 2 hours a day","0-5 yrs","50-74.9K",1.5,5,2,1,2,4]
["ID1315","2012-05-29T15:08:12","â‚¬ 28500",28500,"EUR",36206.384011260823,35801.681297201692,{"$f":"OFFSET(F209,0,Brains!$D$1,1,1)","v":35801.681297201692},"Salary Professsional","Analyst","Netherlands","Netherlands","1 or 2","1 or 2 hours a day","0-5 yrs","30-49.9K",1.5,5,2,1,2,3]
["ID1467","2012-05-30T14:31:33",620000,620000,"INR",11040.908346214392,30873.418982173091,{"$f":"OFFSET(F210,0,Brains!$D$1,1,1)","v":30873.418982173091},"Catalog Auditor","Analyst","India","India","1 or 2","1 or 2 hours a day","0-5 yrs","30-49.9K",1.5,5,2,1,2,3]
["ID0959","2012-05-28T04:05:14",8000,8000,"USD",8000,8000,{"$f":"OFFSET(F211,0,Brains!$D$1,1,1)","v":8000},"IT Analyst","Analyst","India","India","1 or 2","1 or 2 hours a day","0-5 yrs","0-14.9K",1.5,5,2,1,2,1]
["ID1354","2012-05-29T18:35:31","A$150000",150000,"AUD",152986.44846039536,95419.847328244272,{"$f":"OFFSET(F212,0,Brains!$D$1,1,1)","v":95419.847328244272},"Bus Analyst","Analyst","Australia","Australia","1 or 2","1 or 2 hours a day","0-5 yrs","75-99.9K",1.5,5.5,2,1,2,5]
["ID1366","2012-05-29T19:31:32","2.21Lac",2210000,"INR",39355.495879248076,110048.79992032665,{"$f":"OFFSET(F213,0,Brains!$D$1,1,1)","v":110048.79992032665},"Marketing","Analyst","India","India","1 or 2","1 or 2 hours a day","0-5 yrs","100-149.9K",1.5,5.6,2,1,2,6]
["ID1841","2012-06-14T04:22:36",40000,40000,"USD",40000,40000,{"$f":"OFFSET(F214,0,Brains!$D$1,1,1)","v":40000},"Rates Analyst","Analyst","USA","USA","2 to 3","2 to 3 hours per day","0-5 yrs","30-49.9K",2.5,0,3,1,2,3]
["ID1535","2012-05-31T10:54:48",1000,12000,"USD",12000,12000,{"$f":"OFFSET(F215,0,Brains!$D$1,1,1)","v":12000},"Associate Analyst","Analyst","MYS","MYS","2 to 3","2 to 3 hours per day","0-5 yrs","0-14.9K",2.5,0,3,1,2,1]
["ID1832","2012-06-13T17:22:47",15000,15000,"USD",15000,15000,{"$f":"OFFSET(F216,0,Brains!$D$1,1,1)","v":15000},"senior associate","Analyst","India","India","2 to 3","2 to 3 hours per day","0-5 yrs","15-29.9K",2.5,0.3,3,1,2,2]
["ID1616","2012-06-02T04:49:42",60000,60000,"USD",60000,60000,{"$f":"OFFSET(F217,0,Brains!$D$1,1,1)","v":60000},"Data Analyst","Analyst","USA","USA","2 to 3","2 to 3 hours per day","0-5 yrs","50-74.9K",2.5,1,3,1,2,4]
["ID1853","2012-06-15T03:00:04",30000,30000,"USD",30000,30000,{"$f":"OFFSET(F218,0,Brains!$D$1,1,1)","v":30000},"Trainee","Analyst","Brazil","Brazil","2 to 3","2 to 3 hours per day","0-5 yrs","30-49.9K",2.5,1,3,1,2,3]
["ID1183","2012-05-28T22:53:03",27840,27840,"USD",27840,27840,{"$f":"OFFSET(F219,0,Brains!$D$1,1,1)","v":27840},"Data Entry Clerk III","Analyst","USA","USA","2 to 3","2 to 3 hours per day","0-5 yrs","15-29.9K",2.5,1,3,1,2,2]
["ID0762","2012-05-26T17:06:48",2000,24000,"USD",24000,24000,{"$f":"OFFSET(F220,0,Brains!$D$1,1,1)","v":24000},"Asst Production Planner","Analyst","India","India","2 to 3","2 to 3 hours per day","0-5 yrs","15-29.9K",2.5,1,3,1,2,2]
["ID1680","2012-06-05T05:03:04",1000,12000,"USD",12000,12000,{"$f":"OFFSET(F221,0,Brains!$D$1,1,1)","v":12000},"Waiter","Analyst","USA","USA","2 to 3","2 to 3 hours per day","0-5 yrs","0-14.9K",2.5,1,3,1,2,1]
["ID1444","2012-05-30T10:40:24",75000,75000,"USD",75000,75000,{"$f":"OFFSET(F222,0,Brains!$D$1,1,1)","v":75000},"Business Analyst","Analyst","USA","USA","2 to 3","2 to 3 hours per day","0-5 yrs","75-99.9K",2.5,1.5,3,1,2,5]
["ID1733","2012-06-07T15:19:53",50000,50000,"GBP",78808.913603364199,74183.976261127595,{"$f":"OFFSET(F223,0,Brains!$D$1,1,1)","v":74183.976261127595},"Research Analyst","Analyst","UK","UK","2 to 3","2 to 3 hours per day","0-5 yrs","50-74.9K",2.5,2,3,1,2,4]
["ID1181","2012-05-28T22:51:27",31763,31763,"GBP",50064.150455673145,47126.112759643918,{"$f":"OFFSET(F224,0,Brains!$D$1,1,1)","v":47126.112759643918},"Network Administrator","Analyst","UK","UK","2 to 3","2 to 3 hours per day","0-5 yrs","30-49.9K",2.5,2,3,1,2,3]
["ID1458","2012-05-30T13:36:48",41000,41000,"USD",41000,41000,{"$f":"OFFSET(F225,0,Brains!$D$1,1,1)","v":41000},"Marketing Analyst","Analyst","Japan","Japan","2 to 3","2 to 3 hours per day","0-5 yrs","30-49.9K",2.5,2,3,1,2,3]
["ID1794","2012-06-11T21:03:36",40000,40000,"USD",40000,40000,{"$f":"OFFSET(F226,0,Brains!$D$1,1,1)","v":40000},"Intern","Analyst","USA","USA","2 to 3","2 to 3 hours per day","0-5 yrs","30-49.9K",2.5,2,3,1,2,3]
["ID0975","2012-05-28T07:23:07",20000,20000,"USD",20000,20000,{"$f":"OFFSET(F227,0,Brains!$D$1,1,1)","v":20000},"data analyst","Analyst","Australia","Australia","2 to 3","2 to 3 hours per day","0-5 yrs","15-29.9K",2.5,2,3,1,2,2]
["ID1823","2012-06-13T00:50:20",20000,20000,"USD",20000,20000,{"$f":"OFFSET(F228,0,Brains!$D$1,1,1)","v":20000},"administrator","Analyst","Canada","Canada","2 to 3","2 to 3 hours per day","0-5 yrs","15-29.9K",2.5,2,3,1,2,2]
["ID0967","2012-05-28T05:51:20",15000,15000,"USD",15000,15000,{"$f":"OFFSET(F229,0,Brains!$D$1,1,1)","v":15000},"Quality Executive","Analyst","India","India","2 to 3","2 to 3 hours per day","0-5 yrs","15-29.9K",2.5,2,3,1,2,2]
["ID1462","2012-05-30T13:56:48","320000 INR",320000,"INR",5698.5333399816218,15934.667861766757,{"$f":"OFFSET(F230,0,Brains!$D$1,1,1)","v":15934.667861766757},"Analyst","Analyst","India","India","2 to 3","2 to 3 hours per day","0-5 yrs","15-29.9K",2.5,2,3,1,2,2]
["ID0859","2012-05-27T03:37:32","3000 $",3000,"USD",3000,3000,{"$f":"OFFSET(F231,0,Brains!$D$1,1,1)","v":3000},"Statistical Analyst","Analyst","Pakistan","Pakistan","2 to 3","2 to 3 hours per day","0-5 yrs","0-14.9K",2.5,2,3,1,2,1]
["ID0986","2012-05-28T08:26:43",94000,94000,"AUD",95871.50770184776,59796.437659033079,{"$f":"OFFSET(F232,0,Brains!$D$1,1,1)","v":59796.437659033079},"Business Analyst","Analyst","Australia","Australia","2 to 3","2 to 3 hours per day","0-5 yrs","50-74.9K",2.5,2.5,3,1,2,4]
["ID1738","2012-06-07T20:10:41",60000,60000,"AUD",61194.579384158147,38167.938931297715,{"$f":"OFFSET(F233,0,Brains!$D$1,1,1)","v":38167.938931297715},"business analyst","Analyst","Australia","Australia","2 to 3","2 to 3 hours per day","0-5 yrs","30-49.9K",2.5,3,3,1,2,3]
["ID1849","2012-06-15T01:02:48",60000,60000,"USD",60000,60000,{"$f":"OFFSET(F234,0,Brains!$D$1,1,1)","v":60000},"Business Analyst","Analyst","USA","USA","2 to 3","2 to 3 hours per day","0-5 yrs","50-74.9K",2.5,3,3,1,2,4]
["ID1699","2012-06-05T22:50:20",40000,40000,"EUR",50815.977559664309,50247.973750458514,{"$f":"OFFSET(F235,0,Brains!$D$1,1,1)","v":50247.973750458514},"Financial Analyst","Analyst","Germany","Germany","2 to 3","2 to 3 hours per day","0-5 yrs","50-74.9K",2.5,3,3,1,2,4]
["ID1672","2012-06-04T23:41:47",49000,49000,"USD",49000,49000,{"$f":"OFFSET(F236,0,Brains!$D$1,1,1)","v":49000},"Marketing Data Analyst","Analyst","USA","USA","2 to 3","2 to 3 hours per day","0-5 yrs","30-49.9K",2.5,3,3,1,2,3]
["ID1353","2012-05-29T18:35:10","9 067",9067,"EUR",11518.711713336908,11389.959449885184,{"$f":"OFFSET(F237,0,Brains!$D$1,1,1)","v":11389.959449885184},"assistant","Analyst","Hungary","Hungary","2 to 3","2 to 3 hours per day","0-5 yrs","0-14.9K",2.5,3,3,1,2,1]
["ID0638","2012-05-26T11:37:53",600000,600000,"INR",10684.750012465542,29877.502240812668,{"$f":"OFFSET(F238,0,Brains!$D$1,1,1)","v":29877.502240812668},"Financial Analyst","Analyst","India","India","2 to 3","2 to 3 hours per day","0-5 yrs","15-29.9K",2.5,3,3,1,2,2]
["ID1801","2012-06-12T01:58:00",400000,400000,"INR",7123.1666749770275,19918.334827208444,{"$f":"OFFSET(F239,0,Brains!$D$1,1,1)","v":19918.334827208444},"business analyst","Analyst","India","India","2 to 3","2 to 3 hours per day","0-5 yrs","15-29.9K",2.5,3,3,1,2,2]
["ID1089","2012-05-28T15:49:22",240000,240000,"INR",4273.9000049862161,11951.000896325068,{"$f":"OFFSET(F240,0,Brains!$D$1,1,1)","v":11951.000896325068},"Executive","Analyst","India","India","2 to 3","2 to 3 hours per day","0-5 yrs","0-14.9K",2.5,3,3,1,2,1]
["ID0682","2012-05-26T13:05:03","220000 in INR",220000,"INR",3917.7416712373652,10955.084154964645,{"$f":"OFFSET(F241,0,Brains!$D$1,1,1)","v":10955.084154964645},"Accounts Payable Analyst","Analyst","India","India","2 to 3","2 to 3 hours per day","0-5 yrs","0-14.9K",2.5,3,3,1,2,1]
["ID1791","2012-06-11T17:54:22",200,2400,"USD",2400,2400,{"$f":"OFFSET(F242,0,Brains!$D$1,1,1)","v":2400},"computer operator","Analyst","India","India","2 to 3","2 to 3 hours per day","0-5 yrs","0-14.9K",2.5,3,3,1,2,1]
["ID0685","2012-05-26T13:12:48","1,20,000 INR",120000,"INR",2136.9500024931081,5975.5004481625338,{"$f":"OFFSET(F243,0,Brains!$D$1,1,1)","v":5975.5004481625338},"Data Analyst","Analyst","India","India","2 to 3","2 to 3 hours per day","0-5 yrs","0-14.9K",2.5,3,3,1,2,1]
["ID0730","2012-05-26T15:06:00",4.8,480000,"INR",8547.8000099724322,23902.001792650135,{"$f":"OFFSET(F244,0,Brains!$D$1,1,1)","v":23902.001792650135},"Asst Mngr","Analyst","India","India","2 to 3","2 to 3 hours per day","0-5 yrs","15-29.9K",2.5,3.5,3,1,2,2]
["ID0904","2012-05-27T15:26:34","180000 INR",180000,"INR",3205.4250037396623,8963.2506722437993,{"$f":"OFFSET(F245,0,Brains!$D$1,1,1)","v":8963.2506722437993},"Executive","Analyst","India","India","2 to 3","2 to 3 hours per day","0-5 yrs","0-14.9K",2.5,3.5,3,1,2,1]
["ID1029","2012-05-28T12:47:20",120000,120000,"INR",2136.9500024931081,5975.5004481625338,{"$f":"OFFSET(F246,0,Brains!$D$1,1,1)","v":5975.5004481625338},"Audit Assistant","Analyst","India","India","2 to 3","2 to 3 hours per day","0-5 yrs","0-14.9K",2.5,3.5,3,1,2,1]
["ID0595","2012-05-26T08:30:00","â‚¬ 50000",50000,"EUR",63519.971949580387,62809.967188073148,{"$f":"OFFSET(F247,0,Brains!$D$1,1,1)","v":62809.967188073148},"Analyst","Analyst","Germany","Germany","2 to 3","2 to 3 hours per day","0-5 yrs","50-74.9K",2.5,4,3,1,2,4]
["ID1144","2012-05-28T19:19:51",5000,60000,"USD",60000,60000,{"$f":"OFFSET(F248,0,Brains!$D$1,1,1)","v":60000},"Business Anaylyst","Analyst","USA","USA","2 to 3","2 to 3 hours per day","0-5 yrs","50-74.9K",2.5,4,3,1,2,4]
["ID1411","2012-05-29T23:31:03","36000 euros",36000,"EUR",45734.379803697877,45223.176375412666,{"$f":"OFFSET(F249,0,Brains!$D$1,1,1)","v":45223.176375412666},"Data Analytics Consultant","Analyst","Ireland","Ireland","2 to 3","2 to 3 hours per day","0-5 yrs","30-49.9K",2.5,4,3,1,2,3]
["ID1701","2012-06-06T00:49:15",45000,45000,"USD",45000,45000,{"$f":"OFFSET(F250,0,Brains!$D$1,1,1)","v":45000},"Bussiness Analyst","Analyst","USA","USA","2 to 3","2 to 3 hours per day","0-5 yrs","30-49.9K",2.5,4,3,1,2,3]
["ID1763","2012-06-08T21:02:48",30000,30000,"USD",30000,30000,{"$f":"OFFSET(F251,0,Brains!$D$1,1,1)","v":30000},"Customer Service","Analyst","USA","USA","2 to 3","2 to 3 hours per day","0-5 yrs","30-49.9K",2.5,4,3,1,2,3]
["ID1345","2012-05-29T17:45:59","16,00,000",1600000,"INR",28492.66669990811,79673.339308833776,{"$f":"OFFSET(F252,0,Brains!$D$1,1,1)","v":79673.339308833776},"Senior Associate ","Analyst","India","India","2 to 3","2 to 3 hours per day","0-5 yrs","75-99.9K",2.5,4,3,1,2,5]
["ID1862","2012-06-15T17:16:19","INR 700000",700000,"INR",12465.541681209797,34857.085947614782,{"$f":"OFFSET(F253,0,Brains!$D$1,1,1)","v":34857.085947614782},"Sr. System Analyst","Analyst","India","India","2 to 3","2 to 3 hours per day","0-5 yrs","30-49.9K",2.5,4,3,1,2,3]
["ID0949","2012-05-28T00:43:40","600000 INR",600000,"INR",10684.750012465542,29877.502240812668,{"$f":"OFFSET(F254,0,Brains!$D$1,1,1)","v":29877.502240812668},"Executive","Analyst","India","India","2 to 3","2 to 3 hours per day","0-5 yrs","15-29.9K",2.5,4,3,1,2,2]
["ID0872","2012-05-27T08:54:28",4500,4500,"USD",4500,4500,{"$f":"OFFSET(F255,0,Brains!$D$1,1,1)","v":4500},"senior associate","Analyst","indonesia","Indonesia","2 to 3","2 to 3 hours per day","0-5 yrs","0-14.9K",2.5,4,3,1,2,1]
["ID1902","2012-06-19T12:39:16",4000,4000,"USD",4000,4000,{"$f":"OFFSET(F256,0,Brains!$D$1,1,1)","v":4000},"operator","Analyst","India","India","2 to 3","2 to 3 hours per day","0-5 yrs","0-14.9K",2.5,4,3,1,2,1]
["ID1649","2012-06-03T17:39:14","Rs. 125000",125000,"INR",2225.989585930321,6224.4796335026394,{"$f":"OFFSET(F257,0,Brains!$D$1,1,1)","v":6224.4796335026394},"No","Analyst","India","India","2 to 3","2 to 3 hours per day","0-5 yrs","0-14.9K",2.5,4,3,1,2,1]
["ID1587","2012-06-01T10:55:27","AU $120000",120000,"AUD",122389.15876831629,76335.877862595429,{"$f":"OFFSET(F258,0,Brains!$D$1,1,1)","v":76335.877862595429},"Reporting Analyst","Analyst","Australia","Australia","2 to 3","2 to 3 hours per day","0-5 yrs",{"$f":"IF(H258<15000,\"0-14.9K\",IF(H258<30000,\"15-29.9K\",IF(H258<50000,\"30-49.9K\",IF(H258<75000,\"50-74.9K\",IF(H258<100000,\"75-99.9K\",IF(H258<150000,\"100-149.9K\",IF(H258<250000,\"150-249.9K\",\"250K+\")))))))","v":"75-99.9K"},2.5,5,3,1,2,{"$f":"IF(H258<15000,1,IF(H258<30000,2,IF(H258<50000,3,IF(H258<75000,4,IF(H258<100000,5,IF(H258<150000,6,IF(H258<250000,7,8)))))))","v":5}]
["ID1824","2012-06-13T01:56:23",70000,70000,"USD",70000,70000,{"$f":"OFFSET(F259,0,Brains!$D$1,1,1)","v":70000},"business analyst","Analyst","USA","USA","2 to 3","2 to 3 hours per day","0-5 yrs","50-74.9K",2.5,5,3,1,2,4]
["ID1614","2012-06-02T03:23:09",62000,62000,"USD",62000,62000,{"$f":"OFFSET(F260,0,Brains!$D$1,1,1)","v":62000},"Financial Analyst","Analyst","USA","USA","2 to 3","2 to 3 hours per day","0-5 yrs","50-74.9K",2.5,5,3,1,2,4]
["ID1470","2012-05-30T16:22:19","Â£17000",17000,"GBP",26795.030625143831,25222.551928783381,{"$f":"OFFSET(F261,0,Brains!$D$1,1,1)","v":25222.551928783381},"Verification Agent","Analyst","UK","UK","2 to 3","2 to 3 hours per day","0-5 yrs","15-29.9K",2.5,5,3,1,2,2]
["ID1140","2012-05-28T18:45:00",10000,10000,"USD",10000,10000,{"$f":"OFFSET(F262,0,Brains!$D$1,1,1)","v":10000},"Business analyst","Analyst","India","India","2 to 3","2 to 3 hours per day","0-5 yrs","0-14.9K",2.5,5,3,1,2,1]
["ID0603","2012-05-26T08:58:55","Rs. 20000",240000,"INR",4273.9000049862161,11951.000896325068,{"$f":"OFFSET(F263,0,Brains!$D$1,1,1)","v":11951.000896325068},"Talati","Analyst","India","India","2 to 3","2 to 3 hours per day","0-5 yrs","0-14.9K",2.5,5,3,1,2,1]
["ID0919","2012-05-27T18:33:51","300000RS",300000,"INR",5342.3750062327708,14938.751120406334,{"$f":"OFFSET(F264,0,Brains!$D$1,1,1)","v":14938.751120406334},"ANALYST","Analyst","India","India","4 to 6","4 to 6 hours a day","0-5 yrs","0-14.9K",5,0.5,4,1,2,1]
["ID1172","2012-05-28T22:41:15",500000,500000,"INR",8903.9583437212841,24897.918534010558,{"$f":"OFFSET(F265,0,Brains!$D$1,1,1)","v":24897.918534010558},"Business Analyst","Analyst","India","India","4 to 6","4 to 6 hours a day","0-5 yrs","15-29.9K",5,0.8,4,1,2,2]
["ID1374","2012-05-29T20:20:21","$100,000 US",100000,"USD",100000,100000,{"$f":"OFFSET(F266,0,Brains!$D$1,1,1)","v":100000},"Senior Financial Analyst","Analyst","USA","USA","4 to 6","4 to 6 hours a day","0-5 yrs","100-149.9K",5,1,4,1,2,6]
["ID1630","2012-06-02T22:33:32",55000,55000,"USD",55000,55000,{"$f":"OFFSET(F267,0,Brains!$D$1,1,1)","v":55000},"Supply Chain Analyst","Analyst","USA","USA","4 to 6","4 to 6 hours a day","0-5 yrs","50-74.9K",5,1,4,1,2,4]
["ID1911","2012-06-19T21:32:36",48000,48000,"USD",48000,48000,{"$f":"OFFSET(F268,0,Brains!$D$1,1,1)","v":48000},"Marketing Analyst Co-op","Analyst","USA","USA","4 to 6","4 to 6 hours a day","0-5 yrs","30-49.9K",5,1,4,1,2,3]
["ID0888","2012-05-27T13:34:12",43000,43000,"USD",43000,43000,{"$f":"OFFSET(F269,0,Brains!$D$1,1,1)","v":43000},"Financial Analyst","Analyst","USA","USA","4 to 6","4 to 6 hours a day","0-5 yrs","30-49.9K",5,1,4,1,2,3]
["ID1252","2012-05-29T05:53:42","Â£25750",25750,"GBP",40586.590505732565,38204.747774480711,{"$f":"OFFSET(F270,0,Brains!$D$1,1,1)","v":38204.747774480711},"Energy Analyst","Analyst","UK","UK","4 to 6","4 to 6 hours a day","0-5 yrs","30-49.9K",5,1,4,1,2,3]
["ID1083","2012-05-28T15:35:32",20000,20000,"GBP",31523.565441345683,29673.590504451036,{"$f":"OFFSET(F271,0,Brains!$D$1,1,1)","v":29673.590504451036},"finance assistant","Analyst","UK","UK","4 to 6","4 to 6 hours a day","0-5 yrs","15-29.9K",5,1,4,1,2,2]
["ID1257","2012-05-29T07:28:41",20000,20000,"GBP",31523.565441345683,29673.590504451036,{"$f":"OFFSET(F272,0,Brains!$D$1,1,1)","v":29673.590504451036},"Environmental Information Analyst","Analyst","UK","UK","4 to 6","4 to 6 hours a day","0-5 yrs","15-29.9K",5,1,4,1,2,2]
["ID0673","2012-05-26T12:54:36",15000,15000,"USD",15000,15000,{"$f":"OFFSET(F273,0,Brains!$D$1,1,1)","v":15000},"TA","Analyst","Indonesia","Indonesia","4 to 6","4 to 6 hours a day","0-5 yrs","15-29.9K",5,1,4,1,2,2]
["ID1510","2012-05-31T01:09:06","US$ 10000",10000,"USD",10000,10000,{"$f":"OFFSET(F274,0,Brains!$D$1,1,1)","v":10000},"Trainee","Analyst","Brazil","Brazil","4 to 6","4 to 6 hours a day","0-5 yrs","0-14.9K",5,1,4,1,2,1]
["ID0832","2012-05-26T23:14:58","5.5 lakhs",550000,"INR",9794.354178093412,27387.710387411611,{"$f":"OFFSET(F275,0,Brains!$D$1,1,1)","v":27387.710387411611},"web analyst","Analyst","India","India","4 to 6","4 to 6 hours a day","0-5 yrs","15-29.9K",5,1,4,1,2,2]
["ID0855","2012-05-27T03:16:05","Rs. 550000",550000,"INR",9794.354178093412,27387.710387411611,{"$f":"OFFSET(F276,0,Brains!$D$1,1,1)","v":27387.710387411611},"Analyst","Analyst","India","India","4 to 6","4 to 6 hours a day","0-5 yrs","15-29.9K",5,1,4,1,2,2]
["ID1328","2012-05-29T16:08:40",9000,9000,"USD",9000,9000,{"$f":"OFFSET(F277,0,Brains!$D$1,1,1)","v":9000},"Data Analyst","Analyst","India","India","4 to 6","4 to 6 hours a day","0-5 yrs","0-14.9K",5,1,4,1,2,1]
["ID1790","2012-06-11T17:01:58","Rs 480000",480000,"INR",8547.8000099724322,23902.001792650135,{"$f":"OFFSET(F278,0,Brains!$D$1,1,1)","v":23902.001792650135},"Development Analyst","Analyst","India","India","4 to 6","4 to 6 hours a day","0-5 yrs","15-29.9K",5,1,4,1,2,2]
["ID0728","2012-05-26T15:04:33","INR 390000 PA",390000,"INR",6945.0875081026015,19420.376456528233,{"$f":"OFFSET(F279,0,Brains!$D$1,1,1)","v":19420.376456528233},"Business Analyst","Analyst","India","India","4 to 6","4 to 6 hours a day","0-5 yrs","15-29.9K",5,1,4,1,2,2]
["ID1795","2012-06-11T21:29:29",300,3600,"USD",3600,3600,{"$f":"OFFSET(F280,0,Brains!$D$1,1,1)","v":3600},"Analyst","Analyst","India","India","4 to 6","4 to 6 hours a day","0-5 yrs","0-14.9K",5,1,4,1,2,1]
["ID0879","2012-05-27T12:03:51",144000,144000,"INR",2564.3400029917298,7170.6005377950405,{"$f":"OFFSET(F281,0,Brains!$D$1,1,1)","v":7170.6005377950405},"Cost Trainee","Analyst","India","India","4 to 6","4 to 6 hours a day","0-5 yrs","0-14.9K",5,1,4,1,2,1]
["ID1204","2012-05-29T00:00:21",61000,61000,"USD",61000,61000,{"$f":"OFFSET(F282,0,Brains!$D$1,1,1)","v":61000},"Financial Analyst","Analyst","USA","USA","4 to 6","4 to 6 hours a day","0-5 yrs","50-74.9K",5,1.5,4,1,2,4]
["ID1703","2012-06-06T01:26:56","38920EUR",38920,"EUR",49443.946165553374,48891.278459196139,{"$f":"OFFSET(F283,0,Brains!$D$1,1,1)","v":48891.278459196139},"functional analyst","Analyst","Belgium","Belgium","4 to 6","4 to 6 hours a day","0-5 yrs","30-49.9K",5,1.5,4,1,2,3]
["ID0972","2012-05-28T06:52:05",45616,45616,"USD",45616,45616,{"$f":"OFFSET(F284,0,Brains!$D$1,1,1)","v":45616},"Assistant Fleet Analyst","Analyst","Australia","Australia","4 to 6","4 to 6 hours a day","0-5 yrs","30-49.9K",5,1.5,4,1,2,3]
["ID1301","2012-05-29T13:40:09","3.5 lakhs p.a",350000,"INR",6232.7708406048987,17428.542973807391,{"$f":"OFFSET(F285,0,Brains!$D$1,1,1)","v":17428.542973807391},"I dont know","Analyst","India","India","4 to 6","4 to 6 hours a day","0-5 yrs","15-29.9K",5,1.5,4,1,2,2]
["ID1474","2012-05-30T17:01:10",230000,230000,"INR",4095.8208381117906,11453.042525644856,{"$f":"OFFSET(F286,0,Brains!$D$1,1,1)","v":11453.042525644856},"Process Assocaite","Analyst","India","India","4 to 6","4 to 6 hours a day","0-5 yrs","0-14.9K",5,1.6,4,1,2,1]
["ID0989","2012-05-28T08:41:13",120000,120000,"AUD",122389.15876831629,76335.877862595429,{"$f":"OFFSET(F287,0,Brains!$D$1,1,1)","v":76335.877862595429},"analyst","Analyst","Australia","Australia","4 to 6","4 to 6 hours a day","0-5 yrs","75-99.9K",5,2,4,1,2,5]
["ID1502","2012-05-30T22:32:21",66000,66000,"USD",66000,66000,{"$f":"OFFSET(F288,0,Brains!$D$1,1,1)","v":66000},"Director of Business Analytics","Analyst","USA","USA","4 to 6","4 to 6 hours a day","0-5 yrs","50-74.9K",5,2,4,1,2,4]
["ID1189","2012-05-28T23:05:03","216000 AED",216000,"AED",58799.349940520107,40816.326530612248,{"$f":"OFFSET(F289,0,Brains!$D$1,1,1)","v":40816.326530612248},"Financial analyst","Analyst","Dubai","Dubai","4 to 6","4 to 6 hours a day","0-5 yrs","30-49.9K",5,2,4,1,2,3]
["ID1426","2012-05-30T01:25:26",57678.400000000001,57678,"USD",57678,57678,{"$f":"OFFSET(F290,0,Brains!$D$1,1,1)","v":57678},"Financial Analyst","Analyst","USA","USA","4 to 6","4 to 6 hours a day","0-5 yrs","50-74.9K",5,2,4,1,2,4]
["ID1610","2012-06-02T02:24:39",55000,55000,"USD",55000,55000,{"$f":"OFFSET(F291,0,Brains!$D$1,1,1)","v":55000},"Business Analyst","Analyst","USA","USA","4 to 6","4 to 6 hours a day","0-5 yrs","50-74.9K",5,2,4,1,2,4]
["ID0567","2012-05-26T06:40:59",45000,45000,"USD",45000,45000,{"$f":"OFFSET(F292,0,Brains!$D$1,1,1)","v":45000},"Workflow Analyst","Analyst","USA","USA","4 to 6","4 to 6 hours a day","0-5 yrs","30-49.9K",5,2,4,1,2,3]
["ID1729","2012-06-07T06:22:17","Â£27000",27000,"GBP",42556.81334581667,40059.347181008903,{"$f":"OFFSET(F293,0,Brains!$D$1,1,1)","v":40059.347181008903},"Network Designer","Analyst","UK","UK","4 to 6","4 to 6 hours a day","0-5 yrs","30-49.9K",5,2,4,1,2,3]
["ID1618","2012-06-02T06:31:21","42000 US",42000,"USD",42000,42000,{"$f":"OFFSET(F294,0,Brains!$D$1,1,1)","v":42000},"production clerk","Analyst","USA","USA","4 to 6","4 to 6 hours a day","0-5 yrs","30-49.9K",5,2,4,1,2,3]
["ID1232","2012-05-29T02:12:32","Â£26000",26000,"GBP",40980.635073749385,38575.667655786347,{"$f":"OFFSET(F295,0,Brains!$D$1,1,1)","v":38575.667655786347},"Business Analyst","Analyst","UK","UK","4 to 6","4 to 6 hours a day","0-5 yrs","30-49.9K",5,2,4,1,2,3]
["ID1340","2012-05-29T17:17:13","Â£26000",26000,"GBP",40980.635073749385,38575.667655786347,{"$f":"OFFSET(F296,0,Brains!$D$1,1,1)","v":38575.667655786347},"Web Analyst","Analyst","UK","UK","4 to 6","4 to 6 hours a day","0-5 yrs","30-49.9K",5,2,4,1,2,3]
["ID0865","2012-05-27T04:31:08","R134000",134000,"ZAR",16337.518501630093,23624.823695345556,{"$f":"OFFSET(F297,0,Brains!$D$1,1,1)","v":23624.823695345556},"Data Analyst","Analyst","South Africa","South Africa","4 to 6","4 to 6 hours a day","0-5 yrs","15-29.9K",5,2,4,1,2,2]
["ID0805","2012-05-26T21:27:01",850000,850000,"INR",15136.729184326183,42326.461507817949,{"$f":"OFFSET(F298,0,Brains!$D$1,1,1)","v":42326.461507817949},"Senior Research Analyst","Analyst","India","India","4 to 6","4 to 6 hours a day","0-5 yrs","30-49.9K",5,2,4,1,2,3]
["ID0912","2012-05-27T16:30:54",775000,775000,"INR",13801.135432767991,38591.773727716361,{"$f":"OFFSET(F299,0,Brains!$D$1,1,1)","v":38591.773727716361},"Analyst","Analyst","India","India","4 to 6","4 to 6 hours a day","0-5 yrs","30-49.9K",5,2,4,1,2,3]
["ID1793","2012-06-11T19:56:36",11000,11000,"USD",11000,11000,{"$f":"OFFSET(F300,0,Brains!$D$1,1,1)","v":11000},"Web Analyst","Analyst","India","India","4 to 6","4 to 6 hours a day","0-5 yrs","0-14.9K",5,2,4,1,2,1]
["ID1711","2012-06-06T07:28:48",10000,10000,"USD",10000,10000,{"$f":"OFFSET(F301,0,Brains!$D$1,1,1)","v":10000},"Student assistant","Analyst","USA","USA","4 to 6","4 to 6 hours a day","0-5 yrs","0-14.9K",5,2,4,1,2,1]
["ID0727","2012-05-26T15:02:34",800,9600,"USD",9600,9600,{"$f":"OFFSET(F302,0,Brains!$D$1,1,1)","v":9600},"Admin","Analyst","South Africa","South Africa","4 to 6","4 to 6 hours a day","0-5 yrs","0-14.9K",5,2,4,1,2,1]
["ID1727","2012-06-07T00:32:24","500000vINR",500000,"INR",8903.9583437212841,24897.918534010558,{"$f":"OFFSET(F303,0,Brains!$D$1,1,1)","v":24897.918534010558},"Business Analyst","Analyst","India","India","4 to 6","4 to 6 hours a day","0-5 yrs","15-29.9K",5,2,4,1,2,2]
["ID1163","2012-05-28T22:13:24",8600,8600,"USD",8600,8600,{"$f":"OFFSET(F304,0,Brains!$D$1,1,1)","v":8600},"Catlog associates","Analyst","India","India","4 to 6","4 to 6 hours a day","0-5 yrs","0-14.9K",5,2,4,1,2,1]
["ID1909","2012-06-19T21:01:21",420000,420000,"INR",7479.3250087258784,20914.251568568867,{"$f":"OFFSET(F305,0,Brains!$D$1,1,1)","v":20914.251568568867},"Analyst","Analyst","India","India","4 to 6","4 to 6 hours a day","0-5 yrs","15-29.9K",5,2,4,1,2,2]
["ID1601","2012-06-01T20:12:22","500 USD",6000,"USD",6000,6000,{"$f":"OFFSET(F306,0,Brains!$D$1,1,1)","v":6000},"Business Analyst","Analyst","India","India","4 to 6","4 to 6 hours a day","0-5 yrs","0-14.9K",5,2,4,1,2,1]
["ID0742","2012-05-26T15:56:57","4800 $",4800,"USD",4800,4800,{"$f":"OFFSET(F307,0,Brains!$D$1,1,1)","v":4800},"Data Analysis","Analyst","Bhutan","Bhutan","4 to 6","4 to 6 hours a day","0-5 yrs","0-14.9K",5,2,4,1,2,1]
["ID0684","2012-05-26T13:11:01","Rs. 260000",260000,"INR",4630.058338735068,12946.917637685488,{"$f":"OFFSET(F308,0,Brains!$D$1,1,1)","v":12946.917637685488},"Analyst","Analyst","India","India","4 to 6","4 to 6 hours a day","0-5 yrs","0-14.9K",5,2,4,1,2,1]
["ID0848","2012-05-27T01:22:06","INR 2,00,000",200000,"INR",3561.5833374885137,9959.167413604222,{"$f":"OFFSET(F309,0,Brains!$D$1,1,1)","v":9959.167413604222},"Sales Analyst","Analyst","India","India","4 to 6","4 to 6 hours a day","0-5 yrs","0-14.9K",5,2,4,1,2,1]
["ID0794","2012-05-26T20:31:30","ONE LACK FIFTY THOUSAND(INR)",150000,"INR",2671.1875031163854,7469.375560203167,{"$f":"OFFSET(F310,0,Brains!$D$1,1,1)","v":7469.375560203167},"WORKING WITH PRODUCT TEAM OF MAKEMYTRIP.COM","Analyst","India","India","4 to 6","4 to 6 hours a day","0-5 yrs","0-14.9K",5,2,4,1,2,1]
["ID1742","2012-06-08T00:01:49",68000,68000,"USD",68000,68000,{"$f":"OFFSET(F311,0,Brains!$D$1,1,1)","v":68000},"Tax Associate","Analyst","USA","USA","4 to 6","4 to 6 hours a day","0-5 yrs","50-74.9K",5,2.5,4,1,2,4]
["ID1013","2012-05-28T11:33:07","350000 Rs",350000,"INR",6232.7708406048987,17428.542973807391,{"$f":"OFFSET(F312,0,Brains!$D$1,1,1)","v":17428.542973807391},"Data Analyst","Analyst","India","India","4 to 6","4 to 6 hours a day","0-5 yrs","15-29.9K",5,2.5,4,1,2,2]
["ID1663","2012-06-04T18:55:54","INR 3.2 lpa",320000,"INR",5698.5333399816218,15934.667861766757,{"$f":"OFFSET(F313,0,Brains!$D$1,1,1)","v":15934.667861766757},"Research Associate","Analyst","India","India","4 to 6","4 to 6 hours a day","0-5 yrs","15-29.9K",5,2.5,4,1,2,2]
["ID1511","2012-05-31T01:17:16",74300,74300,"USD",74300,74300,{"$f":"OFFSET(F314,0,Brains!$D$1,1,1)","v":74300},"Senior Business Research Analyst","Analyst","USA","USA","4 to 6","4 to 6 hours a day","0-5 yrs","50-74.9K",5,3,4,1,2,4]
["ID0587","2012-05-26T07:53:13",70000,70000,"USD",70000,70000,{"$f":"OFFSET(F315,0,Brains!$D$1,1,1)","v":70000},"Financial Analyst","Analyst","USA","USA","4 to 6","4 to 6 hours a day","0-5 yrs","50-74.9K",5,3,4,1,2,4]
["ID0591","2012-05-26T08:05:39",65000,65000,"USD",65000,65000,{"$f":"OFFSET(F316,0,Brains!$D$1,1,1)","v":65000},"Data Analyst","Analyst","USA","USA","4 to 6","4 to 6 hours a day","0-5 yrs","50-74.9K",5,3,4,1,2,4]
["ID0980","2012-05-28T07:39:22",62000,62000,"AUD",63234.398696963413,39440.203562340968,{"$f":"OFFSET(F317,0,Brains!$D$1,1,1)","v":39440.203562340968},"Business Analyst","Analyst","Australia","Australia","4 to 6","4 to 6 hours a day","0-5 yrs","30-49.9K",5,3,4,1,2,3]
["ID1552","2012-05-31T20:14:20","Â£35000",35000,"GBP",55166.239522354947,51928.783382789312,{"$f":"OFFSET(F318,0,Brains!$D$1,1,1)","v":51928.783382789312},"Research Analyst","Analyst","UK","UK","4 to 6","4 to 6 hours a day","0-5 yrs","50-74.9K",5,3,4,1,2,4]
["ID1096","2012-05-28T16:05:43","40000 euro",40000,"EUR",50815.977559664309,50247.973750458514,{"$f":"OFFSET(F319,0,Brains!$D$1,1,1)","v":50247.973750458514},"Accounting analyst","Analyst","Netherlands","Netherlands","4 to 6","4 to 6 hours a day","0-5 yrs","50-74.9K",5,3,4,1,2,4]
["ID1282","2012-05-29T10:51:31",50000,50000,"USD",50000,50000,{"$f":"OFFSET(F320,0,Brains!$D$1,1,1)","v":50000},"Data Analyst","Analyst","USA","USA","4 to 6","4 to 6 hours a day","0-5 yrs","50-74.9K",5,3,4,1,2,4]
["ID1531","2012-05-31T09:45:09",50000,50000,"CAD",49168.076151516347,40032.025620496395,{"$f":"OFFSET(F321,0,Brains!$D$1,1,1)","v":40032.025620496395},"Business Analyst","Analyst","Canada","Canada","4 to 6","4 to 6 hours a day","0-5 yrs","30-49.9K",5,3,4,1,2,3]
["ID0582","2012-05-26T07:36:23",45000,45000,"USD",45000,45000,{"$f":"OFFSET(F322,0,Brains!$D$1,1,1)","v":45000},"business analyst","Analyst","USA","USA","4 to 6","4 to 6 hours a day","0-5 yrs",{"$f":"IF(H322<15000,\"0-14.9K\",IF(H322<30000,\"15-29.9K\",IF(H322<50000,\"30-49.9K\",IF(H322<75000,\"50-74.9K\",IF(H322<100000,\"75-99.9K\",IF(H322<150000,\"100-149.9K\",IF(H322<250000,\"150-249.9K\",\"250K+\")))))))","v":"30-49.9K"},5,3,4,1,2,{"$f":"IF(H322<15000,1,IF(H322<30000,2,IF(H322<50000,3,IF(H322<75000,4,IF(H322<100000,5,IF(H322<150000,6,IF(H322<250000,7,8)))))))","v":3}]
["ID1118","2012-05-28T17:09:40","Â£25000",25000,"GBP",39404.456801682099,37091.988130563797,{"$f":"OFFSET(F323,0,Brains!$D$1,1,1)","v":37091.988130563797},"Developer","Analyst","UK","UK","4 to 6","4 to 6 hours a day","0-5 yrs","30-49.9K",5,3,4,1,2,3]
["ID1905","2012-06-19T18:17:42",25000,25000,"GBP",39404.456801682099,37091.988130563797,{"$f":"OFFSET(F324,0,Brains!$D$1,1,1)","v":37091.988130563797},"Data Analyst","Analyst","UK","UK","4 to 6","4 to 6 hours a day","0-5 yrs","30-49.9K",5,3,4,1,2,3]
["ID0931","2012-05-27T22:05:15",24000,24000,"USD",24000,24000,{"$f":"OFFSET(F325,0,Brains!$D$1,1,1)","v":24000},"business analyst","Analyst","India","India","4 to 6","4 to 6 hours a day","0-5 yrs","15-29.9K",5,3,4,1,2,2]
["ID1579","2012-06-01T05:52:11",17728.57,17728,"USD",17728,17728,{"$f":"OFFSET(F326,0,Brains!$D$1,1,1)","v":17728},"Financial analyst","Analyst","Mexico","Mexico","4 to 6","4 to 6 hours a day","0-5 yrs","15-29.9K",5,3,4,1,2,2]
["ID1478","2012-05-30T17:18:38","INR 60000",720000,"INR",12821.700014958649,35853.002688975197,{"$f":"OFFSET(F327,0,Brains!$D$1,1,1)","v":35853.002688975197},"DEO","Analyst","India","India","4 to 6","4 to 6 hours a day","0-5 yrs","30-49.9K",5,3,4,1,2,3]
["ID0613","2012-05-26T10:22:45","INR 420000",420000,"INR",7479.3250087258784,20914.251568568867,{"$f":"OFFSET(F328,0,Brains!$D$1,1,1)","v":20914.251568568867},"Assistant EDP","Analyst","India","India","4 to 6","4 to 6 hours a day","0-5 yrs","15-29.9K",5,3,4,1,2,2]
["ID1018","2012-05-28T12:00:14",3.65,365000,"INR",6499.8895909165376,18175.480529827706,{"$f":"OFFSET(F329,0,Brains!$D$1,1,1)","v":18175.480529827706},"associate analyst","Analyst","India","India","4 to 6","4 to 6 hours a day","0-5 yrs","15-29.9K",5,3,4,1,2,2]
["ID1924","2012-06-20T12:53:56",180000,180000,"INR",3205.4250037396623,8963.2506722437993,{"$f":"OFFSET(F330,0,Brains!$D$1,1,1)","v":8963.2506722437993},"Customer Resolution","Analyst","India","India","4 to 6","4 to 6 hours a day","0-5 yrs","0-14.9K",5,3,4,1,2,1]
["ID1589","2012-06-01T13:03:18",44000,44000,"USD",44000,44000,{"$f":"OFFSET(F331,0,Brains!$D$1,1,1)","v":44000},"Quality Assurance Analyst","Analyst","USA","USA","4 to 6","4 to 6 hours a day","0-5 yrs","30-49.9K",5,3.5,4,1,2,3]
["ID0955","2012-05-28T02:25:13",75000,75000,"EUR",95279.957924370581,94214.950782109721,{"$f":"OFFSET(F332,0,Brains!$D$1,1,1)","v":94214.950782109721},"Risk analyst","Analyst","Netherlands","Netherlands","4 to 6","4 to 6 hours a day","0-5 yrs","75-99.9K",5,4,4,1,2,5]
["ID1164","2012-05-28T22:25:04","Â£51,000/$81,600",81600,"USD",81600,81600,{"$f":"OFFSET(F333,0,Brains!$D$1,1,1)","v":81600},"Business Analyst - Central Finance","Analyst","UK","UK","4 to 6","4 to 6 hours a day","0-5 yrs","75-99.9K",5,4,4,1,2,5]
["ID0979","2012-05-28T07:33:29",65000,65000,"AUD",66294.12766617132,41348.600508905853,{"$f":"OFFSET(F334,0,Brains!$D$1,1,1)","v":41348.600508905853},"Data Analyst","Analyst","Australia","Australia","4 to 6","4 to 6 hours a day","0-5 yrs","30-49.9K",5,4,4,1,2,3]
["ID1910","2012-06-19T21:06:16",62000,62000,"USD",62000,62000,{"$f":"OFFSET(F335,0,Brains!$D$1,1,1)","v":62000},"Analyst","Analyst","USA","USA","4 to 6","4 to 6 hours a day","0-5 yrs","50-74.9K",5,4,4,1,2,4]
["ID0990","2012-05-28T08:47:39","AU$52.000",52000,"AUD",53035.30213293706,33078.880407124685,{"$f":"OFFSET(F336,0,Brains!$D$1,1,1)","v":33078.880407124685},"Shipping Administrator","Analyst","Australia","Australia","4 to 6","4 to 6 hours a day","0-5 yrs","30-49.9K",5,4,4,1,2,3]
["ID1056","2012-05-28T14:21:27",50000,50000,"AUD",50995.482820131787,31806.615776081428,{"$f":"OFFSET(F337,0,Brains!$D$1,1,1)","v":31806.615776081428},"BA","Analyst","Australia","Australia","4 to 6","4 to 6 hours a day","0-5 yrs","30-49.9K",5,4,4,1,2,3]
["ID0882","2012-05-27T12:37:02",40000,40000,"EUR",50815.977559664309,50247.973750458514,{"$f":"OFFSET(F338,0,Brains!$D$1,1,1)","v":50247.973750458514},"Medical information analist","Analyst","Netherlands","Netherlands","4 to 6","4 to 6 hours a day","0-5 yrs","50-74.9K",5,4,4,1,2,4]
["ID1175","2012-05-28T22:44:48","Â£32000",32000,"GBP",50437.70470615309,47477.744807121657,{"$f":"OFFSET(F339,0,Brains!$D$1,1,1)","v":47477.744807121657},"Service Analyst","Analyst","UK","UK","4 to 6","4 to 6 hours a day","0-5 yrs","30-49.9K",5,4,4,1,2,3]
["ID1097","2012-05-28T16:07:51","Â£30000",30000,"GBP",47285.348162018527,44510.385756676558,{"$f":"OFFSET(F340,0,Brains!$D$1,1,1)","v":44510.385756676558},"Information Analyst","Analyst","UK","UK","4 to 6","4 to 6 hours a day","0-5 yrs","30-49.9K",5,4,4,1,2,3]
["ID1808","2012-06-12T08:46:15",45000,45000,"USD",45000,45000,{"$f":"OFFSET(F341,0,Brains!$D$1,1,1)","v":45000},"ba","Analyst","USA","USA","4 to 6","4 to 6 hours a day","0-5 yrs","30-49.9K",5,4,4,1,2,3]
["ID1741","2012-06-07T23:48:29",36000,36000,"USD",36000,36000,{"$f":"OFFSET(F342,0,Brains!$D$1,1,1)","v":36000},"clerk","Analyst","USA","USA","4 to 6","4 to 6 hours a day","0-5 yrs","30-49.9K",5,4,4,1,2,3]
["ID1750","2012-06-08T08:15:54",31200,31200,"USD",31200,31200,{"$f":"OFFSET(F343,0,Brains!$D$1,1,1)","v":31200},"Risk analyst","Analyst","Brazil","Brazil","4 to 6","4 to 6 hours a day","0-5 yrs","30-49.9K",5,4,4,1,2,3]
["ID0929","2012-05-27T21:44:39","15000 â‚¬",15000,"EUR",19055.991584874118,18842.990156421944,{"$f":"OFFSET(F344,0,Brains!$D$1,1,1)","v":18842.990156421944},"analytic","Analyst","Slovenia","Slovenia","4 to 6","4 to 6 hours a day","0-5 yrs","15-29.9K",5,4,4,1,2,2]
["ID1451","2012-05-30T12:35:08","Rs. 900000 per annum",900000,"INR",16027.125018698311,44816.253361219002,{"$f":"OFFSET(F345,0,Brains!$D$1,1,1)","v":44816.253361219002},"Data Analyst","Analyst","India","India","4 to 6","4 to 6 hours a day","0-5 yrs","30-49.9K",5,4,4,1,2,3]
["ID1716","2012-06-06T16:03:39",500000,500000,"INR",8903.9583437212841,24897.918534010558,{"$f":"OFFSET(F346,0,Brains!$D$1,1,1)","v":24897.918534010558},"Sr. Associate","Analyst","India","India","4 to 6","4 to 6 hours a day","0-5 yrs","15-29.9K",5,4,4,1,2,2]
["ID0709","2012-05-26T14:10:51","4,80,000 Ruppes",480000,"INR",8547.8000099724322,23902.001792650135,{"$f":"OFFSET(F347,0,Brains!$D$1,1,1)","v":23902.001792650135},"Business Analyst","Analyst","India","India","4 to 6","4 to 6 hours a day","0-5 yrs","15-29.9K",5,4,4,1,2,2]
["ID1734","2012-06-07T16:45:01",421000,421000,"INR",7497.1329254133216,20964.047405636888,{"$f":"OFFSET(F348,0,Brains!$D$1,1,1)","v":20964.047405636888},"PMO Analyst","Analyst","India","India","4 to 6","4 to 6 hours a day","0-5 yrs","15-29.9K",5,4,4,1,2,2]
["ID1702","2012-06-06T01:04:35","4 lacs INR",400000,"INR",7123.1666749770275,19918.334827208444,{"$f":"OFFSET(F349,0,Brains!$D$1,1,1)","v":19918.334827208444},"Analyst","Analyst","India","India","4 to 6","4 to 6 hours a day","0-5 yrs","15-29.9K",5,4,4,1,2,2]
["ID1745","2012-06-08T02:28:45","Rs. 21500",258000,"INR",4594.4425053601826,12847.325963549447,{"$f":"OFFSET(F350,0,Brains!$D$1,1,1)","v":12847.325963549447},"Senior Data Associate","Analyst","India","India","4 to 6","4 to 6 hours a day","0-5 yrs","0-14.9K",5,4,4,1,2,1]
["ID1346","2012-05-29T17:48:04",49500,49500,"USD",49500,49500,{"$f":"OFFSET(F351,0,Brains!$D$1,1,1)","v":49500},"Financial Analyst II","Analyst","USA","USA","4 to 6","4 to 6 hours a day","0-5 yrs","30-49.9K",5,4.5,4,1,2,3]
["ID0675","2012-05-26T12:59:13",10200,10200,"USD",10200,10200,{"$f":"OFFSET(F352,0,Brains!$D$1,1,1)","v":10200},"business analyst","Analyst","India","India","4 to 6","4 to 6 hours a day","0-5 yrs","0-14.9K",5,4.5,4,1,2,1]
["ID0664","2012-05-26T12:33:48","Rs 300000",300000,"INR",5342.3750062327708,14938.751120406334,{"$f":"OFFSET(F353,0,Brains!$D$1,1,1)","v":14938.751120406334},"Mis Analyst","Analyst","India","India","4 to 6","4 to 6 hours a day","0-5 yrs","0-14.9K",5,4.5,4,1,2,1]
["ID0608","2012-05-26T09:51:47",160000,160000,"USD",160000,160000,{"$f":"OFFSET(F354,0,Brains!$D$1,1,1)","v":160000},"Director, Analytics","Analyst","USA","USA","4 to 6","4 to 6 hours a day","0-5 yrs","150-249.9K",5,5,4,1,2,7]
["ID0995","2012-05-28T09:26:10",120000,120000,"AUD",122389.15876831629,76335.877862595429,{"$f":"OFFSET(F355,0,Brains!$D$1,1,1)","v":76335.877862595429},"HSLP Data Analyst","Analyst","Australia","Australia","4 to 6","4 to 6 hours a day","0-5 yrs","75-99.9K",5,5,4,1,2,5]
["ID1445","2012-05-30T10:57:38",8500,102000,"USD",102000,102000,{"$f":"OFFSET(F356,0,Brains!$D$1,1,1)","v":102000},"Sales Analyst","Analyst","USA","USA","4 to 6","4 to 6 hours a day","0-5 yrs","100-149.9K",5,5,4,1,2,6]
["ID1634","2012-06-03T02:06:44","Â£60000",60000,"GBP",94570.696324037053,89020.771513353116,{"$f":"OFFSET(F357,0,Brains!$D$1,1,1)","v":89020.771513353116},"Data Analyst","Analyst","UK","UK","4 to 6","4 to 6 hours a day","0-5 yrs","75-99.9K",5,5,4,1,2,5]
["ID1263","2012-05-29T08:41:02",90000,90000,"AUD",91791.869076237213,57251.908396946565,{"$f":"OFFSET(F358,0,Brains!$D$1,1,1)","v":57251.908396946565},"Business Analyst","Analyst","Australia","Australia","4 to 6","4 to 6 hours a day","0-5 yrs","50-74.9K",5,5,4,1,2,4]
["ID1248","2012-05-29T05:08:57","85000 USD",85000,"USD",85000,85000,{"$f":"OFFSET(F359,0,Brains!$D$1,1,1)","v":85000},"Senior Executive Compensation Analyst ","Analyst","USA","USA","4 to 6","4 to 6 hours a day","0-5 yrs","75-99.9K",5,5,4,1,2,5]
["ID0597","2012-05-26T08:45:34",75000,75000,"USD",75000,75000,{"$f":"OFFSET(F360,0,Brains!$D$1,1,1)","v":75000},"Financial Analyst","Analyst","USA","USA","4 to 6","4 to 6 hours a day","0-5 yrs","75-99.9K",5,5,4,1,2,5]
["ID1561","2012-05-31T23:08:12",71500,71500,"USD",71500,71500,{"$f":"OFFSET(F361,0,Brains!$D$1,1,1)","v":71500},"Management Reporting Analyst","Analyst","USA","USA","4 to 6","4 to 6 hours a day","0-5 yrs","50-74.9K",5,5,4,1,2,4]
["ID1737","2012-06-07T17:13:42",40000,40000,"GBP",63047.130882691366,59347.181008902073,{"$f":"OFFSET(F362,0,Brains!$D$1,1,1)","v":59347.181008902073},"Analyst","Analyst","UK","UK","4 to 6","4 to 6 hours a day","0-5 yrs","50-74.9K",5,5,4,1,2,4]
["ID1501","2012-05-30T22:31:35","61K",61000,"USD",61000,61000,{"$f":"OFFSET(F363,0,Brains!$D$1,1,1)","v":61000},"Financial Analyst","Analyst","USA","USA","4 to 6","4 to 6 hours a day","0-5 yrs","50-74.9K",5,5,4,1,2,4]
["ID1844","2012-06-14T14:08:58",5000,60000,"USD",60000,60000,{"$f":"OFFSET(F364,0,Brains!$D$1,1,1)","v":60000},"Analyst","Analyst","UAE","UAE","4 to 6","4 to 6 hours a day","0-5 yrs","50-74.9K",5,5,4,1,2,4]
["ID1644","2012-06-03T13:30:47",50000,50000,"CAD",49168.076151516347,40032.025620496395,{"$f":"OFFSET(F365,0,Brains!$D$1,1,1)","v":40032.025620496395},"Application Developer","Analyst","Canada","Canada","4 to 6","4 to 6 hours a day","0-5 yrs","30-49.9K",5,5,4,1,2,3]
["ID0860","2012-05-27T03:37:36",43600,43600,"USD",43600,43600,{"$f":"OFFSET(F366,0,Brains!$D$1,1,1)","v":43600},"Data Analyst","Analyst","USA","USA","4 to 6","4 to 6 hours a day","0-5 yrs","30-49.9K",5,5,4,1,2,3]
["ID1898","2012-06-19T03:25:34",43000,43000,"USD",43000,43000,{"$f":"OFFSET(F367,0,Brains!$D$1,1,1)","v":43000},"Performance Improvement Analyst","Analyst","USA","USA","4 to 6","4 to 6 hours a day","0-5 yrs","30-49.9K",5,5,4,1,2,3]
["ID0961","2012-05-28T05:07:44",40000,40000,"USD",40000,40000,{"$f":"OFFSET(F368,0,Brains!$D$1,1,1)","v":40000},"analyst","Analyst","NZ","New Zealand","4 to 6","4 to 6 hours a day","0-5 yrs","30-49.9K",5,5,4,1,2,3]
["ID1767","2012-06-09T00:49:07",40000,40000,"USD",40000,40000,{"$f":"OFFSET(F369,0,Brains!$D$1,1,1)","v":40000},"Market Research Analyst","Analyst","USA","USA","4 to 6","4 to 6 hours a day","0-5 yrs","30-49.9K",5,5,4,1,2,3]
["ID1689","2012-06-05T19:16:03",21000,21000,"EUR",26678.388218823762,26380.186218990722,{"$f":"OFFSET(F370,0,Brains!$D$1,1,1)","v":26380.186218990722},"Sales Planning","Analyst","Portugal","Portugal","4 to 6","4 to 6 hours a day","0-5 yrs","15-29.9K",5,5,4,1,2,2]
["ID1574","2012-06-01T03:07:31","INR 850000",850000,"INR",15136.729184326183,42326.461507817949,{"$f":"OFFSET(F371,0,Brains!$D$1,1,1)","v":42326.461507817949},"Sr Business analyst","Analyst","India","India","4 to 6","4 to 6 hours a day","0-5 yrs","30-49.9K",5,5,4,1,2,3]
["ID1623","2012-06-02T13:58:46",15000,15000,"USD",15000,15000,{"$f":"OFFSET(F372,0,Brains!$D$1,1,1)","v":15000},"Business Analysis & MIS ","Analyst","India","India","4 to 6","4 to 6 hours a day","0-5 yrs","15-29.9K",5,5,4,1,2,2]
["ID1646","2012-06-03T14:34:56",15000,15000,"USD",15000,15000,{"$f":"OFFSET(F373,0,Brains!$D$1,1,1)","v":15000},"Marketing services","Analyst","Pakistan","Pakistan","4 to 6","4 to 6 hours a day","0-5 yrs","15-29.9K",5,5,4,1,2,2]
["ID1907","2012-06-19T20:16:30",750000,750000,"INR",13355.937515581925,37346.877801015835,{"$f":"OFFSET(F374,0,Brains!$D$1,1,1)","v":37346.877801015835},"Analyst","Analyst","India","India","4 to 6","4 to 6 hours a day","0-5 yrs","30-49.9K",5,5,4,1,2,3]
["ID1049","2012-05-28T13:54:57","Rs. 700000",700000,"INR",12465.541681209797,34857.085947614782,{"$f":"OFFSET(F375,0,Brains!$D$1,1,1)","v":34857.085947614782},"Credit Analyst","Analyst","India","India","4 to 6","4 to 6 hours a day","0-5 yrs","30-49.9K",5,5,4,1,2,3]
["ID1597","2012-06-01T19:42:46",650000,650000,"INR",11575.14584683767,32367.294094213721,{"$f":"OFFSET(F376,0,Brains!$D$1,1,1)","v":32367.294094213721},"Associate","Analyst","India","India","4 to 6","4 to 6 hours a day","0-5 yrs","30-49.9K",5,5,4,1,2,3]
["ID1024","2012-05-28T12:26:01","Rs.5.7 lacs",570000,"INR",10150.512511842264,28383.627128772034,{"$f":"OFFSET(F377,0,Brains!$D$1,1,1)","v":28383.627128772034},"MIS & Analysis","Analyst","India","India","4 to 6","4 to 6 hours a day","0-5 yrs","15-29.9K",5,5,4,1,2,2]
["ID1114","2012-05-28T16:59:48","INR 300000",300000,"INR",5342.3750062327708,14938.751120406334,{"$f":"OFFSET(F378,0,Brains!$D$1,1,1)","v":14938.751120406334},"Analyst","Analyst","India","India","4 to 6","4 to 6 hours a day","0-5 yrs","0-14.9K",5,5,4,1,2,1]
["ID1212","2012-05-29T00:25:46",800,4800,"USD",4800,4800,{"$f":"OFFSET(F379,0,Brains!$D$1,1,1)","v":4800},"Financial Analyst","Analyst","India","India","4 to 6","4 to 6 hours a day","0-5 yrs","0-14.9K",5,5,4,1,2,1]
["ID1447","2012-05-30T11:38:53",363,4356,"USD",4356,4356,{"$f":"OFFSET(F380,0,Brains!$D$1,1,1)","v":4356},"Business Analyst","Analyst","India","India","4 to 6","4 to 6 hours a day","0-5 yrs","0-14.9K",5,5,4,1,2,1]
["ID1683","2012-06-05T07:05:12","Rs 16000",192000,"INR",3419.1200039889732,9560.800717060054,{"$f":"OFFSET(F381,0,Brains!$D$1,1,1)","v":9560.800717060054},"Sr Associate","Analyst","India","India","4 to 6","4 to 6 hours a day","0-5 yrs","0-14.9K",5,5,4,1,2,1]
["ID1436","2012-05-30T02:35:40","Rs 3.25 Lacs",3250000,"INR",57875.729234188344,161836.47047106861,{"$f":"OFFSET(F382,0,Brains!$D$1,1,1)","v":161836.47047106861},"ISO TS Documentation","Analyst","India","India","4 to 6","4 to 6 hours a day","0-5 yrs","150-249.9K",5,5.5,4,1,2,7]
["ID1875","2012-06-16T08:10:59","63000 USD",63000,"USD",63000,63000,{"$f":"OFFSET(F383,0,Brains!$D$1,1,1)","v":63000},"Financial Analyst","Analyst","USA","USA","All 8","All the 8 hours baby, all the 8!","0-5 yrs","50-74.9K",8,1,5,1,2,4]
["ID1705","2012-06-06T02:11:58","US$60000",60000,"USD",60000,60000,{"$f":"OFFSET(F384,0,Brains!$D$1,1,1)","v":60000},"Analyst","Analyst","USA","USA","All 8","All the 8 hours baby, all the 8!","0-5 yrs","50-74.9K",8,1,5,1,2,4]
["ID1408","2012-05-29T23:13:32",55000,55000,"USD",55000,55000,{"$f":"OFFSET(F385,0,Brains!$D$1,1,1)","v":55000},"Risk Analyst","Analyst","USA","USA","All 8","All the 8 hours baby, all the 8!","0-5 yrs","50-74.9K",8,1,5,1,2,4]
["ID1891","2012-06-18T06:14:35",46000,46000,"USD",46000,46000,{"$f":"OFFSET(F386,0,Brains!$D$1,1,1)","v":46000},"AML Analyst","Analyst","USA","USA","All 8","All the 8 hours baby, all the 8!","0-5 yrs",{"$f":"IF(H386<15000,\"0-14.9K\",IF(H386<30000,\"15-29.9K\",IF(H386<50000,\"30-49.9K\",IF(H386<75000,\"50-74.9K\",IF(H386<100000,\"75-99.9K\",IF(H386<150000,\"100-149.9K\",IF(H386<250000,\"150-249.9K\",\"250K+\")))))))","v":"30-49.9K"},8,1,5,1,2,{"$f":"IF(H386<15000,1,IF(H386<30000,2,IF(H386<50000,3,IF(H386<75000,4,IF(H386<100000,5,IF(H386<150000,6,IF(H386<250000,7,8)))))))","v":3}]
["ID1611","2012-06-02T02:28:30",38000,38000,"USD",38000,38000,{"$f":"OFFSET(F387,0,Brains!$D$1,1,1)","v":38000},"Business Analyst","Analyst","USA","USA","All 8","All the 8 hours baby, all the 8!","0-5 yrs","30-49.9K",8,1,5,1,2,3]
["ID0564","2012-05-26T06:14:13",27500,27500,"USD",27500,27500,{"$f":"OFFSET(F388,0,Brains!$D$1,1,1)","v":27500},"Associate","Analyst","USA","USA","All 8","All the 8 hours baby, all the 8!","0-5 yrs","15-29.9K",8,1,5,1,2,2]
["ID1520","2012-05-31T04:12:19",75000,75000,"USD",75000,75000,{"$f":"OFFSET(F389,0,Brains!$D$1,1,1)","v":75000},"Financial Analyst","Analyst","USA","USA","All 8","All the 8 hours baby, all the 8!","0-5 yrs","75-99.9K",8,1.5,5,1,2,5]
["ID1603","2012-06-01T20:37:53",50000,50000,"USD",50000,50000,{"$f":"OFFSET(F390,0,Brains!$D$1,1,1)","v":50000},"Sales Operations Analyst","Analyst","USA","USA","All 8","All the 8 hours baby, all the 8!","0-5 yrs","50-74.9K",8,2,5,1,2,4]
["ID1740","2012-06-07T23:33:23",45000,45000,"USD",45000,45000,{"$f":"OFFSET(F391,0,Brains!$D$1,1,1)","v":45000},"Sourcing Analyst","Analyst","USA","USA","All 8","All the 8 hours baby, all the 8!","0-5 yrs","30-49.9K",8,2,5,1,2,3]
["ID1480","2012-05-30T18:16:05",42000,42000,"USD",42000,42000,{"$f":"OFFSET(F392,0,Brains!$D$1,1,1)","v":42000},"Service Solution Rep","Analyst","USA","USA","All 8","All the 8 hours baby, all the 8!","0-5 yrs","30-49.9K",8,2,5,1,2,3]
["ID0867","2012-05-27T06:17:41",40000,40000,"USD",40000,40000,{"$f":"OFFSET(F393,0,Brains!$D$1,1,1)","v":40000},"IT Capacity Planner","Analyst","USA","USA","All 8","All the 8 hours baby, all the 8!","0-5 yrs","30-49.9K",8,2,5,1,2,3]
["ID1809","2012-06-12T12:15:46",85000,85000,"USD",85000,85000,{"$f":"OFFSET(F394,0,Brains!$D$1,1,1)","v":85000},"Lead Financial Analyst","Analyst","USA","USA","All 8","All the 8 hours baby, all the 8!","0-5 yrs","75-99.9K",8,3,5,1,2,5]
["ID0631","2012-05-26T11:17:56",39000,39000,"USD",39000,39000,{"$f":"OFFSET(F395,0,Brains!$D$1,1,1)","v":39000},"Content Analyst ","Analyst","USA","USA","All 8","All the 8 hours baby, all the 8!","0-5 yrs","30-49.9K",8,3,5,1,2,3]
["ID1920","2012-06-20T03:52:40",50000,50000,"USD",50000,50000,{"$f":"OFFSET(F396,0,Brains!$D$1,1,1)","v":50000},"Operations Analyst ","Analyst","USA","USA","All 8","All the 8 hours baby, all the 8!","0-5 yrs","50-74.9K",8,3.5,5,1,2,4]
["ID1706","2012-06-06T02:17:14",65000,65000,"USD",65000,65000,{"$f":"OFFSET(F397,0,Brains!$D$1,1,1)","v":65000},"Actuarial Analyst","Analyst","USA","USA","All 8","All the 8 hours baby, all the 8!","0-5 yrs","50-74.9K",8,4,5,1,2,4]
["ID0768","2012-05-26T17:24:41",41000,41000,"USD",41000,41000,{"$f":"OFFSET(F398,0,Brains!$D$1,1,1)","v":41000},"Business Analyst","Analyst","USA","USA","All 8","All the 8 hours baby, all the 8!","0-5 yrs","30-49.9K",8,4,5,1,2,3]
["ID0858","2012-05-27T03:25:53",40000,40000,"USD",40000,40000,{"$f":"OFFSET(F399,0,Brains!$D$1,1,1)","v":40000},"Data Research Assistant","Analyst","USA","USA","All 8","All the 8 hours baby, all the 8!","0-5 yrs","30-49.9K",8,4,5,1,2,3]
["ID1743","2012-06-08T00:21:23",75000,75000,"USD",75000,75000,{"$f":"OFFSET(F400,0,Brains!$D$1,1,1)","v":75000},"Senior Financial Analyst","Analyst","USA","USA","All 8","All the 8 hours baby, all the 8!","0-5 yrs","75-99.9K",8,5,5,1,2,5]
["ID1593","2012-06-01T15:39:20","U$52,000/annual",52000,"USD",52000,52000,{"$f":"OFFSET(F401,0,Brains!$D$1,1,1)","v":52000},"Planner","Analyst","USA","USA","All 8","All the 8 hours baby, all the 8!","0-5 yrs","50-74.9K",8,5,5,1,2,4]
["ID1931","2012-06-21T04:44:20",46359,46359,"USD",46359,46359,{"$f":"OFFSET(F402,0,Brains!$D$1,1,1)","v":46359},"Data Analyst","Analyst","USA","USA","All 8","All the 8 hours baby, all the 8!","0-5 yrs","30-49.9K",8,5,5,1,2,3]
["ID1521","2012-05-31T05:02:59",45000,45000,"USD",45000,45000,{"$f":"OFFSET(F403,0,Brains!$D$1,1,1)","v":45000},"Excel Business Analyst","Analyst","USA","USA","All 8","All the 8 hours baby, all the 8!","0-5 yrs","30-49.9K",8,5,5,1,2,3]
["ID1916","2012-06-20T01:20:49",250000,250000,"INR",4451.9791718606421,12448.959267005279,{"$f":"OFFSET(F404,0,Brains!$D$1,1,1)","v":12448.959267005279},"research associate","Analyst","India","India","Excel??","Excel ?!? What Excel?","0-5 yrs","0-14.9K",0,1.6,1,1,2,1]
["ID1238","2012-05-29T03:28:37","â‚¬35,000 / â‚¬44,000",35000,"EUR",44463.980364706273,43966.9770316512,{"$f":"OFFSET(F405,0,Brains!$D$1,1,1)","v":43966.9770316512},"Business Analyst","Analyst","Ireland","Ireland","All 8","All the 8 hours baby, all the 8!","11-20 yrs","30-49.9K",8,12,5,3,2,3]
["ID1042","2012-05-28T13:37:10",600000,600000,"INR",10684.750012465542,29877.502240812668,{"$f":"OFFSET(F406,0,Brains!$D$1,1,1)","v":29877.502240812668},"Business Analyst","Analyst","India","India","All 8","All the 8 hours baby, all the 8!","11-20 yrs","15-29.9K",8,12,5,3,2,2]
["ID1485","2012-05-30T19:27:35","60000 Euros",60000,"EUR",76223.966339496474,75371.960625687774,{"$f":"OFFSET(F407,0,Brains!$D$1,1,1)","v":75371.960625687774},"Sales Analyst","Analyst","Italy","Italy","All 8","All the 8 hours baby, all the 8!","11-20 yrs","75-99.9K",8,14,5,3,2,5]
["ID1079","2012-05-28T15:29:53","Â£30000",30000,"GBP",47285.348162018527,44510.385756676558,{"$f":"OFFSET(F408,0,Brains!$D$1,1,1)","v":44510.385756676558},"Data Analyst","Analyst","UK","UK","All 8","All the 8 hours baby, all the 8!","11-20 yrs","30-49.9K",8,15,5,3,2,3]
["ID1557","2012-05-31T21:48:35",1200,14400,"USD",14400,14400,{"$f":"OFFSET(F409,0,Brains!$D$1,1,1)","v":14400},"FA /financial Analyst","Analyst","Bulgaria","Bulgaria","All 8","All the 8 hours baby, all the 8!","11-20 yrs","0-14.9K",8,15,5,3,2,1]
["ID1331","2012-05-29T16:31:06",75000,75000,"EUR",95279.957924370581,94214.950782109721,{"$f":"OFFSET(F410,0,Brains!$D$1,1,1)","v":94214.950782109721},"Financial Analyst","Analyst","Netherlands","Netherlands","All 8","All the 8 hours baby, all the 8!","11-20 yrs","75-99.9K",8,16,5,3,2,5]
["ID1498","2012-05-30T21:45:06",74000,74000,"AUD",75473.31457379504,47073.791348600513,{"$f":"OFFSET(F411,0,Brains!$D$1,1,1)","v":47073.791348600513},"operations Administrator","Analyst","Australia","Australia","All 8","All the 8 hours baby, all the 8!","11-20 yrs","30-49.9K",8,20,5,3,2,3]
["ID1761","2012-06-08T20:47:58",45000,45000,"GBP",70928.022243027779,66765.578635014841,{"$f":"OFFSET(F412,0,Brains!$D$1,1,1)","v":66765.578635014841},"bUSINESS aNALYST","Analyst","UK","UK","All 8","All the 8 hours baby, all the 8!","11-20 yrs","50-74.9K",8,20,5,3,2,4]
["ID1671","2012-06-04T23:38:47","30000 â‚¬",30000,"EUR",38111.983169748237,37685.980312843887,{"$f":"OFFSET(F413,0,Brains!$D$1,1,1)","v":37685.980312843887},"Safety technician","Analyst","Spain","Spain","1 or 2","1 or 2 hours a day","11-20 yrs","30-49.9K",1.5,12,2,3,2,3]
["ID1781","2012-06-10T15:59:17",30000,30000,"USD",30000,30000,{"$f":"OFFSET(F414,0,Brains!$D$1,1,1)","v":30000},"Teacher","Analyst","Malaysia","Malaysia","1 or 2","1 or 2 hours a day","11-20 yrs","30-49.9K",1.5,12,2,3,2,3]
["ID1792","2012-06-11T19:40:47","3000 $",3000,"USD",3000,3000,{"$f":"OFFSET(F415,0,Brains!$D$1,1,1)","v":3000},"executive","Analyst","Bangladesh","Bangladesh","1 or 2","1 or 2 hours a day","11-20 yrs","0-14.9K",1.5,12,2,3,2,1]
["ID1352","2012-05-29T18:33:08",80000,80000,"USD",80000,80000,{"$f":"OFFSET(F416,0,Brains!$D$1,1,1)","v":80000},"Developer","Analyst","USA","USA","1 or 2","1 or 2 hours a day","11-20 yrs","75-99.9K",1.5,14,2,3,2,5]
["ID1256","2012-05-29T07:21:41",50700,50700,"USD",50700,50700,{"$f":"OFFSET(F417,0,Brains!$D$1,1,1)","v":50700},"Sr. Systems Analyst","Analyst","Brazil","Brazil","1 or 2","1 or 2 hours a day","11-20 yrs","50-74.9K",1.5,15,2,3,2,4]
["ID1143","2012-05-28T19:09:37",30000,30000,"EUR",38111.983169748237,37685.980312843887,{"$f":"OFFSET(F418,0,Brains!$D$1,1,1)","v":37685.980312843887},"Translator","Analyst","Belgium","Belgium","1 or 2","1 or 2 hours a day","11-20 yrs","30-49.9K",1.5,15,2,3,2,3]
["ID1687","2012-06-05T18:31:59","200000 INR",200000,"INR",3561.5833374885137,9959.167413604222,{"$f":"OFFSET(F419,0,Brains!$D$1,1,1)","v":9959.167413604222},"Executive","Analyst","India","India","1 or 2","1 or 2 hours a day","11-20 yrs","0-14.9K",1.5,16,2,3,2,1]
["ID0963","2012-05-28T05:12:38",150000,150000,"USD",150000,150000,{"$f":"OFFSET(F420,0,Brains!$D$1,1,1)","v":150000},"Software Tester","Analyst","Switzerland","Switzerland","1 or 2","1 or 2 hours a day","11-20 yrs","150-249.9K",1.5,20,2,3,2,7]
["ID0769","2012-05-26T17:31:56","95000 AUD",95000,"AUD",96891.417358250401,60432.56997455471,{"$f":"OFFSET(F421,0,Brains!$D$1,1,1)","v":60432.56997455471},"Data Analyst - Report Writer","Analyst","Australia","Australia","2 to 3","2 to 3 hours per day","11-20 yrs","50-74.9K",2.5,11,3,3,2,4]
["ID0568","2012-05-26T06:46:03","95000 USD",95000,"USD",95000,95000,{"$f":"OFFSET(F422,0,Brains!$D$1,1,1)","v":95000},"Business Analyst","Analyst","Australia","Australia","2 to 3","2 to 3 hours per day","11-20 yrs","75-99.9K",2.5,11,3,3,2,5]
["ID1440","2012-05-30T08:05:16","AUD55,000",55000,"AUD",56095.031102144967,34987.277353689569,{"$f":"OFFSET(F423,0,Brains!$D$1,1,1)","v":34987.277353689569},"PA","Analyst","Australia","Australia","2 to 3","2 to 3 hours per day","11-20 yrs","30-49.9K",2.5,11,3,3,2,3]
["ID0732","2012-05-26T15:09:27","Ind Rs.10,00,000.00",1000000,"INR",17807.916687442568,49795.837068021116,{"$f":"OFFSET(F424,0,Brains!$D$1,1,1)","v":49795.837068021116},"Sr Associate","Analyst","India","India","2 to 3","2 to 3 hours per day","11-20 yrs","30-49.9K",2.5,12,3,3,2,3]
["ID1219","2012-05-29T00:47:17",95856,95856,"USD",95856,95856,{"$f":"OFFSET(F425,0,Brains!$D$1,1,1)","v":95856},"Analyst","Analyst","USA","USA","2 to 3","2 to 3 hours per day","11-20 yrs","75-99.9K",2.5,13,3,3,2,5]
["ID0815","2012-05-26T22:22:58",95000,95000,"USD",95000,95000,{"$f":"OFFSET(F426,0,Brains!$D$1,1,1)","v":95000},"Business Analyst","Analyst","USA","USA","2 to 3","2 to 3 hours per day","11-20 yrs","75-99.9K",2.5,13,3,3,2,5]
["ID1103","2012-05-28T16:21:27",79000,79000,"GBP",124518.08349331544,117210.6824925816,{"$f":"OFFSET(F427,0,Brains!$D$1,1,1)","v":117210.6824925816},"Market Analyst","Analyst","UK","UK","2 to 3","2 to 3 hours per day","11-20 yrs","100-149.9K",2.5,14,3,3,2,6]
["ID1008","2012-05-28T10:41:38",94000,94000,"AUD",95871.50770184776,59796.437659033079,{"$f":"OFFSET(F428,0,Brains!$D$1,1,1)","v":59796.437659033079},"Principal Analyst","Analyst","Australia","Australia","2 to 3","2 to 3 hours per day","11-20 yrs","50-74.9K",2.5,14,3,3,2,4]
["ID1822","2012-06-13T00:37:24","â‚¬ 45000",45000,"EUR",57167.974754622352,56528.970469265834,{"$f":"OFFSET(F429,0,Brains!$D$1,1,1)","v":56528.970469265834},"IT Trainer","Analyst","Netherlands","Netherlands","2 to 3","2 to 3 hours per day","11-20 yrs","50-74.9K",2.5,14,3,3,2,4]
["ID0854","2012-05-27T03:06:02",92500,92500,"USD",92500,92500,{"$f":"OFFSET(F430,0,Brains!$D$1,1,1)","v":92500},"Dir of Analytics","Analyst","USA","USA","2 to 3","2 to 3 hours per day","11-20 yrs","75-99.9K",2.5,15,3,3,2,5]
["ID1298","2012-05-29T13:16:59","30000 EUR",30000,"EUR",38111.983169748237,37685.980312843887,{"$f":"OFFSET(F431,0,Brains!$D$1,1,1)","v":37685.980312843887},"Employee","Analyst","Belgium","Belgium","2 to 3","2 to 3 hours per day","11-20 yrs","30-49.9K",2.5,15,3,3,2,3]
["ID1062","2012-05-28T14:34:37","Â£28000",28000,"GBP",44132.991617883956,41543.026706231452,{"$f":"OFFSET(F432,0,Brains!$D$1,1,1)","v":41543.026706231452},"Modeller","Analyst","UK","UK","2 to 3","2 to 3 hours per day","11-20 yrs","30-49.9K",2.5,16,3,3,2,3]
["ID0605","2012-05-26T09:28:50",65000,65000,"USD",65000,65000,{"$f":"OFFSET(F433,0,Brains!$D$1,1,1)","v":65000},"Helicopter Mechanic","Analyst","USA","USA","2 to 3","2 to 3 hours per day","11-20 yrs","50-74.9K",2.5,17,3,3,2,4]
["ID0606","2012-05-26T09:36:28",70000,70000,"USD",70000,70000,{"$f":"OFFSET(F434,0,Brains!$D$1,1,1)","v":70000},"Program/Mgt Analyst","Analyst","USA","USA","2 to 3","2 to 3 hours per day","11-20 yrs","50-74.9K",2.5,18,3,3,2,4]
["ID0634","2012-05-26T11:31:08",125000,125000,"USD",125000,125000,{"$f":"OFFSET(F435,0,Brains!$D$1,1,1)","v":125000},"Analyst","Analyst","USA","USA","2 to 3","2 to 3 hours per day","11-20 yrs","100-149.9K",2.5,20,3,3,2,6]
["ID0965","2012-05-28T05:48:56",95000,95000,"AUD",96891.417358250401,60432.56997455471,{"$f":"OFFSET(F436,0,Brains!$D$1,1,1)","v":60432.56997455471},"financial analyst","Analyst","Australia","Australia","2 to 3","2 to 3 hours per day","11-20 yrs","50-74.9K",2.5,20,3,3,2,4]
["ID1159","2012-05-28T21:17:04",69000,69000,"USD",69000,69000,{"$f":"OFFSET(F437,0,Brains!$D$1,1,1)","v":69000},"Financial Analysist","Analyst","USA","USA","2 to 3","2 to 3 hours per day","11-20 yrs","50-74.9K",2.5,20,3,3,2,4]
["ID0790","2012-05-26T20:16:28","CA$66000",66000,"CAD",64901.860520001574,52842.273819055241,{"$f":"OFFSET(F438,0,Brains!$D$1,1,1)","v":52842.273819055241},"Programmer-analyst","Analyst","Canada","Canada","2 to 3","2 to 3 hours per day","11-20 yrs","50-74.9K",2.5,20,3,3,2,4]
["ID0764","2012-05-26T17:08:09",62000,62000,"USD",62000,62000,{"$f":"OFFSET(F439,0,Brains!$D$1,1,1)","v":62000},"System Analyst ","Analyst","USA","USA","2 to 3","2 to 3 hours per day","11-20 yrs","50-74.9K",2.5,20,3,3,2,4]
["ID0760","2012-05-26T17:03:26","INR 20000",240000,"INR",4273.9000049862161,11951.000896325068,{"$f":"OFFSET(F440,0,Brains!$D$1,1,1)","v":11951.000896325068},"EXECUTIVE","Analyst","India","India","2 to 3","2 to 3 hours per day","11-20 yrs","0-14.9K",2.5,20,3,3,2,1]
["ID1100","2012-05-28T16:19:21",37000,37000,"EUR",47004.779242689488,46479.375719174132,{"$f":"OFFSET(F441,0,Brains!$D$1,1,1)","v":46479.375719174132},"Project Control Analyst","Analyst","Spain","Spain","4 to 6","4 to 6 hours a day","11-20 yrs","30-49.9K",5,11,4,3,2,3]
["ID0920","2012-05-27T19:39:26",104000,104000,"AED",28310.79811950968,19652.305366591081,{"$f":"OFFSET(F442,0,Brains!$D$1,1,1)","v":19652.305366591081},"Financial Analyst","Analyst","UAE","UAE","4 to 6","4 to 6 hours a day","11-20 yrs","15-29.9K",5,11,4,3,2,2]
["ID0948","2012-05-28T00:36:20","INR 600K",600000,"INR",10684.750012465542,29877.502240812668,{"$f":"OFFSET(F443,0,Brains!$D$1,1,1)","v":29877.502240812668},"Asst. Mgr. Finance","Analyst","India","India","4 to 6","4 to 6 hours a day","11-20 yrs","15-29.9K",5,11,4,3,2,2]
["ID1469","2012-05-30T16:12:34","Rs. 200000",200000,"INR",3561.5833374885137,9959.167413604222,{"$f":"OFFSET(F444,0,Brains!$D$1,1,1)","v":9959.167413604222},"Executive","Analyst","India","India","4 to 6","4 to 6 hours a day","11-20 yrs","0-14.9K",5,11,4,3,2,1]
["ID1694","2012-06-05T21:33:47",85000,85000,"USD",85000,85000,{"$f":"OFFSET(F445,0,Brains!$D$1,1,1)","v":85000},"Financial Analyst","Analyst","USA","USA","4 to 6","4 to 6 hours a day","11-20 yrs","75-99.9K",5,12,4,3,2,5]
["ID1383","2012-05-29T21:33:42","$83000 USD ",83000,"USD",83000,83000,{"$f":"OFFSET(F446,0,Brains!$D$1,1,1)","v":83000},"Senior Planning Analyst","Analyst","Canada","Canada","4 to 6","4 to 6 hours a day","11-20 yrs","75-99.9K",5,12,4,3,2,5]
["ID1188","2012-05-28T23:02:08",75000,75000,"USD",75000,75000,{"$f":"OFFSET(F447,0,Brains!$D$1,1,1)","v":75000},"Financial Analyst","Analyst","USA","USA","4 to 6","4 to 6 hours a day","11-20 yrs","75-99.9K",5,12,4,3,2,5]
["ID1619","2012-06-02T06:43:25",68000,68000,"USD",68000,68000,{"$f":"OFFSET(F448,0,Brains!$D$1,1,1)","v":68000},"Supply Chain Analyst","Analyst","USA","USA","4 to 6","4 to 6 hours a day","11-20 yrs","50-74.9K",5,12,4,3,2,4]
["ID1429","2012-05-30T01:52:33",61000,61000,"USD",61000,61000,{"$f":"OFFSET(F449,0,Brains!$D$1,1,1)","v":61000},"Treasury Analyst","Analyst","USA","USA","4 to 6","4 to 6 hours a day","11-20 yrs","50-74.9K",5,12,4,3,2,4]
["ID0632","2012-05-26T11:26:46",60000,60000,"USD",60000,60000,{"$f":"OFFSET(F450,0,Brains!$D$1,1,1)","v":60000},"business analyst","Analyst","USA","USA","4 to 6","4 to 6 hours a day","11-20 yrs",{"$f":"IF(H450<15000,\"0-14.9K\",IF(H450<30000,\"15-29.9K\",IF(H450<50000,\"30-49.9K\",IF(H450<75000,\"50-74.9K\",IF(H450<100000,\"75-99.9K\",IF(H450<150000,\"100-149.9K\",IF(H450<250000,\"150-249.9K\",\"250K+\")))))))","v":"50-74.9K"},5,12,4,3,2,{"$f":"IF(H450<15000,1,IF(H450<30000,2,IF(H450<50000,3,IF(H450<75000,4,IF(H450<100000,5,IF(H450<150000,6,IF(H450<250000,7,8)))))))","v":4}]
["ID1900","2012-06-19T06:50:47",48000,48000,"USD",48000,48000,{"$f":"OFFSET(F451,0,Brains!$D$1,1,1)","v":48000},"Inventory Analyst","Analyst","USA","USA","4 to 6","4 to 6 hours a day","11-20 yrs","30-49.9K",5,12,4,3,2,3]
["ID0662","2012-05-26T12:30:22",1400,16800,"USD",16800,16800,{"$f":"OFFSET(F452,0,Brains!$D$1,1,1)","v":16800},"Assistant","Analyst","Pakistan","Pakistan","4 to 6","4 to 6 hours a day","11-20 yrs","15-29.9K",5,12,4,3,2,2]
["ID1292","2012-05-29T12:29:12","us $ 14000",14000,"USD",14000,14000,{"$f":"OFFSET(F453,0,Brains!$D$1,1,1)","v":14000},"Pricing Analyst","Analyst","India","India","4 to 6","4 to 6 hours a day","11-20 yrs","0-14.9K",5,12,4,3,2,1]
["ID0715","2012-05-26T14:22:05",1000,12000,"USD",12000,12000,{"$f":"OFFSET(F454,0,Brains!$D$1,1,1)","v":12000},"tech operator (oil)","Analyst","uae","UAE","4 to 6","4 to 6 hours a day","11-20 yrs","0-14.9K",5,12,4,3,2,1]
["ID0745","2012-05-26T16:05:02",10000,10000,"USD",10000,10000,{"$f":"OFFSET(F455,0,Brains!$D$1,1,1)","v":10000},"Reporting Analyst","Analyst","India","India","4 to 6","4 to 6 hours a day","11-20 yrs","0-14.9K",5,12,4,3,2,1]
["ID0966","2012-05-28T05:51:10","AUD90000",90000,"AUD",91791.869076237213,57251.908396946565,{"$f":"OFFSET(F456,0,Brains!$D$1,1,1)","v":57251.908396946565},"Senior Research Analyst","Analyst","Australia","Australia","4 to 6","4 to 6 hours a day","11-20 yrs","50-74.9K",5,13,4,3,2,4]
["ID1414","2012-05-30T00:02:08",64500,64500,"USD",64500,64500,{"$f":"OFFSET(F457,0,Brains!$D$1,1,1)","v":64500},"Lead Budget/Financial Analyst","Analyst","USA","USA","4 to 6","4 to 6 hours a day","11-20 yrs","50-74.9K",5,13,4,3,2,4]
["ID1493","2012-05-30T20:47:55","50000 US$",50000,"USD",50000,50000,{"$f":"OFFSET(F458,0,Brains!$D$1,1,1)","v":50000},"Sr. Financial Analyst","Analyst","Kuwait","Kuwait","4 to 6","4 to 6 hours a day","11-20 yrs","50-74.9K",5,13,4,3,2,4]
["ID1802","2012-06-12T02:43:17","$65,000 US",65000,"USD",65000,65000,{"$f":"OFFSET(F459,0,Brains!$D$1,1,1)","v":65000},"Sr Financial Systems Analyst","Analyst","USA","USA","4 to 6","4 to 6 hours a day","11-20 yrs","50-74.9K",5,14,4,3,2,4]
["ID1168","2012-05-28T22:36:47",59000,59000,"USD",59000,59000,{"$f":"OFFSET(F460,0,Brains!$D$1,1,1)","v":59000},"Management Analyst","Analyst","USA","USA","4 to 6","4 to 6 hours a day","11-20 yrs","50-74.9K",5,14,4,3,2,4]
["ID1141","2012-05-28T18:50:35",29000,29000,"GBP",45709.169889951241,43026.706231454002,{"$f":"OFFSET(F461,0,Brains!$D$1,1,1)","v":43026.706231454002},"Financial Analyst","Analyst","UK","UK","4 to 6","4 to 6 hours a day","11-20 yrs","30-49.9K",5,14,4,3,2,3]
["ID1718","2012-06-06T18:52:03",700,8400,"USD",8400,8400,{"$f":"OFFSET(F462,0,Brains!$D$1,1,1)","v":8400},"gov employee","Analyst","indonesia","Indonesia","4 to 6","4 to 6 hours a day","11-20 yrs","0-14.9K",5,14,4,3,2,1]
["ID1514","2012-05-31T01:50:26",95000,95000,"USD",95000,95000,{"$f":"OFFSET(F463,0,Brains!$D$1,1,1)","v":95000},"Sr Financial Analyst","Analyst","USA","USA","4 to 6","4 to 6 hours a day","11-20 yrs","75-99.9K",5,15,4,3,2,5]
["ID1236","2012-05-29T02:43:44","62.000 euro",62000,"EUR",78764.765217479682,77884.359313210705,{"$f":"OFFSET(F464,0,Brains!$D$1,1,1)","v":77884.359313210705},"Stafmember","Analyst","Netherlands","Netherlands","4 to 6","4 to 6 hours a day","11-20 yrs","75-99.9K",5,15,4,3,2,5]
["ID1410","2012-05-29T23:21:25",60000,60000,"USD",60000,60000,{"$f":"OFFSET(F465,0,Brains!$D$1,1,1)","v":60000},"business analyst","Analyst","USA","USA","4 to 6","4 to 6 hours a day","11-20 yrs","50-74.9K",5,15,4,3,2,4]
["ID1839","2012-06-14T01:55:13",60000,60000,"USD",60000,60000,{"$f":"OFFSET(F466,0,Brains!$D$1,1,1)","v":60000},"Business Analyst","Analyst","USA","USA","4 to 6","4 to 6 hours a day","11-20 yrs","50-74.9K",5,15,4,3,2,4]
["ID1674","2012-06-05T02:03:48",55000,55000,"USD",55000,55000,{"$f":"OFFSET(F467,0,Brains!$D$1,1,1)","v":55000},"Customer Sales Analyst","Analyst","USA","USA","4 to 6","4 to 6 hours a day","11-20 yrs","50-74.9K",5,15,4,3,2,4]
["ID0600","2012-05-26T08:55:12",45000,45000,"USD",45000,45000,{"$f":"OFFSET(F468,0,Brains!$D$1,1,1)","v":45000},"Technical Analyst","Analyst","USA","USA","4 to 6","4 to 6 hours a day","11-20 yrs","30-49.9K",5,15,4,3,2,3]
["ID1351","2012-05-29T18:21:13",34500,34500,"EUR",43828.780645210471,43338.877359770471,{"$f":"OFFSET(F469,0,Brains!$D$1,1,1)","v":43338.877359770471},"Analyst","Analyst","Netherlands","Netherlands","4 to 6","4 to 6 hours a day","11-20 yrs","30-49.9K",5,15,4,3,2,3]
["ID1571","2012-06-01T02:33:02",31200,31200,"USD",31200,31200,{"$f":"OFFSET(F470,0,Brains!$D$1,1,1)","v":31200},"Data Analyst","Analyst","USA","USA","4 to 6","4 to 6 hours a day","11-20 yrs","30-49.9K",5,15,4,3,2,3]
["ID0738","2012-05-26T15:44:32",5022,5022,"USD",5022,5022,{"$f":"OFFSET(F471,0,Brains!$D$1,1,1)","v":5022},"Accounts analyst","Analyst","Pakistan","Pakistan","4 to 6","4 to 6 hours a day","11-20 yrs","0-14.9K",5,15,4,3,2,1]
["ID1427","2012-05-30T01:29:51",80442,80442,"USD",80442,80442,{"$f":"OFFSET(F472,0,Brains!$D$1,1,1)","v":80442},"Senior Budget Analyst","Analyst","USA","USA","4 to 6","4 to 6 hours a day","11-20 yrs","75-99.9K",5,16,4,3,2,5]
["ID1305","2012-05-29T13:58:30","US$ 100,000",100000,"USD",100000,100000,{"$f":"OFFSET(F473,0,Brains!$D$1,1,1)","v":100000},"Business Analyst","Analyst","Uganda","Uganda","4 to 6","4 to 6 hours a day","11-20 yrs","100-149.9K",5,17,4,3,2,6]
["ID1381","2012-05-29T21:28:07",85000,85000,"USD",85000,85000,{"$f":"OFFSET(F474,0,Brains!$D$1,1,1)","v":85000},"Senior Analyst","Analyst","USA","USA","4 to 6","4 to 6 hours a day","11-20 yrs","75-99.9K",5,17,4,3,2,5]
["ID1554","2012-05-31T21:06:45",70970,70970,"USD",70970,70970,{"$f":"OFFSET(F475,0,Brains!$D$1,1,1)","v":70970},"Sr. Risk Analyst","Analyst","USA","USA","4 to 6","4 to 6 hours a day","11-20 yrs","50-74.9K",5,17,4,3,2,4]
["ID1872","2012-06-16T02:50:49",54000,54000,"USD",54000,54000,{"$f":"OFFSET(F476,0,Brains!$D$1,1,1)","v":54000},"materials","Analyst","USA","USA","4 to 6","4 to 6 hours a day","11-20 yrs","50-74.9K",5,18,4,3,2,4]
["ID0930","2012-05-27T21:49:55",105000,105000,"USD",105000,105000,{"$f":"OFFSET(F477,0,Brains!$D$1,1,1)","v":105000},"business analyst","Analyst","USA","USA","4 to 6","4 to 6 hours a day","11-20 yrs","100-149.9K",5,20,4,3,2,6]
["ID0994","2012-05-28T09:21:56",100000,100000,"AUD",101990.96564026357,63613.231552162855,{"$f":"OFFSET(F478,0,Brains!$D$1,1,1)","v":63613.231552162855},"Reporting Analyst","Analyst","Australia","Australia","4 to 6","4 to 6 hours a day","11-20 yrs","50-74.9K",5,20,4,3,2,4]
["ID1435","2012-05-30T02:32:17",80000,80000,"USD",80000,80000,{"$f":"OFFSET(F479,0,Brains!$D$1,1,1)","v":80000},"Senior analyst, ops support","Analyst","USA","USA","4 to 6","4 to 6 hours a day","11-20 yrs","75-99.9K",5,20,4,3,2,5]
["ID1166","2012-05-28T22:35:56","CAD$65000",65000,"CAD",63918.498996971248,52041.633306645308,{"$f":"OFFSET(F480,0,Brains!$D$1,1,1)","v":52041.633306645308},"IT Analyst (Reporting)","Analyst","Canada","Canada","4 to 6","4 to 6 hours a day","11-20 yrs","50-74.9K",5,20,4,3,2,4]
["ID1813","2012-06-12T18:09:58","Â£32000",32000,"GBP",50437.70470615309,47477.744807121657,{"$f":"OFFSET(F481,0,Brains!$D$1,1,1)","v":47477.744807121657},"Business Analyst","Analyst","UK","UK","4 to 6","4 to 6 hours a day","11-20 yrs","30-49.9K",5,20,4,3,2,3]
["ID0917","2012-05-27T17:24:09",36400,36400,"USD",36400,36400,{"$f":"OFFSET(F482,0,Brains!$D$1,1,1)","v":36400},"Analyst","Analyst","Zimbabwe","Zimbabwe","4 to 6","4 to 6 hours a day","11-20 yrs","30-49.9K",5,20,4,3,2,3]
["ID1613","2012-06-02T03:13:57",35500,35500,"USD",35500,35500,{"$f":"OFFSET(F483,0,Brains!$D$1,1,1)","v":35500},"SAS Adminstrator","Analyst","USA","USA","4 to 6","4 to 6 hours a day","11-20 yrs","30-49.9K",5,20,4,3,2,3]
["ID1882","2012-06-16T22:24:30",20500,20500,"GBP",32311.654577379326,30415.430267062315,{"$f":"OFFSET(F484,0,Brains!$D$1,1,1)","v":30415.430267062315},"analyst","Analyst","UK","UK","4 to 6","4 to 6 hours a day","11-20 yrs","30-49.9K",5,20,4,3,2,3]
["ID0572","2012-05-26T06:50:23",38000,38000,"USD",38000,38000,{"$f":"OFFSET(F485,0,Brains!$D$1,1,1)","v":38000},"Costing Analysis","Analyst","USA","USA","All 8","All the 8 hours baby, all the 8!","11-20 yrs","30-49.9K",8,11,5,3,2,3]
["ID1799","2012-06-12T00:26:07",100000,100000,"USD",100000,100000,{"$f":"OFFSET(F486,0,Brains!$D$1,1,1)","v":100000},"analyst","Analyst","USA","USA","All 8","All the 8 hours baby, all the 8!","11-20 yrs","100-149.9K",8,12,5,3,2,6]
["ID1365","2012-05-29T19:23:32",60000,60000,"USD",60000,60000,{"$f":"OFFSET(F487,0,Brains!$D$1,1,1)","v":60000},"Business Information Analyst","Analyst","USA","USA","All 8","All the 8 hours baby, all the 8!","11-20 yrs","50-74.9K",8,12,5,3,2,4]
["ID1605","2012-06-01T20:53:08",50000,50000,"USD",50000,50000,{"$f":"OFFSET(F488,0,Brains!$D$1,1,1)","v":50000},"Catalog Circulation Analyst","Analyst","USA","USA","All 8","All the 8 hours baby, all the 8!","11-20 yrs","50-74.9K",8,12,5,3,2,4]
["ID1529","2012-05-31T08:20:03",89000,89000,"USD",89000,89000,{"$f":"OFFSET(F489,0,Brains!$D$1,1,1)","v":89000},"BI Analyst","Analyst","USA","USA","All 8","All the 8 hours baby, all the 8!","11-20 yrs","75-99.9K",8,14,5,3,2,5]
["ID1407","2012-05-29T23:09:29",65000,65000,"USD",65000,65000,{"$f":"OFFSET(F490,0,Brains!$D$1,1,1)","v":65000},"Data Analyst","Analyst","USA","USA","All 8","All the 8 hours baby, all the 8!","11-20 yrs","50-74.9K",8,14,5,3,2,4]
["ID1922","2012-06-20T05:03:44",115000,115000,"USD",115000,115000,{"$f":"OFFSET(F491,0,Brains!$D$1,1,1)","v":115000},"Business Analyst","Analyst","USA","USA","All 8","All the 8 hours baby, all the 8!","11-20 yrs","100-149.9K",8,15,5,3,2,6]
["ID0874","2012-05-27T09:17:47",70000,70000,"USD",70000,70000,{"$f":"OFFSET(F492,0,Brains!$D$1,1,1)","v":70000},"Financial Analyst","Analyst","USA","USA","All 8","All the 8 hours baby, all the 8!","11-20 yrs","50-74.9K",8,15,5,3,2,4]
["ID1746","2012-06-08T03:23:20",69000,69000,"USD",69000,69000,{"$f":"OFFSET(F493,0,Brains!$D$1,1,1)","v":69000},"Business Analyst II","Analyst","USA","USA","All 8","All the 8 hours baby, all the 8!","11-20 yrs","50-74.9K",8,15,5,3,2,4]
["ID1847","2012-06-15T00:35:45",50000,50000,"USD",50000,50000,{"$f":"OFFSET(F494,0,Brains!$D$1,1,1)","v":50000},"Digital Media Analyst","Analyst","USA","USA","All 8","All the 8 hours baby, all the 8!","11-20 yrs","50-74.9K",8,15,5,3,2,4]
["ID1152","2012-05-28T20:20:54",35000,35000,"USD",35000,35000,{"$f":"OFFSET(F495,0,Brains!$D$1,1,1)","v":35000},"BI Analyst","Analyst","USA","USA","All 8","All the 8 hours baby, all the 8!","11-20 yrs","30-49.9K",8,20,5,3,2,3]
["ID1041","2012-05-28T13:27:46","10 Lakh",1000000,"INR",17807.916687442568,49795.837068021116,{"$f":"OFFSET(F496,0,Brains!$D$1,1,1)","v":49795.837068021116},"Teaching","Analyst","India","India","1 or 2","1 or 2 hours a day","21-30 yrs","30-49.9K",1.5,25,2,4,2,3]
["ID1095","2012-05-28T16:03:45","Rs500000",500000,"INR",8903.9583437212841,24897.918534010558,{"$f":"OFFSET(F497,0,Brains!$D$1,1,1)","v":24897.918534010558},"Executive","Analyst","India","India","2 to 3","2 to 3 hours per day","21-30 yrs","15-29.9K",2.5,23,3,4,2,2]
["ID0589","2012-05-26T08:01:44",75000,75000,"USD",75000,75000,{"$f":"OFFSET(F498,0,Brains!$D$1,1,1)","v":75000},"Sr. Human Resources Analyst","Analyst","USA","USA","2 to 3","2 to 3 hours per day","21-30 yrs","75-99.9K",2.5,25,3,4,2,5]
["ID1827","2012-06-13T04:39:37",42307.199999999997,42307,"USD",42307,42307,{"$f":"OFFSET(F499,0,Brains!$D$1,1,1)","v":42307},"purchasing operations administrator","Analyst","USA","USA","2 to 3","2 to 3 hours per day","21-30 yrs","30-49.9K",2.5,25,3,4,2,3]
["ID0824","2012-05-26T22:49:34",75000,75000,"USD",75000,75000,{"$f":"OFFSET(F500,0,Brains!$D$1,1,1)","v":75000},"sr financial analyst","Analyst","USA","USA","2 to 3","2 to 3 hours per day","21-30 yrs","75-99.9K",2.5,27,3,4,2,5]
["ID1412","2012-05-29T23:39:13",150000,150000,"USD",150000,150000,{"$f":"OFFSET(F501,0,Brains!$D$1,1,1)","v":150000},"Senior Analyst","Analyst","USA","USA","2 to 3","2 to 3 hours per day","21-30 yrs","150-249.9K",2.5,30,3,4,2,7]
["ID1927","2012-06-20T14:08:51",52500,52500,"USD",52500,52500,{"$f":"OFFSET(F502,0,Brains!$D$1,1,1)","v":52500},"Business Analist","Analyst","south africa","South Africa","4 to 6","4 to 6 hours a day","21-30 yrs","50-74.9K",5,21,4,4,2,4]
["ID1507","2012-05-30T23:59:22","6.5 LAKHS",650000,"INR",11575.14584683767,32367.294094213721,{"$f":"OFFSET(F503,0,Brains!$D$1,1,1)","v":32367.294094213721},"HR/ADMINISTRATION","Analyst","India","India","4 to 6","4 to 6 hours a day","21-30 yrs","30-49.9K",5,21,4,4,2,3]
["ID0570","2012-05-26T06:47:59","NZ $80,000",80000,"NZD",63807.047488395103,46376.811594202904,{"$f":"OFFSET(F504,0,Brains!$D$1,1,1)","v":46376.811594202904},"Accountant/Analyst","Analyst","New Zealand","New Zealand","4 to 6","4 to 6 hours a day","21-30 yrs","30-49.9K",5,23,4,4,2,3]
["ID1253","2012-05-29T06:08:12",50846,50846,"USD",50846,50846,{"$f":"OFFSET(F505,0,Brains!$D$1,1,1)","v":50846},"Program & Policy Analyst-Advanced","Analyst","USA","USA","4 to 6","4 to 6 hours a day","21-30 yrs","50-74.9K",5,25,4,4,2,4]
["ID1222","2012-05-29T01:12:28",90000,90000,"USD",90000,90000,{"$f":"OFFSET(F506,0,Brains!$D$1,1,1)","v":90000},"Senior Analyst","Analyst","USA","USA","4 to 6","4 to 6 hours a day","21-30 yrs","75-99.9K",5,30,4,4,2,5]
["ID1586","2012-06-01T08:52:31",85000,85000,"AUD",86692.320794224041,54071.246819338427,{"$f":"OFFSET(F507,0,Brains!$D$1,1,1)","v":54071.246819338427},"Administrator","Analyst","Australia","Australia","4 to 6","4 to 6 hours a day","21-30 yrs","50-74.9K",5,30,4,4,2,4]
["ID0643","2012-05-26T11:47:18",53000,53000,"USD",53000,53000,{"$f":"OFFSET(F508,0,Brains!$D$1,1,1)","v":53000},"Financial Analyst","Analyst","USA","USA","4 to 6","4 to 6 hours a day","21-30 yrs","50-74.9K",5,30,4,4,2,4]
["ID1525","2012-05-31T06:13:42",62000,62000,"USD",62000,62000,{"$f":"OFFSET(F509,0,Brains!$D$1,1,1)","v":62000},"info analyst","Analyst","USA","USA","All 8","All the 8 hours baby, all the 8!","21-30 yrs","50-74.9K",8,27,5,4,2,4]
["ID1895","2012-06-18T18:26:47","Â£35000",35000,"GBP",55166.239522354947,51928.783382789312,{"$f":"OFFSET(F510,0,Brains!$D$1,1,1)","v":51928.783382789312},"Process Analyst","Analyst","UK","UK","All 8","All the 8 hours baby, all the 8!","31-40 yrs","50-74.9K",8,34,5,5,2,4]
["ID0804","2012-05-26T21:24:39","ZAR900,000",900000,"ZAR",109729.60187662003,158674.18899858955,{"$f":"OFFSET(F511,0,Brains!$D$1,1,1)","v":158674.18899858955},"Business Analyst","Analyst","South Africa","South Africa","All 8","All the 8 hours baby, all the 8!","31-40 yrs","150-249.9K",8,40,5,5,2,7]
["ID1377","2012-05-29T21:07:27",24000,24000,"USD",24000,24000,{"$f":"OFFSET(F512,0,Brains!$D$1,1,1)","v":24000},"clerk 24 hrs per week","Analyst","USA","USA","1 or 2","1 or 2 hours a day","31-40 yrs","15-29.9K",1.5,33,2,5,2,2]
["ID0620","2012-05-26T10:59:10",250000,250000,"CAD",245840.3807575817,200160.12810248195,{"$f":"OFFSET(F513,0,Brains!$D$1,1,1)","v":200160.12810248195},"Business Analyst","Analyst","Canada","Canada","4 to 6","4 to 6 hours a day","31-40 yrs","150-249.9K",5,32,4,5,2,7]
["ID1723","2012-06-06T21:18:51",100000,100000,"USD",100000,100000,{"$f":"OFFSET(F514,0,Brains!$D$1,1,1)","v":100000},"financial analyst (real estate)","Analyst","Russia","Russia","All 8","All the 8 hours baby, all the 8!","6-10 yrs",{"$f":"IF(H514<15000,\"0-14.9K\",IF(H514<30000,\"15-29.9K\",IF(H514<50000,\"30-49.9K\",IF(H514<75000,\"50-74.9K\",IF(H514<100000,\"75-99.9K\",IF(H514<150000,\"100-149.9K\",IF(H514<250000,\"150-249.9K\",\"250K+\")))))))","v":"100-149.9K"},8,6,5,2,2,{"$f":"IF(H514<15000,1,IF(H514<30000,2,IF(H514<50000,3,IF(H514<75000,4,IF(H514<100000,5,IF(H514<150000,6,IF(H514<250000,7,8)))))))","v":6}]
["ID0993","2012-05-28T09:12:27",92000,92000,"AUD",93831.688389042494,58524.173027989826,{"$f":"OFFSET(F515,0,Brains!$D$1,1,1)","v":58524.173027989826},"Finance analyst","Analyst","Australia","Australia","All 8","All the 8 hours baby, all the 8!","6-10 yrs","50-74.9K",8,6,5,2,2,4]
["ID0566","2012-05-26T06:24:03",55000,55000,"EUR",69871.969144538423,69090.963906880454,{"$f":"OFFSET(F516,0,Brains!$D$1,1,1)","v":69090.963906880454},"Business analyst","Analyst","Netherlands","Netherlands","All 8","All the 8 hours baby, all the 8!","6-10 yrs","50-74.9K",8,6,5,2,2,4]
["ID1685","2012-06-05T12:42:38","NZD$71000",71000,"NZD",56628.754645950656,41159.420289855072,{"$f":"OFFSET(F517,0,Brains!$D$1,1,1)","v":41159.420289855072},"Business Analyst","Analyst","NZ","New Zealand","All 8","All the 8 hours baby, all the 8!","6-10 yrs","30-49.9K",8,6,5,2,2,3]
["ID1349","2012-05-29T18:14:48","Â£30000",30000,"GBP",47285.348162018527,44510.385756676558,{"$f":"OFFSET(F518,0,Brains!$D$1,1,1)","v":44510.385756676558},"Market Analyst","Analyst","UK","UK","All 8","All the 8 hours baby, all the 8!","6-10 yrs","30-49.9K",8,6,5,2,2,3]
["ID0877","2012-05-27T11:32:17",26400,26400,"USD",26400,26400,{"$f":"OFFSET(F519,0,Brains!$D$1,1,1)","v":26400},"Supply Chain Administrator","Analyst","UAE","UAE","All 8","All the 8 hours baby, all the 8!","6-10 yrs","15-29.9K",8,6,5,2,2,2]
["ID1506","2012-05-30T23:29:58",18000,18000,"USD",18000,18000,{"$f":"OFFSET(F520,0,Brains!$D$1,1,1)","v":18000},"Process Associate","Analyst","India","India","All 8","All the 8 hours baby, all the 8!","6-10 yrs","15-29.9K",8,6,5,2,2,2]
["ID0838","2012-05-26T23:47:34","13000 USD",13000,"USD",13000,13000,{"$f":"OFFSET(F521,0,Brains!$D$1,1,1)","v":13000},"Business Analyst","Analyst","India","India","All 8","All the 8 hours baby, all the 8!","6-10 yrs","0-14.9K",8,6,5,2,2,1]
["ID1667","2012-06-04T22:16:00",13000,13000,"USD",13000,13000,{"$f":"OFFSET(F522,0,Brains!$D$1,1,1)","v":13000},"logistics analyst","Analyst","Slovakia","Slovakia","All 8","All the 8 hours baby, all the 8!","6-10 yrs","0-14.9K",8,6,5,2,2,1]
["ID1015","2012-05-28T11:39:01","Rs.6.4 lakhs",640000,"INR",11397.066679963244,31869.335723533513,{"$f":"OFFSET(F523,0,Brains!$D$1,1,1)","v":31869.335723533513},"Sr.Analyst - Process Excellence","Analyst","India","India","All 8","All the 8 hours baby, all the 8!","6-10 yrs","30-49.9K",8,6,5,2,2,3]
["ID1314","2012-05-29T15:04:11","INR360000",360000,"INR",6410.8500074793246,17926.501344487599,{"$f":"OFFSET(F524,0,Brains!$D$1,1,1)","v":17926.501344487599},"Sr. Executive -HR","Analyst","India","India","All 8","All the 8 hours baby, all the 8!","6-10 yrs","15-29.9K",8,6,5,2,2,2]
["ID0576","2012-05-26T07:06:50","USD 4285.00",4285,"USD",4285,4285,{"$f":"OFFSET(F525,0,Brains!$D$1,1,1)","v":4285},"Assistant","Analyst","India","India","All 8","All the 8 hours baby, all the 8!","6-10 yrs","0-14.9K",8,6,5,2,2,1]
["ID1479","2012-05-30T18:15:28",4000,4000,"USD",4000,4000,{"$f":"OFFSET(F526,0,Brains!$D$1,1,1)","v":4000},"M I S Executive","Analyst","India","India","All 8","All the 8 hours baby, all the 8!","6-10 yrs","0-14.9K",8,6,5,2,2,1]
["ID1119","2012-05-28T17:12:47",18987,18987,"USD",18987,18987,{"$f":"OFFSET(F527,0,Brains!$D$1,1,1)","v":18987},"Business Analyst","Analyst","Nigeria","Nigeria","All 8","All the 8 hours baby, all the 8!","6-10 yrs","15-29.9K",8,7,5,2,2,2]
["ID0701","2012-05-26T13:44:53","25000 rupess",300000,"INR",5342.3750062327708,14938.751120406334,{"$f":"OFFSET(F528,0,Brains!$D$1,1,1)","v":14938.751120406334},"Analyst","Analyst","India","India","All 8","All the 8 hours baby, all the 8!","6-10 yrs","0-14.9K",8,7,5,2,2,1]
["ID1102","2012-05-28T16:20:52",58000,58000,"GBP",91418.339779902482,86053.412462908003,{"$f":"OFFSET(F529,0,Brains!$D$1,1,1)","v":86053.412462908003},"Data analyst","Analyst","UK","UK","All 8","All the 8 hours baby, all the 8!","6-10 yrs","75-99.9K",8,8,5,2,2,5]
["ID1302","2012-05-29T13:52:13",45000,45000,"USD",45000,45000,{"$f":"OFFSET(F530,0,Brains!$D$1,1,1)","v":45000},"Financial Analysis","Analyst","Pakistan","Pakistan","All 8","All the 8 hours baby, all the 8!","6-10 yrs","30-49.9K",8,8,5,2,2,3]
["ID1678","2012-06-05T03:55:36","US$ 30500",30500,"USD",30500,30500,{"$f":"OFFSET(F531,0,Brains!$D$1,1,1)","v":30500},"Financial Analyst","Analyst","Brazil","Brazil","All 8","All the 8 hours baby, all the 8!","6-10 yrs","30-49.9K",8,8,5,2,2,3]
["ID1726","2012-06-06T22:42:16",25000,25000,"USD",25000,25000,{"$f":"OFFSET(F532,0,Brains!$D$1,1,1)","v":25000},"exe","Analyst","India","India","All 8","All the 8 hours baby, all the 8!","6-10 yrs","15-29.9K",8,8,5,2,2,2]
["ID1573","2012-06-01T03:01:04",1320,15840,"USD",15840,15840,{"$f":"OFFSET(F533,0,Brains!$D$1,1,1)","v":15840},"Asistente","Analyst","Peru","Peru","All 8","All the 8 hours baby, all the 8!","6-10 yrs","15-29.9K",8,8,5,2,2,2]
["ID0925","2012-05-27T21:04:07",600000,600000,"INR",10684.750012465542,29877.502240812668,{"$f":"OFFSET(F534,0,Brains!$D$1,1,1)","v":29877.502240812668},"Sales Analyst","Analyst","India","India","All 8","All the 8 hours baby, all the 8!","6-10 yrs","15-29.9K",8,8,5,2,2,2]
["ID0861","2012-05-27T04:00:14","Rs. 45000",540000,"INR",9616.275011218986,26889.7520167314,{"$f":"OFFSET(F535,0,Brains!$D$1,1,1)","v":26889.7520167314},"Senior analyst","Analyst","India","India","All 8","All the 8 hours baby, all the 8!","6-10 yrs","15-29.9K",8,8,5,2,2,2]
["ID0934","2012-05-27T22:40:38","R$ 19.200,00",19200,"BRL",9490.1984044603923,10212.765957446809,{"$f":"OFFSET(F536,0,Brains!$D$1,1,1)","v":10212.765957446809},"Programmer","Analyst","Brazil","Brazil","All 8","All the 8 hours baby, all the 8!","6-10 yrs","0-14.9K",8,8,5,2,2,1]
["ID0710","2012-05-26T14:11:52","Re. 4.5 Lacs Per Annum",450000,"INR",8013.5625093491553,22408.126680609501,{"$f":"OFFSET(F537,0,Brains!$D$1,1,1)","v":22408.126680609501},"Data Analyst","Analyst","India","India","All 8","All the 8 hours baby, all the 8!","6-10 yrs","15-29.9K",8,8,5,2,2,2]
["ID1818","2012-06-12T21:47:54",280000,280000,"INR",4986.216672483919,13942.834379045911,{"$f":"OFFSET(F538,0,Brains!$D$1,1,1)","v":13942.834379045911},"Sales Cordinator","Analyst","India","India","All 8","All the 8 hours baby, all the 8!","6-10 yrs","0-14.9K",8,8,5,2,2,1]
["ID1360","2012-05-29T19:06:14","2.5 per lacks",250000,"INR",4451.9791718606421,12448.959267005279,{"$f":"OFFSET(F539,0,Brains!$D$1,1,1)","v":12448.959267005279},"Credit Executive","Analyst","India","India","All 8","All the 8 hours baby, all the 8!","6-10 yrs","0-14.9K",8,8,5,2,2,1]
["ID0633","2012-05-26T11:30:39","A$170000",170000,"AUD",173384.64158844808,108142.49363867685,{"$f":"OFFSET(F540,0,Brains!$D$1,1,1)","v":108142.49363867685},"senior business analyst","Analyst","Australia","Australia","All 8","All the 8 hours baby, all the 8!","6-10 yrs","100-149.9K",8,10,5,2,2,6]
["ID0932","2012-05-27T22:22:01","50000 GBP",50000,"GBP",78808.913603364199,74183.976261127595,{"$f":"OFFSET(F541,0,Brains!$D$1,1,1)","v":74183.976261127595},"Finance Analyst","Analyst","UK","UK","All 8","All the 8 hours baby, all the 8!","6-10 yrs","50-74.9K",8,10,5,2,2,4]
["ID0798","2012-05-26T21:00:40","Aud 65000",65000,"AUD",66294.12766617132,41348.600508905853,{"$f":"OFFSET(F542,0,Brains!$D$1,1,1)","v":41348.600508905853},"Market analyst","Analyst","Australia","Australia","All 8","All the 8 hours baby, all the 8!","6-10 yrs","30-49.9K",8,10,5,2,2,3]
["ID1101","2012-05-28T16:19:41","Â£30000",30000,"GBP",47285.348162018527,44510.385756676558,{"$f":"OFFSET(F543,0,Brains!$D$1,1,1)","v":44510.385756676558},"MDM Executive (Business Analyst)","Analyst","UK","UK","All 8","All the 8 hours baby, all the 8!","6-10 yrs","30-49.9K",8,10,5,2,2,3]
["ID1040","2012-05-28T13:26:22",55,55000,"NZD",43867.345148271634,31884.057971014496,{"$f":"OFFSET(F544,0,Brains!$D$1,1,1)","v":31884.057971014496},"Financial Analyst","Analyst","New Zealand","New Zealand","All 8","All the 8 hours baby, all the 8!","6-10 yrs","30-49.9K",8,10,5,2,2,3]
["ID0575","2012-05-26T07:01:10","Â£21000",21000,"GBP",33099.743713412965,31157.270029673589,{"$f":"OFFSET(F545,0,Brains!$D$1,1,1)","v":31157.270029673589},"Sales Analyst","Analyst","UK","UK","All 8","All the 8 hours baby, all the 8!","6-10 yrs","30-49.9K",8,10,5,2,2,3]
["ID1192","2012-05-28T23:13:31","5000  PLN   net",60000,"PLN",18018.883790212141,30241.935483870966,{"$f":"OFFSET(F546,0,Brains!$D$1,1,1)","v":30241.935483870966},"Sales Analyst","Analyst","Poland","Poland","All 8","All the 8 hours baby, all the 8!","6-10 yrs","30-49.9K",8,10,5,2,2,3]
["ID1551","2012-05-31T20:13:27",1000000,1000000,"INR",17807.916687442568,49795.837068021116,{"$f":"OFFSET(F547,0,Brains!$D$1,1,1)","v":49795.837068021116},"Financial analyst","Analyst","India","India","All 8","All the 8 hours baby, all the 8!","6-10 yrs","30-49.9K",8,10,5,2,2,3]
["ID1868","2012-06-15T21:32:16","$US16.110,72",16110,"USD",16110,16110,{"$f":"OFFSET(F548,0,Brains!$D$1,1,1)","v":16110},"INFORMATION ANALIST","Analyst","COLOMBIA","Colombia","All 8","All the 8 hours baby, all the 8!","6-10 yrs","15-29.9K",8,10,5,2,2,2]
["ID1080","2012-05-28T15:33:23",600,7200,"USD",7200,7200,{"$f":"OFFSET(F549,0,Brains!$D$1,1,1)","v":7200},"Data Entry Operator","Analyst","India","India","All 8","All the 8 hours baby, all the 8!","6-10 yrs","0-14.9K",8,10,5,2,2,1]
["ID1226","2012-05-29T01:41:00",80000,80000,"USD",80000,80000,{"$f":"OFFSET(F550,0,Brains!$D$1,1,1)","v":80000},"Snr Business Analyst","Analyst","Singapore","Singapore","1 or 2","1 or 2 hours a day","6-10 yrs","75-99.9K",1.5,6,2,2,2,5]
["ID1258","2012-05-29T07:46:56",70000,70000,"USD",70000,70000,{"$f":"OFFSET(F551,0,Brains!$D$1,1,1)","v":70000},"Develope","Analyst","USA","USA","1 or 2","1 or 2 hours a day","6-10 yrs","50-74.9K",1.5,6,2,2,2,4]
["ID1178","2012-05-28T22:48:32","INR 20 Lakhs p.a.",200000,"INR",3561.5833374885137,9959.167413604222,{"$f":"OFFSET(F552,0,Brains!$D$1,1,1)","v":9959.167413604222},"Associate","Analyst","India","India","1 or 2","1 or 2 hours a day","6-10 yrs","0-14.9K",1.5,6,2,2,2,1]
["ID1637","2012-06-03T04:42:54",106000,106000,"USD",106000,106000,{"$f":"OFFSET(F553,0,Brains!$D$1,1,1)","v":106000},"IT Developer","Analyst","Denmark","Denmark","1 or 2","1 or 2 hours a day","6-10 yrs","100-149.9K",1.5,7,2,2,2,6]
["ID0922","2012-05-27T20:18:50","95000 AUD",95000,"AUD",96891.417358250401,60432.56997455471,{"$f":"OFFSET(F554,0,Brains!$D$1,1,1)","v":60432.56997455471},"Senior Marketing Analyst","Analyst","Australia","Australia","1 or 2","1 or 2 hours a day","6-10 yrs","50-74.9K",1.5,7,2,2,2,4]
["ID1250","2012-05-29T05:21:39",55000,55000,"USD",55000,55000,{"$f":"OFFSET(F555,0,Brains!$D$1,1,1)","v":55000},"Systems Analyst","Analyst","USA","USA","1 or 2","1 or 2 hours a day","6-10 yrs","50-74.9K",1.5,7,2,2,2,4]
["ID0562","2012-05-26T06:08:23",35000,35000,"USD",35000,35000,{"$f":"OFFSET(F556,0,Brains!$D$1,1,1)","v":35000},"Technical Support Technician","Analyst","USA","USA","1 or 2","1 or 2 hours a day","6-10 yrs","30-49.9K",1.5,7,2,2,2,3]
["ID0799","2012-05-26T21:05:35","Rs. 377000",377000,"INR",6713.584591165848,18773.030574643959,{"$f":"OFFSET(F557,0,Brains!$D$1,1,1)","v":18773.030574643959},"Team Developer","Analyst","India","India","1 or 2","1 or 2 hours a day","6-10 yrs","15-29.9K",1.5,7,2,2,2,2]
["ID0866","2012-05-27T04:40:33",65000,65000,"USD",65000,65000,{"$f":"OFFSET(F558,0,Brains!$D$1,1,1)","v":65000},"Security Access Governance Analyst","Analyst","USA","USA","1 or 2","1 or 2 hours a day","6-10 yrs","50-74.9K",1.5,8,2,2,2,4]
["ID1361","2012-05-29T19:08:37",110000,110000,"USD",110000,110000,{"$f":"OFFSET(F559,0,Brains!$D$1,1,1)","v":110000},"Business Analytics Associate","Analyst","USA","USA","1 or 2","1 or 2 hours a day","6-10 yrs","100-149.9K",1.5,10,2,2,2,6]
["ID1075","2012-05-28T15:16:20","Rs. 438000",438000,"INR",7799.8675090998449,21810.576635793248,{"$f":"OFFSET(F560,0,Brains!$D$1,1,1)","v":21810.576635793248},"Assistant Professor","Analyst","India","India","1 or 2","1 or 2 hours a day","6-10 yrs","15-29.9K",1.5,10,2,2,2,2]
["ID0841","2012-05-27T00:07:52",6000,6000,"USD",6000,6000,{"$f":"OFFSET(F561,0,Brains!$D$1,1,1)","v":6000},"Analysis Quality","Analyst","Colombia - South America","Colombia","1 or 2","1 or 2 hours a day","6-10 yrs","0-14.9K",1.5,10,2,2,2,1]
["ID0881","2012-05-27T12:35:15","3 lacs P.A",300000,"INR",5342.3750062327708,14938.751120406334,{"$f":"OFFSET(F562,0,Brains!$D$1,1,1)","v":14938.751120406334},"Sales","Analyst","India","India","1 or 2","1 or 2 hours a day","6-10 yrs","0-14.9K",1.5,10,2,2,2,1]
["ID0906","2012-05-27T15:44:07",75010,75010,"USD",75010,75010,{"$f":"OFFSET(F563,0,Brains!$D$1,1,1)","v":75010},"Senior Business Analyst","Analyst","USA","USA","2 to 3","2 to 3 hours per day","6-10 yrs","75-99.9K",2.5,6,3,2,2,5]
["ID1111","2012-05-28T16:45:32","Â£35000",35000,"GBP",55166.239522354947,51928.783382789312,{"$f":"OFFSET(F564,0,Brains!$D$1,1,1)","v":51928.783382789312},"Systems Analyst","Analyst","UK","UK","2 to 3","2 to 3 hours per day","6-10 yrs","50-74.9K",2.5,6,3,2,2,4]
["ID1419","2012-05-30T00:42:50",40000,40000,"USD",40000,40000,{"$f":"OFFSET(F565,0,Brains!$D$1,1,1)","v":40000},"Metrics Analyst","Analyst","USA","USA","2 to 3","2 to 3 hours per day","6-10 yrs","30-49.9K",2.5,6,3,2,2,3]
["ID1146","2012-05-28T19:25:04","INR 853000",853000,"INR",15190.15293438851,42475.849019022011,{"$f":"OFFSET(F566,0,Brains!$D$1,1,1)","v":42475.849019022011},"Lead Research Analyst","Analyst","India","India","2 to 3","2 to 3 hours per day","6-10 yrs","30-49.9K",2.5,6,3,2,2,3]
["ID0757","2012-05-26T16:50:46",8000,8000,"USD",8000,8000,{"$f":"OFFSET(F567,0,Brains!$D$1,1,1)","v":8000},"Business Analyst","Analyst","India","India","2 to 3","2 to 3 hours per day","6-10 yrs","0-14.9K",2.5,6,3,2,2,1]
["ID1540","2012-05-31T16:10:28","Rs. 380000",380000,"INR",6767.0083412281756,18922.418085848021,{"$f":"OFFSET(F568,0,Brains!$D$1,1,1)","v":18922.418085848021},"reporting analyst","Analyst","India","India","2 to 3","2 to 3 hours per day","6-10 yrs","15-29.9K",2.5,6,3,2,2,2]
["ID1465","2012-05-30T14:21:57",360000,360000,"INR",6410.8500074793246,17926.501344487599,{"$f":"OFFSET(F569,0,Brains!$D$1,1,1)","v":17926.501344487599},"analyst","Analyst","India","India","2 to 3","2 to 3 hours per day","6-10 yrs","15-29.9K",2.5,6,3,2,2,2]
["ID1264","2012-05-29T08:41:14",110000,110000,"AUD",112190.06220428993,69974.554707379139,{"$f":"OFFSET(F570,0,Brains!$D$1,1,1)","v":69974.554707379139},"Analyst","Analyst","Australia","Australia","2 to 3","2 to 3 hours per day","6-10 yrs","50-74.9K",2.5,7,3,2,2,4]
["ID1376","2012-05-29T20:53:43",95000,95000,"USD",95000,95000,{"$f":"OFFSET(F571,0,Brains!$D$1,1,1)","v":95000},"Cost Analyst","Analyst","USA","USA","2 to 3","2 to 3 hours per day","6-10 yrs","75-99.9K",2.5,7,3,2,2,5]
["ID1063","2012-05-28T14:40:54","INR 530000 ",530000,"INR",9438.1958443445619,26391.793646051188,{"$f":"OFFSET(F572,0,Brains!$D$1,1,1)","v":26391.793646051188},"Project Administrator","Analyst","India","India","2 to 3","2 to 3 hours per day","6-10 yrs","15-29.9K",2.5,7,3,2,2,2]
["ID1692","2012-06-05T20:43:21",90000,90000,"USD",90000,90000,{"$f":"OFFSET(F573,0,Brains!$D$1,1,1)","v":90000},"Senior QA Tester","Analyst","USA","USA","2 to 3","2 to 3 hours per day","6-10 yrs","75-99.9K",2.5,8,3,2,2,5]
["ID0875","2012-05-27T09:49:30",5000,60000,"USD",60000,60000,{"$f":"OFFSET(F574,0,Brains!$D$1,1,1)","v":60000},"Store keeper","Analyst","USA","USA","2 to 3","2 to 3 hours per day","6-10 yrs","50-74.9K",2.5,8,3,2,2,4]
["ID0612","2012-05-26T10:20:35",30000,30000,"USD",30000,30000,{"$f":"OFFSET(F575,0,Brains!$D$1,1,1)","v":30000},"Sales Assistant","Analyst","USA","USA","2 to 3","2 to 3 hours per day","6-10 yrs","30-49.9K",2.5,8,3,2,2,3]
["ID1491","2012-05-30T20:42:27",10000,10000,"GBP",15761.782720672842,14836.795252225518,{"$f":"OFFSET(F576,0,Brains!$D$1,1,1)","v":14836.795252225518},"Analyst","Analyst","UK","UK","2 to 3","2 to 3 hours per day","6-10 yrs","0-14.9K",2.5,8,3,2,2,1]
["ID1237","2012-05-29T03:16:02",150000,150000,"AUD",152986.44846039536,95419.847328244272,{"$f":"OFFSET(F577,0,Brains!$D$1,1,1)","v":95419.847328244272},"Analyst","Analyst","Australia","Australia","2 to 3","2 to 3 hours per day","6-10 yrs","75-99.9K",2.5,10,3,2,2,5]
["ID0791","2012-05-26T20:19:36",65000,65000,"USD",65000,65000,{"$f":"OFFSET(F578,0,Brains!$D$1,1,1)","v":65000},"security analyst","Analyst","USA","USA","2 to 3","2 to 3 hours per day","6-10 yrs",{"$f":"IF(H578<15000,\"0-14.9K\",IF(H578<30000,\"15-29.9K\",IF(H578<50000,\"30-49.9K\",IF(H578<75000,\"50-74.9K\",IF(H578<100000,\"75-99.9K\",IF(H578<150000,\"100-149.9K\",IF(H578<250000,\"150-249.9K\",\"250K+\")))))))","v":"50-74.9K"},2.5,10,3,2,2,{"$f":"IF(H578<15000,1,IF(H578<30000,2,IF(H578<50000,3,IF(H578<75000,4,IF(H578<100000,5,IF(H578<150000,6,IF(H578<250000,7,8)))))))","v":4}]
["ID1402","2012-05-29T22:50:16",65000,65000,"USD",65000,65000,{"$f":"OFFSET(F579,0,Brains!$D$1,1,1)","v":65000},"eeo analyst","Analyst","USA","USA","2 to 3","2 to 3 hours per day","6-10 yrs","50-74.9K",2.5,10,3,2,2,4]
["ID1803","2012-06-12T02:59:16",65000,65000,"USD",65000,65000,{"$f":"OFFSET(F580,0,Brains!$D$1,1,1)","v":65000},"Data Analyst","Analyst","USA","USA","2 to 3","2 to 3 hours per day","6-10 yrs","50-74.9K",2.5,10,3,2,2,4]
["ID1482","2012-05-30T18:51:57",60000,60000,"USD",60000,60000,{"$f":"OFFSET(F581,0,Brains!$D$1,1,1)","v":60000},"sales&marketing","Analyst","turkey","Turkey","2 to 3","2 to 3 hours per day","6-10 yrs","50-74.9K",2.5,10,3,2,2,4]
["ID1639","2012-06-03T09:42:40",75000,75000,"NZD",59819.107020370408,43478.260869565216,{"$f":"OFFSET(F582,0,Brains!$D$1,1,1)","v":43478.260869565216},"business support analyst","Analyst","New zealand","New Zealand","2 to 3","2 to 3 hours per day","6-10 yrs","30-49.9K",2.5,10,3,2,2,3]
["ID0957","2012-05-28T03:34:14",45000,45000,"EUR",57167.974754622352,56528.970469265834,{"$f":"OFFSET(F583,0,Brains!$D$1,1,1)","v":56528.970469265834},"data analist","Analyst","netherlands","Netherlands","2 to 3","2 to 3 hours per day","6-10 yrs","50-74.9K",2.5,10,3,2,2,4]
["ID1310","2012-05-29T14:55:21","36K",36000,"USD",36000,36000,{"$f":"OFFSET(F584,0,Brains!$D$1,1,1)","v":36000},"Administrative Assistant","Analyst","Kuwait","Kuwait","2 to 3","2 to 3 hours per day","6-10 yrs","30-49.9K",2.5,10,3,2,2,3]
["ID0803","2012-05-26T21:13:51",33900,33900,"USD",33900,33900,{"$f":"OFFSET(F585,0,Brains!$D$1,1,1)","v":33900},"Administrative Assistant","Analyst","USA","USA","2 to 3","2 to 3 hours per day","6-10 yrs","30-49.9K",2.5,10,3,2,2,3]
["ID0797","2012-05-26T20:57:17",15000,15000,"EUR",19055.991584874118,18842.990156421944,{"$f":"OFFSET(F586,0,Brains!$D$1,1,1)","v":18842.990156421944},"Technician","Analyst","Spain","Spain","2 to 3","2 to 3 hours per day","6-10 yrs","15-29.9K",2.5,10,3,2,2,2]
["ID1035","2012-05-28T13:02:56","Rs 4,20,000 ",420000,"INR",7479.3250087258784,20914.251568568867,{"$f":"OFFSET(F587,0,Brains!$D$1,1,1)","v":20914.251568568867},"Analyst","Analyst","India","India","2 to 3","2 to 3 hours per day","6-10 yrs","15-29.9K",2.5,10,3,2,2,2]
["ID1887","2012-06-17T12:48:52",5000,5000,"USD",5000,5000,{"$f":"OFFSET(F588,0,Brains!$D$1,1,1)","v":5000},"admin","Analyst","India","India","2 to 3","2 to 3 hours per day","6-10 yrs","0-14.9K",2.5,10,3,2,2,1]
["ID1528","2012-05-31T07:17:36",145000,145000,"USD",145000,145000,{"$f":"OFFSET(F589,0,Brains!$D$1,1,1)","v":145000},"Associate","Analyst","USA","USA","4 to 6","4 to 6 hours a day","6-10 yrs","100-149.9K",5,6,4,2,2,6]
["ID1710","2012-06-06T05:52:59",81000,81000,"USD",81000,81000,{"$f":"OFFSET(F590,0,Brains!$D$1,1,1)","v":81000},"Contact Operations Analyst","Analyst","USA","USA","4 to 6","4 to 6 hours a day","6-10 yrs","75-99.9K",5,6,4,2,2,5]
["ID1199","2012-05-28T23:38:52",80000,80000,"USD",80000,80000,{"$f":"OFFSET(F591,0,Brains!$D$1,1,1)","v":80000},"Financial/Data Analyst","Analyst","USA","USA","4 to 6","4 to 6 hours a day","6-10 yrs","75-99.9K",5,6,4,2,2,5]
["ID1871","2012-06-15T23:50:11",67000,67000,"USD",67000,67000,{"$f":"OFFSET(F592,0,Brains!$D$1,1,1)","v":67000},"Sales Compensation Analyst","Analyst","USA","USA","4 to 6","4 to 6 hours a day","6-10 yrs","50-74.9K",5,6,4,2,2,4]
["ID1874","2012-06-16T06:17:53",63000,63000,"USD",63000,63000,{"$f":"OFFSET(F593,0,Brains!$D$1,1,1)","v":63000},"Marketing Database Analyst","Analyst","USA","USA","4 to 6","4 to 6 hours a day","6-10 yrs","50-74.9K",5,6,4,2,2,4]
["ID1177","2012-05-28T22:46:37","CAD $53,000/-",53000,"CAD",52118.160720607324,42433.947157726172,{"$f":"OFFSET(F594,0,Brains!$D$1,1,1)","v":42433.947157726172},"Data Analyst","Analyst","Canada","Canada","4 to 6","4 to 6 hours a day","6-10 yrs","30-49.9K",5,6,4,2,2,3]
["ID1681","2012-06-05T05:03:20",48500,48500,"USD",48500,48500,{"$f":"OFFSET(F595,0,Brains!$D$1,1,1)","v":48500},"Business Systems Analyst I","Analyst","USA","USA","4 to 6","4 to 6 hours a day","6-10 yrs","30-49.9K",5,6,4,2,2,3]
["ID1691","2012-06-05T19:59:35",33000,33000,"EUR",41923.181486723057,41454.578344128277,{"$f":"OFFSET(F596,0,Brains!$D$1,1,1)","v":41454.578344128277},"assistant","Analyst","france","France","4 to 6","4 to 6 hours a day","6-10 yrs","30-49.9K",5,6,4,2,2,3]
["ID0992","2012-05-28T09:03:56",19000,19000,"USD",19000,19000,{"$f":"OFFSET(F597,0,Brains!$D$1,1,1)","v":19000},"Finance analyst","Analyst","China","China","4 to 6","4 to 6 hours a day","6-10 yrs","15-29.9K",5,6,4,2,2,2]
["ID0616","2012-05-26T10:41:11","INR 850,000",850000,"INR",15136.729184326183,42326.461507817949,{"$f":"OFFSET(F598,0,Brains!$D$1,1,1)","v":42326.461507817949},"Sales Analyst","Analyst","India","India","4 to 6","4 to 6 hours a day","6-10 yrs","30-49.9K",5,6,4,2,2,3]
["ID1879","2012-06-16T17:49:27","3.5 lac",350000,"INR",6232.7708406048987,17428.542973807391,{"$f":"OFFSET(F599,0,Brains!$D$1,1,1)","v":17428.542973807391},"Analyst","Analyst","India","India","4 to 6","4 to 6 hours a day","6-10 yrs","15-29.9K",5,6,4,2,2,2]
["ID1230","2012-05-29T01:50:01",300000,300000,"INR",5342.3750062327708,14938.751120406334,{"$f":"OFFSET(F600,0,Brains!$D$1,1,1)","v":14938.751120406334},"Finance Analyst","Analyst","India","India","4 to 6","4 to 6 hours a day","6-10 yrs","0-14.9K",5,6,4,2,2,1]
["ID1591","2012-06-01T14:50:41",4500,4500,"USD",4500,4500,{"$f":"OFFSET(F601,0,Brains!$D$1,1,1)","v":4500},"Assistant Manger Service Quality Assurance","Analyst","Pakistan","Pakistan","4 to 6","4 to 6 hours a day","6-10 yrs","0-14.9K",5,6,4,2,2,1]
["ID0850","2012-05-27T01:41:11","Rs. 10,00,000",1000000,"INR",17807.916687442568,49795.837068021116,{"$f":"OFFSET(F602,0,Brains!$D$1,1,1)","v":49795.837068021116},"HR Analyst","Analyst","India","India","4 to 6","4 to 6 hours a day","6-10 yrs","30-49.9K",5,6.5,4,2,2,3]
["ID1473","2012-05-30T16:55:51",118000,118000,"EUR",149907.13380100971,148231.52256385263,{"$f":"OFFSET(F603,0,Brains!$D$1,1,1)","v":148231.52256385263},"Support","Analyst","EU","Europe","4 to 6","4 to 6 hours a day","6-10 yrs","100-149.9K",5,7,4,2,2,6]
["ID1388","2012-05-29T21:48:13","60000 $",60000,"GBP",94570.696324037053,89020.771513353116,{"$f":"OFFSET(F604,0,Brains!$D$1,1,1)","v":89020.771513353116},"Analyst","Analyst","UK","UK","4 to 6","4 to 6 hours a day","6-10 yrs","75-99.9K",5,7,4,2,2,5]
["ID0743","2012-05-26T15:59:44","66000 â‚¬",66000,"EUR",83846.362973446114,82909.156688256553,{"$f":"OFFSET(F605,0,Brains!$D$1,1,1)","v":82909.156688256553},"Logistics Analyst","Analyst","germany","Germany","4 to 6","4 to 6 hours a day","6-10 yrs","75-99.9K",5,7,4,2,2,5]
["ID1582","2012-06-01T06:31:49",80000,80000,"CAD",78668.921842426149,64051.240992794228,{"$f":"OFFSET(F606,0,Brains!$D$1,1,1)","v":64051.240992794228},"Business Operations Analyst","Analyst","Canada","Canada","4 to 6","4 to 6 hours a day","6-10 yrs","50-74.9K",5,7,4,2,2,4]
["ID1396","2012-05-29T22:14:19",77500,77500,"USD",77500,77500,{"$f":"OFFSET(F607,0,Brains!$D$1,1,1)","v":77500},"Sr Financial Analyst","Analyst","USA","USA","4 to 6","4 to 6 hours a day","6-10 yrs","75-99.9K",5,7,4,2,2,5]
["ID1359","2012-05-29T19:01:48",75000,75000,"USD",75000,75000,{"$f":"OFFSET(F608,0,Brains!$D$1,1,1)","v":75000},"Financial Analyst","Analyst","USA","USA","4 to 6","4 to 6 hours a day","6-10 yrs","75-99.9K",5,7,4,2,2,5]
["ID1425","2012-05-30T01:25:17",50000,50000,"USD",50000,50000,{"$f":"OFFSET(F609,0,Brains!$D$1,1,1)","v":50000},"Digital Analyst","Analyst","USA","USA","4 to 6","4 to 6 hours a day","6-10 yrs","50-74.9K",5,7,4,2,2,4]
["ID1550","2012-05-31T19:51:29","Â£30000",30000,"GBP",47285.348162018527,44510.385756676558,{"$f":"OFFSET(F610,0,Brains!$D$1,1,1)","v":44510.385756676558},"Cost Analyst","Analyst","UK","UK","4 to 6","4 to 6 hours a day","6-10 yrs","30-49.9K",5,7,4,2,2,3]
["ID1276","2012-05-29T10:09:37",45000,45000,"USD",45000,45000,{"$f":"OFFSET(F611,0,Brains!$D$1,1,1)","v":45000},"Staff Assistant","Analyst","USA","USA","4 to 6","4 to 6 hours a day","6-10 yrs","30-49.9K",5,7,4,2,2,3]
["ID1304","2012-05-29T13:54:38","Rs 1500000",1500000,"INR",26711.875031163851,74693.75560203167,{"$f":"OFFSET(F612,0,Brains!$D$1,1,1)","v":74693.75560203167},"Analyst","Analyst","India","India","4 to 6","4 to 6 hours a day","6-10 yrs","50-74.9K",5,7,4,2,2,4]
["ID1068","2012-05-28T14:50:03",100000,1200000,"INR",21369.500024931083,59755.004481625336,{"$f":"OFFSET(F613,0,Brains!$D$1,1,1)","v":59755.004481625336},"executive","Analyst","India","India","4 to 6","4 to 6 hours a day","6-10 yrs","50-74.9K",5,7,4,2,2,4]
["ID1064","2012-05-28T14:43:40","1500 $",18000,"USD",18000,18000,{"$f":"OFFSET(F614,0,Brains!$D$1,1,1)","v":18000},"Analyst","Analyst","Poland","Poland","4 to 6","4 to 6 hours a day","6-10 yrs","15-29.9K",5,7,4,2,2,2]
["ID1000","2012-05-28T09:51:24","Rs. 500000",500000,"INR",8903.9583437212841,24897.918534010558,{"$f":"OFFSET(F615,0,Brains!$D$1,1,1)","v":24897.918534010558},"Business Analyst","Analyst","India","India","4 to 6","4 to 6 hours a day","6-10 yrs","15-29.9K",5,7,4,2,2,2]
["ID1450","2012-05-30T12:25:23",480000,480000,"INR",8547.8000099724322,23902.001792650135,{"$f":"OFFSET(F616,0,Brains!$D$1,1,1)","v":23902.001792650135},"Performance Analyst","Analyst","India","India","4 to 6","4 to 6 hours a day","6-10 yrs","15-29.9K",5,7,4,2,2,2]
["ID1195","2012-05-28T23:19:36","Rs 5,40,000",540000,"INR",9616.275011218986,26889.7520167314,{"$f":"OFFSET(F617,0,Brains!$D$1,1,1)","v":26889.7520167314},"Business Analyst - Solutions","Analyst","India","India","4 to 6","4 to 6 hours a day","6-10 yrs","15-29.9K",5,7.9,4,2,2,2]
["ID1906","2012-06-19T19:33:25",74000,74000,"AUD",75473.31457379504,47073.791348600513,{"$f":"OFFSET(F618,0,Brains!$D$1,1,1)","v":47073.791348600513},"Systems Analyst","Analyst","Australia","Australia","4 to 6","4 to 6 hours a day","6-10 yrs","30-49.9K",5,8,4,2,2,3]
["ID1696","2012-06-05T21:59:40",65000,65000,"USD",65000,65000,{"$f":"OFFSET(F619,0,Brains!$D$1,1,1)","v":65000},"Business Analyst","Analyst","USA","USA","4 to 6","4 to 6 hours a day","6-10 yrs","50-74.9K",5,8,4,2,2,4]
["ID1312","2012-05-29T14:59:11","â‚¬ 48500",48500,"EUR",61614.372791092981,60925.668172430953,{"$f":"OFFSET(F620,0,Brains!$D$1,1,1)","v":60925.668172430953},"Information analyst","Analyst","Netherlands","Netherlands","4 to 6","4 to 6 hours a day","6-10 yrs","50-74.9K",5,8,4,2,2,4]
["ID1368","2012-05-29T19:39:35","4000000 JPY",4000000,"JPY",50694.322109187968,38498.55630413859,{"$f":"OFFSET(F621,0,Brains!$D$1,1,1)","v":38498.55630413859},"System Analyst (Configuration Mgmt)","Analyst","Japan","Japan","4 to 6","4 to 6 hours a day","6-10 yrs","30-49.9K",5,8,4,2,2,3]
["ID1921","2012-06-20T03:55:55",46000,46000,"USD",46000,46000,{"$f":"OFFSET(F622,0,Brains!$D$1,1,1)","v":46000},"Poultry Analyst","Analyst","USA","USA","4 to 6","4 to 6 hours a day","6-10 yrs","30-49.9K",5,8,4,2,2,3]
["ID1527","2012-05-31T06:23:55",45000,45000,"USD",45000,45000,{"$f":"OFFSET(F623,0,Brains!$D$1,1,1)","v":45000},"Business Analyst","Analyst","USA","USA","4 to 6","4 to 6 hours a day","6-10 yrs","30-49.9K",5,8,4,2,2,3]
["ID0590","2012-05-26T08:05:23",40414,40414,"USD",40414,40414,{"$f":"OFFSET(F624,0,Brains!$D$1,1,1)","v":40414},"Performance Improvement Analyst","Analyst","USA","USA","4 to 6","4 to 6 hours a day","6-10 yrs","30-49.9K",5,8,4,2,2,3]
["ID1566","2012-06-01T00:18:35","$40,000 USD",40000,"USD",40000,40000,{"$f":"OFFSET(F625,0,Brains!$D$1,1,1)","v":40000},"QA Data Analyst","Analyst","USA","USA","4 to 6","4 to 6 hours a day","6-10 yrs","30-49.9K",5,8,4,2,2,3]
["ID0578","2012-05-26T07:15:48","$22,000 AUD",22000,"AUD",22438.012440857987,13994.910941475828,{"$f":"OFFSET(F626,0,Brains!$D$1,1,1)","v":13994.910941475828},"Sales Analyst","Analyst","Australia","Australia","4 to 6","4 to 6 hours a day","6-10 yrs","0-14.9K",5,8,4,2,2,1]
["ID1670","2012-06-04T23:38:42","11000 USD",11000,"USD",11000,11000,{"$f":"OFFSET(F627,0,Brains!$D$1,1,1)","v":11000},"Dataminer","Analyst","Tunisia","Tunisia","4 to 6","4 to 6 hours a day","6-10 yrs","0-14.9K",5,8,4,2,2,1]
["ID1532","2012-05-31T10:29:42",500000,500000,"INR",8903.9583437212841,24897.918534010558,{"$f":"OFFSET(F628,0,Brains!$D$1,1,1)","v":24897.918534010558},"Developer","Analyst","India","India","4 to 6","4 to 6 hours a day","6-10 yrs","15-29.9K",5,8,4,2,2,2]
["ID1658","2012-06-04T12:58:06",300000,300000,"INR",5342.3750062327708,14938.751120406334,{"$f":"OFFSET(F629,0,Brains!$D$1,1,1)","v":14938.751120406334},"Store Inventory","Analyst","India","India","4 to 6","4 to 6 hours a day","6-10 yrs","0-14.9K",5,8,4,2,2,1]
["ID1698","2012-06-05T22:44:27",92000,92000,"USD",92000,92000,{"$f":"OFFSET(F630,0,Brains!$D$1,1,1)","v":92000},"Anallyst","Analyst","USA","USA","4 to 6","4 to 6 hours a day","6-10 yrs","75-99.9K",5,9,4,2,2,5]
["ID1483","2012-05-30T19:01:20",85000,85000,"USD",85000,85000,{"$f":"OFFSET(F631,0,Brains!$D$1,1,1)","v":85000},"sr analyst","Analyst","USA","USA","4 to 6","4 to 6 hours a day","6-10 yrs","75-99.9K",5,9,4,2,2,5]
["ID1654","2012-06-04T04:31:53",70000,70000,"USD",70000,70000,{"$f":"OFFSET(F632,0,Brains!$D$1,1,1)","v":70000},"Sr financial analyst","Analyst","USA","USA","4 to 6","4 to 6 hours a day","6-10 yrs","50-74.9K",5,9,4,2,2,4]
["ID1628","2012-06-02T20:52:59","37000GBP",37000,"GBP",58318.59606648951,54896.142433234418,{"$f":"OFFSET(F633,0,Brains!$D$1,1,1)","v":54896.142433234418},"Technical Web Analyst","Analyst","UK","UK","4 to 6","4 to 6 hours a day","6-10 yrs","50-74.9K",5,9,4,2,2,4]
["ID1182","2012-05-28T22:52:19","GBPÂ£32000",32000,"GBP",50437.70470615309,47477.744807121657,{"$f":"OFFSET(F634,0,Brains!$D$1,1,1)","v":47477.744807121657},"Performance Analyst","Analyst","Canada","Canada","4 to 6","4 to 6 hours a day","6-10 yrs","30-49.9K",5,9,4,2,2,3]
["ID0657","2012-05-26T12:25:09",21500,21500,"USD",21500,21500,{"$f":"OFFSET(F635,0,Brains!$D$1,1,1)","v":21500},"Asst Mgr","Analyst","India","India","4 to 6","4 to 6 hours a day","6-10 yrs","15-29.9K",5,9,4,2,2,2]
["ID1572","2012-06-01T02:46:21","Rs. 500000",500000,"INR",8903.9583437212841,24897.918534010558,{"$f":"OFFSET(F636,0,Brains!$D$1,1,1)","v":24897.918534010558},"Sr. Associate","Analyst","India","India","4 to 6","4 to 6 hours a day","6-10 yrs","15-29.9K",5,9,4,2,2,2]
["ID0873","2012-05-27T08:55:36",115000,115000,"USD",115000,115000,{"$f":"OFFSET(F637,0,Brains!$D$1,1,1)","v":115000},"Principal Financial Analyst","Analyst","USA","USA","4 to 6","4 to 6 hours a day","6-10 yrs","100-149.9K",5,10,4,2,2,6]
["ID1456","2012-05-30T13:31:35",86000,86000,"AUD",87712.230450626681,54707.37913486005,{"$f":"OFFSET(F638,0,Brains!$D$1,1,1)","v":54707.37913486005},"data analyst","Analyst","Australia","Australia","4 to 6","4 to 6 hours a day","6-10 yrs","50-74.9K",5,10,4,2,2,4]
["ID1559","2012-05-31T22:06:59",74000,74000,"CAD",72768.752704244194,59247.39791833466,{"$f":"OFFSET(F639,0,Brains!$D$1,1,1)","v":59247.39791833466},"Operations Analyst","Analyst","Canada","Canada","4 to 6","4 to 6 hours a day","6-10 yrs","50-74.9K",5,10,4,2,2,4]
["ID1932","2012-06-21T04:46:24",70000,70000,"USD",70000,70000,{"$f":"OFFSET(F640,0,Brains!$D$1,1,1)","v":70000},"Administrative Coordinator","Analyst","USA","USA","4 to 6","4 to 6 hours a day","6-10 yrs","50-74.9K",5,10,4,2,2,4]
["ID0962","2012-05-28T05:09:12","NZ$ 75000",75000,"NZD",59819.107020370408,43478.260869565216,{"$f":"OFFSET(F641,0,Brains!$D$1,1,1)","v":43478.260869565216},"Information Analyst","Analyst","New  Zealand","New Zealand","4 to 6","4 to 6 hours a day","6-10 yrs","30-49.9K",5,10,4,2,2,3]
["ID1153","2012-05-28T20:35:30","Â£35000",35000,"GBP",55166.239522354947,51928.783382789312,{"$f":"OFFSET(F642,0,Brains!$D$1,1,1)","v":51928.783382789312},"MI Analyst","Analyst","UK","UK","4 to 6","4 to 6 hours a day","6-10 yrs",{"$f":"IF(H642<15000,\"0-14.9K\",IF(H642<30000,\"15-29.9K\",IF(H642<50000,\"30-49.9K\",IF(H642<75000,\"50-74.9K\",IF(H642<100000,\"75-99.9K\",IF(H642<150000,\"100-149.9K\",IF(H642<250000,\"150-249.9K\",\"250K+\")))))))","v":"50-74.9K"},5,10,4,2,2,{"$f":"IF(H642<15000,1,IF(H642<30000,2,IF(H642<50000,3,IF(H642<75000,4,IF(H642<100000,5,IF(H642<150000,6,IF(H642<250000,7,8)))))))","v":4}]
["ID0857","2012-05-27T03:25:05",55000,55000,"USD",55000,55000,{"$f":"OFFSET(F643,0,Brains!$D$1,1,1)","v":55000},"Analyst","Analyst","USA","USA","4 to 6","4 to 6 hours a day","6-10 yrs","50-74.9K",5,10,4,2,2,4]
["ID1406","2012-05-29T23:08:45",49000,49000,"USD",49000,49000,{"$f":"OFFSET(F644,0,Brains!$D$1,1,1)","v":49000},"Research Analyst","Analyst","USA","USA","4 to 6","4 to 6 hours a day","6-10 yrs","30-49.9K",5,10,4,2,2,3]
["ID0731","2012-05-26T15:07:39",35000,35000,"USD",35000,35000,{"$f":"OFFSET(F645,0,Brains!$D$1,1,1)","v":35000},"Associate","Analyst","India","India","4 to 6","4 to 6 hours a day","6-10 yrs","30-49.9K",5,10,4,2,2,3]
["ID1829","2012-06-13T05:20:32","1600â‚¬ net monthly",19200,"EUR",24391.669228638868,24119.027400220089,{"$f":"OFFSET(F646,0,Brains!$D$1,1,1)","v":24119.027400220089},"bank clerk","Analyst","italy","Italy","4 to 6","4 to 6 hours a day","6-10 yrs","15-29.9K",5,10,4,2,2,2]
["ID0837","2012-05-26T23:38:24",1000000,1000000,"INR",17807.916687442568,49795.837068021116,{"$f":"OFFSET(F647,0,Brains!$D$1,1,1)","v":49795.837068021116},"business analyist","Analyst","India","India","4 to 6","4 to 6 hours a day","6-10 yrs","30-49.9K",5,10,4,2,2,3]
["ID1280","2012-05-29T10:48:33","USD 11800 (INR 650000)",11800,"USD",11800,11800,{"$f":"OFFSET(F648,0,Brains!$D$1,1,1)","v":11800},"Assistant Data Analyst","Analyst","India","India","4 to 6","4 to 6 hours a day","6-10 yrs","0-14.9K",5,10,4,2,2,1]
["ID1091","2012-05-28T15:51:32","50000 INR",600000,"INR",10684.750012465542,29877.502240812668,{"$f":"OFFSET(F649,0,Brains!$D$1,1,1)","v":29877.502240812668},"Sr.Supervisor","Analyst","India","India","4 to 6","4 to 6 hours a day","6-10 yrs","15-29.9K",5,10,4,2,2,2]
["ID0901","2012-05-27T15:01:02","PhP168000",168000,"PHP",3982.448779308334,6590.5613746028012,{"$f":"OFFSET(F650,0,Brains!$D$1,1,1)","v":6590.5613746028012},"Clerk","Analyst","Philippines","Philippines","4 to 6","4 to 6 hours a day","6-10 yrs","0-14.9K",5,10,4,2,2,1]
["ID1005","2012-05-28T10:27:48",180000,180000,"INR",3205.4250037396623,8963.2506722437993,{"$f":"OFFSET(F651,0,Brains!$D$1,1,1)","v":8963.2506722437993},"Audit executive","Analyst","INDIA","India","4 to 6","4 to 6 hours a day","6-10 yrs","0-14.9K",5,10,4,2,2,1]
["ID1395","2012-05-29T22:13:08",73500,73500,"USD",73500,73500,{"$f":"OFFSET(F652,0,Brains!$D$1,1,1)","v":73500},"Senior Underwriting Analyst","Analyst","USA","USA","All 8","All the 8 hours baby, all the 8!","6-10 yrs","50-74.9K",8,6,5,2,2,4]
["ID1287","2012-05-29T12:14:02",54000,54000,"USD",54000,54000,{"$f":"OFFSET(F653,0,Brains!$D$1,1,1)","v":54000},"Resource Planning Analyst","Analyst","USA","USA","All 8","All the 8 hours baby, all the 8!","6-10 yrs","50-74.9K",8,6,5,2,2,4]
["ID1708","2012-06-06T04:00:52",54000,54000,"USD",54000,54000,{"$f":"OFFSET(F654,0,Brains!$D$1,1,1)","v":54000},"Energy Analyst","Analyst","USA","USA","All 8","All the 8 hours baby, all the 8!","6-10 yrs","50-74.9K",8,6,5,2,2,4]
["ID0592","2012-05-26T08:08:43",120000,120000,"USD",120000,120000,{"$f":"OFFSET(F655,0,Brains!$D$1,1,1)","v":120000},"Sr. Analyst","Analyst","USA","USA","All 8","All the 8 hours baby, all the 8!","6-10 yrs","100-149.9K",8,7,5,2,2,6]
["ID1570","2012-06-01T01:47:43",15000,15000,"USD",15000,15000,{"$f":"OFFSET(F656,0,Brains!$D$1,1,1)","v":15000},"Application Developer","Analyst","USA","USA","All 8","All the 8 hours baby, all the 8!","6-10 yrs","15-29.9K",8,8,5,2,2,2]
["ID1744","2012-06-08T02:27:13",88000,88000,"USD",88000,88000,{"$f":"OFFSET(F657,0,Brains!$D$1,1,1)","v":88000},"Senior Fiancial Analyst","Analyst","USA","USA","All 8","All the 8 hours baby, all the 8!","6-10 yrs","75-99.9K",8,10,5,2,2,5]
["ID1490","2012-05-30T20:40:45",76000,76000,"USD",76000,76000,{"$f":"OFFSET(F658,0,Brains!$D$1,1,1)","v":76000},"Sr. Analyst","Analyst","USA","USA","All 8","All the 8 hours baby, all the 8!","6-10 yrs","75-99.9K",8,10,5,2,2,5]
["ID1432","2012-05-30T02:18:30",72000,72000,"USD",72000,72000,{"$f":"OFFSET(F659,0,Brains!$D$1,1,1)","v":72000},"sr. senior analyst","Analyst","USA","USA","All 8","All the 8 hours baby, all the 8!","6-10 yrs","50-74.9K",8,10,5,2,2,4]
["ID1806","2012-06-12T06:36:12",63000,63000,"USD",63000,63000,{"$f":"OFFSET(F660,0,Brains!$D$1,1,1)","v":63000},"Sales Analyst","Analyst","USA","USA","All 8","All the 8 hours baby, all the 8!","6-10 yrs","50-74.9K",8,10,5,2,2,4]
["ID1397","2012-05-29T22:18:48",60800,60800,"USD",60800,60800,{"$f":"OFFSET(F661,0,Brains!$D$1,1,1)","v":60800},"Data Integrity & Reporting Tool Analyst","Analyst","USA","USA","All 8","All the 8 hours baby, all the 8!","6-10 yrs","50-74.9K",8,10,5,2,2,4]
["ID1870","2012-06-15T23:21:00",60000,60000,"USD",60000,60000,{"$f":"OFFSET(F662,0,Brains!$D$1,1,1)","v":60000},"Marketing Initatities Analyst","Analyst","USA","USA","All 8","All the 8 hours baby, all the 8!","6-10 yrs","50-74.9K",8,10,5,2,2,4]
["ID1617","2012-06-02T06:21:45",32884.800000000003,32884,"USD",32884,32884,{"$f":"OFFSET(F663,0,Brains!$D$1,1,1)","v":32884},"Administrative Assistant","Analyst","USA","USA","All 8","All the 8 hours baby, all the 8!","6-10 yrs","30-49.9K",8,10,5,2,2,3]
["ID0553","2012-05-26T05:46:42",111000,111000,"USD",111000,111000,{"$f":"OFFSET(F664,0,Brains!$D$1,1,1)","v":111000},"Senior Financial Analyst","Analyst","Japan","Japan","All 8","All the 8 hours baby, all the 8!",null,"100-149.9K",8,null,5,null,2,6]
["ID0050","2012-05-25T06:04:57","100000 USD",100000,"USD",100000,100000,{"$f":"OFFSET(F665,0,Brains!$D$1,1,1)","v":100000},"Seinor Financial Analyst","Analyst","Germany","Germany","All 8","All the 8 hours baby, all the 8!",null,"100-149.9K",8,null,5,null,2,6]
["ID0260","2012-05-26T01:07:18","Â£60000",60000,"GBP",94570.696324037053,89020.771513353116,{"$f":"OFFSET(F666,0,Brains!$D$1,1,1)","v":89020.771513353116},"Decision Analyst & Modeller","Analyst","UK","UK","All 8","All the 8 hours baby, all the 8!",null,"75-99.9K",8,null,5,null,2,5]
["ID0426","2012-05-26T02:24:24",5900,70800,"EUR",89944.280280605832,88938.913538311579,{"$f":"OFFSET(F667,0,Brains!$D$1,1,1)","v":88938.913538311579},"Excel trainer","Analyst","Finland","Finland","All 8","All the 8 hours baby, all the 8!",null,"75-99.9K",8,null,5,null,2,5]
["ID0315","2012-05-26T01:26:26",60000,60000,"CAD",59001.691381819612,48038.430744595673,{"$f":"OFFSET(F668,0,Brains!$D$1,1,1)","v":48038.430744595673},"Sr. Business Analyst","Analyst","Canada","Canada","All 8","All the 8 hours baby, all the 8!",null,"30-49.9K",8,null,5,null,2,3]
["ID0033","2012-05-25T04:58:45","Â£35000",35000,"GBP",55166.239522354947,51928.783382789312,{"$f":"OFFSET(F669,0,Brains!$D$1,1,1)","v":51928.783382789312},"Management Information Analyst","Analyst","UK","UK","All 8","All the 8 hours baby, all the 8!",null,"50-74.9K",8,null,5,null,2,4]
["ID0062","2012-05-25T07:13:31",56000,56000,"CAD",55068.245289698301,44835.868694955956,{"$f":"OFFSET(F670,0,Brains!$D$1,1,1)","v":44835.868694955956},"Sales Analyst","Analyst","CANADA","Canada","All 8","All the 8 hours baby, all the 8!",null,"30-49.9K",8,null,5,null,2,3]
["ID0150","2012-05-26T00:44:23",50000,50000,"USD",50000,50000,{"$f":"OFFSET(F671,0,Brains!$D$1,1,1)","v":50000},"Business Operations Reporting Analyst","Analyst","Mexico","Mexico","All 8","All the 8 hours baby, all the 8!",null,"50-74.9K",8,null,5,null,2,4]
["ID0489","2012-05-26T03:32:53",46000,46000,"CAD",45234.630059395036,36829.463570856678,{"$f":"OFFSET(F672,0,Brains!$D$1,1,1)","v":36829.463570856678},"Sr. Marketing Solutions Analyst","Analyst","Canada","Canada","All 8","All the 8 hours baby, all the 8!",null,"30-49.9K",8,null,5,null,2,3]
["ID0131","2012-05-26T00:42:41",28159.200000000001,28159,"GBP",44383.603963142654,41778.931750741838,{"$f":"OFFSET(F673,0,Brains!$D$1,1,1)","v":41778.931750741838},"Data Analyst","Analyst","UK","UK","All 8","All the 8 hours baby, all the 8!",null,"30-49.9K",8,null,5,null,2,3]
["ID0262","2012-05-26T01:08:00",28000,28000,"GBP",44132.991617883956,41543.026706231452,{"$f":"OFFSET(F674,0,Brains!$D$1,1,1)","v":41543.026706231452},"Ops Adminstrator","Analyst","UK","UK","All 8","All the 8 hours baby, all the 8!",null,"30-49.9K",8,null,5,null,2,3]
["ID0006","2012-05-25T03:28:28",41731,41731,"USD",41731,41731,{"$f":"OFFSET(F675,0,Brains!$D$1,1,1)","v":41731},"Analyst","Analyst","Iceland","Iceland","All 8","All the 8 hours baby, all the 8!",null,"30-49.9K",8,null,5,null,2,3]
["ID0303","2012-05-26T01:22:40",42000,42000,"CAD",41301.183967273726,33626.901521216969,{"$f":"OFFSET(F676,0,Brains!$D$1,1,1)","v":33626.901521216969},"Financial Analyst","Analyst","Canada","Canada","All 8","All the 8 hours baby, all the 8!",null,"30-49.9K",8,null,5,null,2,3]
["ID0368","2012-05-26T01:50:00",35000,35000,"USD",35000,35000,{"$f":"OFFSET(F677,0,Brains!$D$1,1,1)","v":35000},"Senior Treasury Analyst","Analyst","Brasil","Brazil","All 8","All the 8 hours baby, all the 8!",null,"30-49.9K",8,null,5,null,2,3]
["ID0086","2012-05-26T00:11:21","US $ 31330.00",31330,"USD",31330,31330,{"$f":"OFFSET(F678,0,Brains!$D$1,1,1)","v":31330},"VBA Analyst","Analyst","Brazil","Brazil","All 8","All the 8 hours baby, all the 8!",null,"30-49.9K",8,null,5,null,2,3]
["ID0412","2012-05-26T02:14:05","Â¢ 14.000.000,00",14000000,"COSTARICAN",28109.627547434993,35591.712215584084,{"$f":"OFFSET(F679,0,Brains!$D$1,1,1)","v":35591.712215584084},"Businees Adminstratot","Analyst","Costa Rica","Costa Rica","All 8","All the 8 hours baby, all the 8!",null,"30-49.9K",8,null,5,null,2,3]
["ID0213","2012-05-26T00:54:46",27000,27000,"USD",27000,27000,{"$f":"OFFSET(F680,0,Brains!$D$1,1,1)","v":27000},"Innovation Analyst","Analyst","Singapore","Singapore","All 8","All the 8 hours baby, all the 8!",null,"15-29.9K",8,null,5,null,2,2]
["ID0081","2012-05-25T23:33:15",26000,26000,"USD",26000,26000,{"$f":"OFFSET(F681,0,Brains!$D$1,1,1)","v":26000},"Marketing Analyst","Analyst","Panama","Panama","All 8","All the 8 hours baby, all the 8!",null,"15-29.9K",8,null,5,null,2,2]
["ID0279","2012-05-26T01:12:41",20000,20000,"USD",20000,20000,{"$f":"OFFSET(F682,0,Brains!$D$1,1,1)","v":20000},"Analyst","Analyst","India","India","All 8","All the 8 hours baby, all the 8!",null,"15-29.9K",8,null,5,null,2,2]
["ID0507","2012-05-26T04:12:16","15000 â‚¬",15000,"EUR",19055.991584874118,18842.990156421944,{"$f":"OFFSET(F683,0,Brains!$D$1,1,1)","v":18842.990156421944},"Report Analyst","Analyst","Spain","Spain","All 8","All the 8 hours baby, all the 8!",null,"15-29.9K",8,null,5,null,2,2]
["ID0079","2012-05-25T23:20:46","Us$ 18000",18000,"USD",18000,18000,{"$f":"OFFSET(F684,0,Brains!$D$1,1,1)","v":18000},"Operational Analyst","Analyst","Saudi Arabia","Saudi Arabia","All 8","All the 8 hours baby, all the 8!",null,"15-29.9K",8,null,5,null,2,2]
["ID0013","2012-05-25T03:48:53","749000 INR",749000,"INR",13338.129598894484,37297.081963947814,{"$f":"OFFSET(F685,0,Brains!$D$1,1,1)","v":37297.081963947814},"Senion Analyst","Analyst","India","India","All 8","All the 8 hours baby, all the 8!",null,"30-49.9K",8,null,5,null,2,3]
["ID0008","2012-05-25T03:36:37",12000,12000,"USD",12000,12000,{"$f":"OFFSET(F686,0,Brains!$D$1,1,1)","v":12000},"Assistant SP&A","Analyst","Ukraine","Ukraine","All 8","All the 8 hours baby, all the 8!",null,"0-14.9K",8,null,5,null,2,1]
["ID0307","2012-05-26T01:23:21",12000,12000,"USD",12000,12000,{"$f":"OFFSET(F687,0,Brains!$D$1,1,1)","v":12000},"Analyst","Analyst","India","India","All 8","All the 8 hours baby, all the 8!",null,"0-14.9K",8,null,5,null,2,1]
["ID0476","2012-05-26T03:16:58",12000,12000,"USD",12000,12000,{"$f":"OFFSET(F688,0,Brains!$D$1,1,1)","v":12000},"Resource managment Analyst","Analyst","Estonia","Estonia","All 8","All the 8 hours baby, all the 8!",null,"0-14.9K",8,null,5,null,2,1]
["ID0511","2012-05-26T04:17:20",12000,12000,"USD",12000,12000,{"$f":"OFFSET(F689,0,Brains!$D$1,1,1)","v":12000},"Report Analyst","Analyst","Brazil","Brazil","All 8","All the 8 hours baby, all the 8!",null,"0-14.9K",8,null,5,null,2,1]
["ID0316","2012-05-26T01:26:37","150000 MXN",150000,"MXN",10956.982885192734,16744.809109176153,{"$f":"OFFSET(F690,0,Brains!$D$1,1,1)","v":16744.809109176153},"Information Analyst","Analyst","Mexico","Mexico","All 8","All the 8 hours baby, all the 8!",null,"15-29.9K",8,null,5,null,2,2]
["ID0548","2012-05-26T05:31:25","Rs. 500000",500000,"INR",8903.9583437212841,24897.918534010558,{"$f":"OFFSET(F691,0,Brains!$D$1,1,1)","v":24897.918534010558},"Research Associate","Analyst","India","India","All 8","All the 8 hours baby, all the 8!",null,"15-29.9K",8,null,5,null,2,2]
["ID0258","2012-05-26T01:06:38","Rs 470000",470000,"INR",8369.7208430980063,23404.043421969924,{"$f":"OFFSET(F692,0,Brains!$D$1,1,1)","v":23404.043421969924},"Web Statistics Analyst","Analyst","India","India","All 8","All the 8 hours baby, all the 8!",null,"15-29.9K",8,null,5,null,2,2]
["ID0455","2012-05-26T03:01:31","7500 USD",7500,"USD",7500,7500,{"$f":"OFFSET(F693,0,Brains!$D$1,1,1)","v":7500},"HR reporting analyst","Analyst","Romania","Romania","All 8","All the 8 hours baby, all the 8!",null,"0-14.9K",8,null,5,null,2,1]
["ID0352","2012-05-26T01:41:32","3,70,000",370000,"INR",6588.9291743537506,18424.45971516781,{"$f":"OFFSET(F694,0,Brains!$D$1,1,1)","v":18424.45971516781},"Senior Design Associate","Analyst","India","India","All 8","All the 8 hours baby, all the 8!",null,"15-29.9K",8,null,5,null,2,2]
["ID0267","2012-05-26T01:08:39","rs 2.76 lakhs per year",276000,"INR",4914.9850057341491,13743.651030773826,{"$f":"OFFSET(F695,0,Brains!$D$1,1,1)","v":13743.651030773826},"analyst","Analyst","India","India","All 8","All the 8 hours baby, all the 8!",null,"0-14.9K",8,null,5,null,2,1]
["ID0324","2012-05-26T01:29:32","US$ 4.545",4545,"USD",4545,4545,{"$f":"OFFSET(F696,0,Brains!$D$1,1,1)","v":4545},"Supply Processes Analyst","Analyst","Brasil","Brazil","All 8","All the 8 hours baby, all the 8!",null,"0-14.9K",8,null,5,null,2,1]
["ID0202","2012-05-26T00:53:18","INR 16000",192000,"INR",3419.1200039889732,9560.800717060054,{"$f":"OFFSET(F697,0,Brains!$D$1,1,1)","v":9560.800717060054},"Administrative","Analyst","India","India","All 8","All the 8 hours baby, all the 8!",null,"0-14.9K",8,null,5,null,2,1]
["ID0514","2012-05-26T04:20:17",78000,78000,"GBP",122941.90522124816,115727.00296735905,{"$f":"OFFSET(F698,0,Brains!$D$1,1,1)","v":115727.00296735905},"Associate","Analyst","UK","UK","1 or 2","1 or 2 hours a day",null,"100-149.9K",1.5,null,2,null,2,6]
["ID0435","2012-05-26T02:34:37",90000,90000,"USD",90000,90000,{"$f":"OFFSET(F699,0,Brains!$D$1,1,1)","v":90000},"senior analyst","Analyst","USA","USA","1 or 2","1 or 2 hours a day",null,"75-99.9K",1.5,null,2,null,2,5]
["ID0094","2012-05-26T00:40:00",75000,75000,"USD",75000,75000,{"$f":"OFFSET(F700,0,Brains!$D$1,1,1)","v":75000},"Data Analyst","Analyst","USA","USA","1 or 2","1 or 2 hours a day",null,"75-99.9K",1.5,null,2,null,2,5]
["ID0161","2012-05-26T00:46:00",75000,75000,"USD",75000,75000,{"$f":"OFFSET(F701,0,Brains!$D$1,1,1)","v":75000},"Program Analyst","Analyst","USA","USA","1 or 2","1 or 2 hours a day",null,"75-99.9K",1.5,null,2,null,2,5]
["ID0332","2012-05-26T01:32:08",61000,61000,"USD",61000,61000,{"$f":"OFFSET(F702,0,Brains!$D$1,1,1)","v":61000},"Data Analyst","Analyst","USA","USA","1 or 2","1 or 2 hours a day",null,"50-74.9K",1.5,null,2,null,2,4]
["ID0077","2012-05-25T23:15:34","US $60,000",60000,"USD",60000,60000,{"$f":"OFFSET(F703,0,Brains!$D$1,1,1)","v":60000},"Statistical Analyst","Analyst","Canada","Canada","1 or 2","1 or 2 hours a day",null,"50-74.9K",1.5,null,2,null,2,4]
["ID0066","2012-05-25T07:21:18","â‚¬ 38000",38000,"EUR",48275.178681681093,47735.57506293559,{"$f":"OFFSET(F704,0,Brains!$D$1,1,1)","v":47735.57506293559},"busines analist","Analyst","The Netherlands","Netherlands","1 or 2","1 or 2 hours a day",null,"30-49.9K",1.5,null,2,null,2,3]
["ID0383","2012-05-26T01:59:40",48000,48000,"USD",48000,48000,{"$f":"OFFSET(F705,0,Brains!$D$1,1,1)","v":48000},"Quality Analyst","Analyst","USA","USA","1 or 2","1 or 2 hours a day",null,"30-49.9K",1.5,null,2,null,2,3]
["ID0182","2012-05-26T00:50:11",41.405999999999999,41406,"USD",41406,41406,{"$f":"OFFSET(F706,0,Brains!$D$1,1,1)","v":41406},"Executive Assistant","Analyst","Canada","Canada","1 or 2","1 or 2 hours a day",null,{"$f":"IF(H706<15000,\"0-14.9K\",IF(H706<30000,\"15-29.9K\",IF(H706<50000,\"30-49.9K\",IF(H706<75000,\"50-74.9K\",IF(H706<100000,\"75-99.9K\",IF(H706<150000,\"100-149.9K\",IF(H706<250000,\"150-249.9K\",\"250K+\")))))))","v":"30-49.9K"},1.5,null,2,null,2,{"$f":"IF(H706<15000,1,IF(H706<30000,2,IF(H706<50000,3,IF(H706<75000,4,IF(H706<100000,5,IF(H706<150000,6,IF(H706<250000,7,8)))))))","v":3}]
["ID0124","2012-05-26T00:41:58",2300000,2300000,"INR",40958.208381117904,114530.42525644857,{"$f":"OFFSET(F707,0,Brains!$D$1,1,1)","v":114530.42525644857},"Analytics lead","Analyst","India","India","1 or 2","1 or 2 hours a day",null,"100-149.9K",1.5,null,2,null,2,6]
["ID0184","2012-05-26T00:50:31",40700,40700,"USD",40700,40700,{"$f":"OFFSET(F708,0,Brains!$D$1,1,1)","v":40700},"Sales Coordinator & Analytical Support","Analyst","USA","USA","1 or 2","1 or 2 hours a day",null,"30-49.9K",1.5,null,2,null,2,3]
["ID0103","2012-05-26T00:40:48",21000,21000,"USD",21000,21000,{"$f":"OFFSET(F709,0,Brains!$D$1,1,1)","v":21000},"IT support","Analyst","arabian Gulf","Arabian Gulf","1 or 2","1 or 2 hours a day",null,"15-29.9K",1.5,null,2,null,2,2]
["ID0282","2012-05-26T01:14:55",14000,14000,"USD",14000,14000,{"$f":"OFFSET(F710,0,Brains!$D$1,1,1)","v":14000},"Auxiliar Administrativo","Analyst","Brazil","Brazil","1 or 2","1 or 2 hours a day",null,"0-14.9K",1.5,null,2,null,2,1]
["ID0393","2012-05-26T02:01:31","7,50,000 INR",750000,"INR",13355.937515581925,37346.877801015835,{"$f":"OFFSET(F711,0,Brains!$D$1,1,1)","v":37346.877801015835},"Business Analyst","Analyst","India","India","1 or 2","1 or 2 hours a day",null,"30-49.9K",1.5,null,2,null,2,3]
["ID0436","2012-05-26T02:35:10",8500,8500,"USD",8500,8500,{"$f":"OFFSET(F712,0,Brains!$D$1,1,1)","v":8500},"Assesor","Analyst","Colombia","Colombia","1 or 2","1 or 2 hours a day",null,"0-14.9K",1.5,null,2,null,2,1]
["ID0230","2012-05-26T00:58:56",200000,200000,"INR",3561.5833374885137,9959.167413604222,{"$f":"OFFSET(F713,0,Brains!$D$1,1,1)","v":9959.167413604222},"medical biller","Analyst","India","India","1 or 2","1 or 2 hours a day",null,"0-14.9K",1.5,null,2,null,2,1]
["ID0078","2012-05-25T23:18:45",100000,100000,"GBP",157617.8272067284,148367.95252225519,{"$f":"OFFSET(F714,0,Brains!$D$1,1,1)","v":148367.95252225519},"Analyst","Analyst","UK","UK","2 to 3","2 to 3 hours per day",null,"100-149.9K",2.5,null,3,null,2,6]
["ID0181","2012-05-26T00:49:59",111680,111680,"USD",111680,111680,{"$f":"OFFSET(F715,0,Brains!$D$1,1,1)","v":111680},"Director of Analytics","Analyst","USA","USA","2 to 3","2 to 3 hours per day",null,"100-149.9K",2.5,null,3,null,2,6]
["ID0275","2012-05-26T01:10:55",99000,99000,"USD",99000,99000,{"$f":"OFFSET(F716,0,Brains!$D$1,1,1)","v":99000},"Business Analyst","Analyst","USA","USA","2 to 3","2 to 3 hours per day",null,"75-99.9K",2.5,null,3,null,2,5]
["ID0022","2012-05-25T04:24:12",96000,96000,"USD",96000,96000,{"$f":"OFFSET(F717,0,Brains!$D$1,1,1)","v":96000},"Analyst","Analyst","USA","USA","2 to 3","2 to 3 hours per day",null,"75-99.9K",2.5,null,3,null,2,5]
["ID0156","2012-05-26T00:45:17","90000 USD",90000,"USD",90000,90000,{"$f":"OFFSET(F718,0,Brains!$D$1,1,1)","v":90000},"Senior Data Quality Analyst","Analyst","USA","USA","2 to 3","2 to 3 hours per day",null,"75-99.9K",2.5,null,3,null,2,5]
["ID0068","2012-05-25T07:29:12",85087,85087,"USD",85087,85087,{"$f":"OFFSET(F719,0,Brains!$D$1,1,1)","v":85087},"Business Systems Analyst","Analyst","USA","USA","2 to 3","2 to 3 hours per day",null,"75-99.9K",2.5,null,3,null,2,5]
["ID0148","2012-05-26T00:44:20",80000,80000,"USD",80000,80000,{"$f":"OFFSET(F720,0,Brains!$D$1,1,1)","v":80000},"Informatics Research Analyst","Analyst","USA","USA","2 to 3","2 to 3 hours per day",null,"75-99.9K",2.5,null,3,null,2,5]
["ID0556","2012-05-26T05:50:21",77000,77000,"AUD",78533.043543002947,48982.188295165397,{"$f":"OFFSET(F721,0,Brains!$D$1,1,1)","v":48982.188295165397},"Intelligence Analyst","Analyst","Australia","Australia","2 to 3","2 to 3 hours per day",null,"30-49.9K",2.5,null,3,null,2,3]
["ID0432","2012-05-26T02:33:06",76600,76600,"USD",76600,76600,{"$f":"OFFSET(F722,0,Brains!$D$1,1,1)","v":76600},"Analyst","Analyst","USA","USA","2 to 3","2 to 3 hours per day",null,"75-99.9K",2.5,null,3,null,2,5]
["ID0438","2012-05-26T02:37:50",72000,72000,"USD",72000,72000,{"$f":"OFFSET(F723,0,Brains!$D$1,1,1)","v":72000},"Sr. Information Systems Analyst","Analyst","USA","USA","2 to 3","2 to 3 hours per day",null,"50-74.9K",2.5,null,3,null,2,4]
["ID0533","2012-05-26T05:13:03",72000,72000,"USD",72000,72000,{"$f":"OFFSET(F724,0,Brains!$D$1,1,1)","v":72000},"Analytical Department Director ","Analyst","Russia","Russia","2 to 3","2 to 3 hours per day",null,"50-74.9K",2.5,null,3,null,2,4]
["ID0317","2012-05-26T01:26:52",70000,70000,"USD",70000,70000,{"$f":"OFFSET(F725,0,Brains!$D$1,1,1)","v":70000},"Analyst","Analyst","USA","USA","2 to 3","2 to 3 hours per day",null,"50-74.9K",2.5,null,3,null,2,4]
["ID0108","2012-05-26T00:41:03",66000,66000,"USD",66000,66000,{"$f":"OFFSET(F726,0,Brains!$D$1,1,1)","v":66000},"Analyst","Analyst","USA","USA","2 to 3","2 to 3 hours per day",null,"50-74.9K",2.5,null,3,null,2,4]
["ID0488","2012-05-26T03:32:13",65000,65000,"USD",65000,65000,{"$f":"OFFSET(F727,0,Brains!$D$1,1,1)","v":65000},"Business Systems Analyst","Analyst","USA","USA","2 to 3","2 to 3 hours per day",null,"50-74.9K",2.5,null,3,null,2,4]
["ID0534","2012-05-26T05:15:54",60000,60000,"AUD",61194.579384158147,38167.938931297715,{"$f":"OFFSET(F728,0,Brains!$D$1,1,1)","v":38167.938931297715},"Analyst","Analyst","Australia","Australia","2 to 3","2 to 3 hours per day",null,"30-49.9K",2.5,null,3,null,2,3]
["ID0140","2012-05-26T00:43:34","$62,000 CND",62000,"CAD",60968.414427880263,49639.711769415524,{"$f":"OFFSET(F729,0,Brains!$D$1,1,1)","v":49639.711769415524},"Process Technician","Analyst","Canada","Canada","2 to 3","2 to 3 hours per day",null,"30-49.9K",2.5,null,3,null,2,3]
["ID0190","2012-05-26T00:51:00","60000 CAD$",60000,"CAD",59001.691381819612,48038.430744595673,{"$f":"OFFSET(F730,0,Brains!$D$1,1,1)","v":48038.430744595673},"Demographer","Analyst","Canada","Canada","2 to 3","2 to 3 hours per day",null,"30-49.9K",2.5,null,3,null,2,3]
["ID0490","2012-05-26T03:33:32",55000,55000,"USD",55000,55000,{"$f":"OFFSET(F731,0,Brains!$D$1,1,1)","v":55000},"Analyst","Analyst","USA","USA","2 to 3","2 to 3 hours per day",null,"50-74.9K",2.5,null,3,null,2,4]
["ID0547","2012-05-26T05:31:06",55000,55000,"USD",55000,55000,{"$f":"OFFSET(F732,0,Brains!$D$1,1,1)","v":55000},"Marketing","Analyst","USA","USA","2 to 3","2 to 3 hours per day",null,"50-74.9K",2.5,null,3,null,2,4]
["ID0133","2012-05-26T00:42:58",54000,54000,"USD",54000,54000,{"$f":"OFFSET(F733,0,Brains!$D$1,1,1)","v":54000},"Research Analyst","Analyst","USA","USA","2 to 3","2 to 3 hours per day",null,"50-74.9K",2.5,null,3,null,2,4]
["ID0462","2012-05-26T03:06:37",52000,52000,"USD",52000,52000,{"$f":"OFFSET(F734,0,Brains!$D$1,1,1)","v":52000},"Graphics/Web Document Designer","Analyst","USA","USA","2 to 3","2 to 3 hours per day",null,"50-74.9K",2.5,null,3,null,2,4]
["ID0259","2012-05-26T01:07:02",51000,51000,"USD",51000,51000,{"$f":"OFFSET(F735,0,Brains!$D$1,1,1)","v":51000},"Business Data Analyst I","Analyst","USA","USA","2 to 3","2 to 3 hours per day",null,"50-74.9K",2.5,null,3,null,2,4]
["ID0537","2012-05-26T05:20:43",50000,50000,"USD",50000,50000,{"$f":"OFFSET(F736,0,Brains!$D$1,1,1)","v":50000},"Research Assistant","Analyst","USA","USA","2 to 3","2 to 3 hours per day",null,"50-74.9K",2.5,null,3,null,2,4]
["ID0207","2012-05-26T00:54:12","Â£30000",30000,"GBP",47285.348162018527,44510.385756676558,{"$f":"OFFSET(F737,0,Brains!$D$1,1,1)","v":44510.385756676558},"Business Intelligence Analyst","Analyst","UK","UK","2 to 3","2 to 3 hours per day",null,"30-49.9K",2.5,null,3,null,2,3]
["ID0540","2012-05-26T05:27:14",46000,46000,"USD",46000,46000,{"$f":"OFFSET(F738,0,Brains!$D$1,1,1)","v":46000},"Research Analyst","Analyst","USA","USA","2 to 3","2 to 3 hours per day",null,"30-49.9K",2.5,null,3,null,2,3]
["ID0145","2012-05-26T00:44:09",45000,45000,"USD",45000,45000,{"$f":"OFFSET(F739,0,Brains!$D$1,1,1)","v":45000},"data analyst","Analyst","USA","USA","2 to 3","2 to 3 hours per day",null,"30-49.9K",2.5,null,3,null,2,3]
["ID0389","2012-05-26T02:00:42",44000,44000,"USD",44000,44000,{"$f":"OFFSET(F740,0,Brains!$D$1,1,1)","v":44000},"continuous improvement team member","Analyst","USA","USA","2 to 3","2 to 3 hours per day",null,"30-49.9K",2.5,null,3,null,2,3]
["ID0495","2012-05-26T03:40:26",40000,40000,"USD",40000,40000,{"$f":"OFFSET(F741,0,Brains!$D$1,1,1)","v":40000},"BAS","Analyst","USA","USA","2 to 3","2 to 3 hours per day",null,"30-49.9K",2.5,null,3,null,2,3]
["ID0558","2012-05-26T05:50:26",35000,35000,"USD",35000,35000,{"$f":"OFFSET(F742,0,Brains!$D$1,1,1)","v":35000},"Analyst","Analyst","USA","USA","2 to 3","2 to 3 hours per day",null,"30-49.9K",2.5,null,3,null,2,3]
["ID0035","2012-05-25T05:01:09","1600 $",19200,"USD",19200,19200,{"$f":"OFFSET(F743,0,Brains!$D$1,1,1)","v":19200},"Analyst","Analyst","Poland","Poland","2 to 3","2 to 3 hours per day",null,"15-29.9K",2.5,null,3,null,2,2]
["ID0398","2012-05-26T02:04:05","120000 BDT",1440000,"BDT",17598.017290051986,43937.267346067005,{"$f":"OFFSET(F744,0,Brains!$D$1,1,1)","v":43937.267346067005},"Computer Operator","Analyst","Bangladesh","Bangladesh","2 to 3","2 to 3 hours per day",null,"30-49.9K",2.5,null,3,null,2,3]
["ID0424","2012-05-26T02:20:22",12000,12000,"USD",12000,12000,{"$f":"OFFSET(F745,0,Brains!$D$1,1,1)","v":12000},"teacher","Analyst","iran","Iran","2 to 3","2 to 3 hours per day",null,"0-14.9K",2.5,null,3,null,2,1]
["ID0170","2012-05-26T00:48:11","Rs 5 lakh",500000,"INR",8903.9583437212841,24897.918534010558,{"$f":"OFFSET(F746,0,Brains!$D$1,1,1)","v":24897.918534010558},"QA Executive","Analyst","India","India","2 to 3","2 to 3 hours per day",null,"15-29.9K",2.5,null,3,null,2,2]
["ID0340","2012-05-26T01:35:18","30000 Rs",360000,"INR",6410.8500074793246,17926.501344487599,{"$f":"OFFSET(F747,0,Brains!$D$1,1,1)","v":17926.501344487599},"Business Analysit","Analyst","India","India","2 to 3","2 to 3 hours per day",null,"15-29.9K",2.5,null,3,null,2,2]
["ID0201","2012-05-26T00:53:02","Rs. 275000",275000,"INR",4897.177089046706,13693.855193705806,{"$f":"OFFSET(F748,0,Brains!$D$1,1,1)","v":13693.855193705806},"low level monitoring","Analyst","India","India","2 to 3","2 to 3 hours per day",null,"0-14.9K",2.5,null,3,null,2,1]
["ID0497","2012-05-26T03:49:21","200000 Rupees",200000,"INR",3561.5833374885137,9959.167413604222,{"$f":"OFFSET(F749,0,Brains!$D$1,1,1)","v":9959.167413604222},"chemist","Analyst","India","India","2 to 3","2 to 3 hours per day",null,"0-14.9K",2.5,null,3,null,2,1]
["ID0376","2012-05-26T01:54:28",9000000,9000000,"INR",160271.25018698312,448162.53361218999,{"$f":"OFFSET(F750,0,Brains!$D$1,1,1)","v":448162.53361218999},"Financial Analyst","Analyst","India","India","4 to 6","4 to 6 hours a day",null,"250K+",5,null,4,null,2,8]
["ID0323","2012-05-26T01:28:37",137500,137500,"USD",137500,137500,{"$f":"OFFSET(F751,0,Brains!$D$1,1,1)","v":137500},"director of analytics","Analyst","USA","USA","4 to 6","4 to 6 hours a day",null,"100-149.9K",5,null,4,null,2,6]
["ID0209","2012-05-26T00:54:16",108160,108160,"USD",108160,108160,{"$f":"OFFSET(F752,0,Brains!$D$1,1,1)","v":108160},"Sr. Financial Analyst","Analyst","USA","USA","4 to 6","4 to 6 hours a day",null,"100-149.9K",5,null,4,null,2,6]
["ID0525","2012-05-26T04:44:26",104000,104000,"USD",104000,104000,{"$f":"OFFSET(F753,0,Brains!$D$1,1,1)","v":104000},"Vice President, Analyst","Analyst","USA","USA","4 to 6","4 to 6 hours a day",null,"100-149.9K",5,null,4,null,2,6]
["ID0346","2012-05-26T01:38:51","100,000 US$ equiv",100000,"USD",100000,100000,{"$f":"OFFSET(F754,0,Brains!$D$1,1,1)","v":100000},"Senior Data Analyst","Analyst","UK","UK","4 to 6","4 to 6 hours a day",null,"100-149.9K",5,null,4,null,2,6]
["ID0505","2012-05-26T04:05:08",100000,100000,"USD",100000,100000,{"$f":"OFFSET(F755,0,Brains!$D$1,1,1)","v":100000},"Analyst","Analyst","USA","USA","4 to 6","4 to 6 hours a day",null,"100-149.9K",5,null,4,null,2,6]
["ID0152","2012-05-26T00:44:59",96000,96000,"USD",96000,96000,{"$f":"OFFSET(F756,0,Brains!$D$1,1,1)","v":96000},"Specialist - Finance Planning and Analysis","Analyst","USA","USA","4 to 6","4 to 6 hours a day",null,"75-99.9K",5,null,4,null,2,5]
["ID0344","2012-05-26T01:38:06",95000,95000,"USD",95000,95000,{"$f":"OFFSET(F757,0,Brains!$D$1,1,1)","v":95000},"Senior Financial Analyst","Analyst","USA","USA","4 to 6","4 to 6 hours a day",null,"75-99.9K",5,null,4,null,2,5]
["ID0146","2012-05-26T00:44:15",92000,92000,"USD",92000,92000,{"$f":"OFFSET(F758,0,Brains!$D$1,1,1)","v":92000},"Senior Financial & Systems Analyst","Analyst","USA","USA","4 to 6","4 to 6 hours a day",null,"75-99.9K",5,null,4,null,2,5]
["ID0171","2012-05-26T00:48:46",90000,90000,"CAD",88502.537072729421,72057.646116893506,{"$f":"OFFSET(F759,0,Brains!$D$1,1,1)","v":72057.646116893506},"Senior Actuarial Analyst","Analyst","Canada","Canada","4 to 6","4 to 6 hours a day",null,"50-74.9K",5,null,4,null,2,4]
["ID0543","2012-05-26T05:28:46",85000,85000,"AUD",86692.320794224041,54071.246819338427,{"$f":"OFFSET(F760,0,Brains!$D$1,1,1)","v":54071.246819338427},"Business analyst","Analyst","Australia","Australia","4 to 6","4 to 6 hours a day",null,"50-74.9K",5,null,4,null,2,4]
["ID0111","2012-05-26T00:41:16","$85,000+",85000,"USD",85000,85000,{"$f":"OFFSET(F761,0,Brains!$D$1,1,1)","v":85000},"Strategic Analyst","Analyst","USA","USA","4 to 6","4 to 6 hours a day",null,"75-99.9K",5,null,4,null,2,5]
["ID0365","2012-05-26T01:49:19",85000,85000,"USD",85000,85000,{"$f":"OFFSET(F762,0,Brains!$D$1,1,1)","v":85000},"Sr. Financial Analyst","Analyst","USA","USA","4 to 6","4 to 6 hours a day",null,"75-99.9K",5,null,4,null,2,5]
["ID0101","2012-05-26T00:40:42","80k",80000,"USD",80000,80000,{"$f":"OFFSET(F763,0,Brains!$D$1,1,1)","v":80000},"financial analyst","Analyst","USA","USA","4 to 6","4 to 6 hours a day",null,"75-99.9K",5,null,4,null,2,5]
["ID0125","2012-05-26T00:42:00",80000,80000,"USD",80000,80000,{"$f":"OFFSET(F764,0,Brains!$D$1,1,1)","v":80000},"Financial Analyst","Analyst","USA","USA","4 to 6","4 to 6 hours a day",null,"75-99.9K",5,null,4,null,2,5]
["ID0217","2012-05-26T00:56:06",80000,80000,"USD",80000,80000,{"$f":"OFFSET(F765,0,Brains!$D$1,1,1)","v":80000},"Marketing Analyst","Analyst","USA","USA","4 to 6","4 to 6 hours a day",null,"75-99.9K",5,null,4,null,2,5]
["ID0226","2012-05-26T00:58:05",80000,80000,"USD",80000,80000,{"$f":"OFFSET(F766,0,Brains!$D$1,1,1)","v":80000},"Senior Analyst","Analyst","USA","USA","4 to 6","4 to 6 hours a day",null,"75-99.9K",5,null,4,null,2,5]
["ID0247","2012-05-26T01:03:52",80000,80000,"USD",80000,80000,{"$f":"OFFSET(F767,0,Brains!$D$1,1,1)","v":80000},"Analyst","Analyst","USA","USA","4 to 6","4 to 6 hours a day",null,"75-99.9K",5,null,4,null,2,5]
["ID0444","2012-05-26T02:46:18",80000,80000,"USD",80000,80000,{"$f":"OFFSET(F768,0,Brains!$D$1,1,1)","v":80000},"web analyst","Analyst","USA","USA","4 to 6","4 to 6 hours a day",null,"75-99.9K",5,null,4,null,2,5]
["ID0378","2012-05-26T01:57:23",80000,80000,"CAD",78668.921842426149,64051.240992794228,{"$f":"OFFSET(F769,0,Brains!$D$1,1,1)","v":64051.240992794228},"Senior Business Analyst","Analyst","Canada","Canada","4 to 6","4 to 6 hours a day",null,"50-74.9K",5,null,4,null,2,4]
["ID0277","2012-05-26T01:11:12",75000,75000,"USD",75000,75000,{"$f":"OFFSET(F770,0,Brains!$D$1,1,1)","v":75000},"financial analyst","Analyst","USA","USA","4 to 6","4 to 6 hours a day",null,{"$f":"IF(H770<15000,\"0-14.9K\",IF(H770<30000,\"15-29.9K\",IF(H770<50000,\"30-49.9K\",IF(H770<75000,\"50-74.9K\",IF(H770<100000,\"75-99.9K\",IF(H770<150000,\"100-149.9K\",IF(H770<250000,\"150-249.9K\",\"250K+\")))))))","v":"75-99.9K"},5,null,4,null,2,{"$f":"IF(H770<15000,1,IF(H770<30000,2,IF(H770<50000,3,IF(H770<75000,4,IF(H770<100000,5,IF(H770<150000,6,IF(H770<250000,7,8)))))))","v":5}]
["ID0300","2012-05-26T01:21:06",75000,75000,"USD",75000,75000,{"$f":"OFFSET(F771,0,Brains!$D$1,1,1)","v":75000},"FA","Analyst","USA","USA","4 to 6","4 to 6 hours a day",null,"75-99.9K",5,null,4,null,2,5]
["ID0437","2012-05-26T02:35:11",75000,75000,"USD",75000,75000,{"$f":"OFFSET(F772,0,Brains!$D$1,1,1)","v":75000},"Financial Analys","Analyst","USA","USA","4 to 6","4 to 6 hours a day",null,"75-99.9K",5,null,4,null,2,5]
["ID0357","2012-05-26T01:42:31",75000,75000,"CAD",73752.11422727452,60048.038430744586,{"$f":"OFFSET(F773,0,Brains!$D$1,1,1)","v":60048.038430744586},"web marketing analyst","Analyst","canada","Canada","4 to 6","4 to 6 hours a day",null,"50-74.9K",5,null,4,null,2,4]
["ID0241","2012-05-26T01:02:21",73000,73000,"USD",73000,73000,{"$f":"OFFSET(F774,0,Brains!$D$1,1,1)","v":73000},"Financial Analyst","Analyst","USA","USA","4 to 6","4 to 6 hours a day",null,"50-74.9K",5,null,4,null,2,4]
["ID0135","2012-05-26T00:43:07",71000,71000,"USD",71000,71000,{"$f":"OFFSET(F775,0,Brains!$D$1,1,1)","v":71000},"Market Research Analyst","Analyst","USA","USA","4 to 6","4 to 6 hours a day",null,"50-74.9K",5,null,4,null,2,4]
["ID0196","2012-05-26T00:52:25",70000,70000,"USD",70000,70000,{"$f":"OFFSET(F776,0,Brains!$D$1,1,1)","v":70000},"Sr Financial Analyst","Analyst","USA","USA","4 to 6","4 to 6 hours a day",null,"50-74.9K",5,null,4,null,2,4]
["ID0472","2012-05-26T03:15:04",70000,70000,"USD",70000,70000,{"$f":"OFFSET(F777,0,Brains!$D$1,1,1)","v":70000},"Analyst","Analyst","USA","USA","4 to 6","4 to 6 hours a day",null,"50-74.9K",5,null,4,null,2,4]
["ID0501","2012-05-26T04:00:21",68500,68500,"CAD",67360.264327577388,54843.875100080055,{"$f":"OFFSET(F778,0,Brains!$D$1,1,1)","v":54843.875100080055},"Financial Analyst","Analyst","Canada","Canada","4 to 6","4 to 6 hours a day",null,"50-74.9K",5,null,4,null,2,4]
["ID0116","2012-05-26T00:41:32",67000,67000,"USD",67000,67000,{"$f":"OFFSET(F779,0,Brains!$D$1,1,1)","v":67000},"Operations Cost Analyst","Analyst","USA","USA","4 to 6","4 to 6 hours a day",null,"50-74.9K",5,null,4,null,2,4]
["ID0174","2012-05-26T00:48:48",67000,67000,"USD",67000,67000,{"$f":"OFFSET(F780,0,Brains!$D$1,1,1)","v":67000},"B.I. Data Analyst II","Analyst","USA","USA","4 to 6","4 to 6 hours a day",null,"50-74.9K",5,null,4,null,2,4]
["ID0195","2012-05-26T00:52:21",67000,67000,"USD",67000,67000,{"$f":"OFFSET(F781,0,Brains!$D$1,1,1)","v":67000},"Financial Analyst","Analyst","USA","USA","4 to 6","4 to 6 hours a day",null,"50-74.9K",5,null,4,null,2,4]
["ID0306","2012-05-26T01:22:56",67000,67000,"USD",67000,67000,{"$f":"OFFSET(F782,0,Brains!$D$1,1,1)","v":67000},"HR Analyst","Analyst","USA","USA","4 to 6","4 to 6 hours a day",null,"50-74.9K",5,null,4,null,2,4]
["ID0552","2012-05-26T05:46:02",67000,67000,"USD",67000,67000,{"$f":"OFFSET(F783,0,Brains!$D$1,1,1)","v":67000},"Management Analyst","Analyst","USA","USA","4 to 6","4 to 6 hours a day",null,"50-74.9K",5,null,4,null,2,4]
["ID0292","2012-05-26T01:18:49",65000,65000,"USD",65000,65000,{"$f":"OFFSET(F784,0,Brains!$D$1,1,1)","v":65000},"Software Support","Analyst","USA","USA","4 to 6","4 to 6 hours a day",null,"50-74.9K",5,null,4,null,2,4]
["ID0439","2012-05-26T02:38:34",65000,65000,"USD",65000,65000,{"$f":"OFFSET(F785,0,Brains!$D$1,1,1)","v":65000},"Senior Claims Analyst","Analyst","USA","USA","4 to 6","4 to 6 hours a day",null,"50-74.9K",5,null,4,null,2,4]
["ID0208","2012-05-26T00:54:14","â‚¬ 50000",50000,"EUR",63519.971949580387,62809.967188073148,{"$f":"OFFSET(F786,0,Brains!$D$1,1,1)","v":62809.967188073148},"Data Analyst","Analyst","Ireland","Ireland","4 to 6","4 to 6 hours a day",null,"50-74.9K",5,null,4,null,2,4]
["ID0055","2012-05-25T06:15:42",62000,62000,"USD",62000,62000,{"$f":"OFFSET(F787,0,Brains!$D$1,1,1)","v":62000},"Analyst","Analyst","USA","USA","4 to 6","4 to 6 hours a day",null,"50-74.9K",5,null,4,null,2,4]
["ID0164","2012-05-26T00:47:42",60000,60000,"USD",60000,60000,{"$f":"OFFSET(F788,0,Brains!$D$1,1,1)","v":60000},"Telecom Technician","Analyst","USA","USA","4 to 6","4 to 6 hours a day",null,"50-74.9K",5,null,4,null,2,4]
["ID0193","2012-05-26T00:51:55",60000,60000,"USD",60000,60000,{"$f":"OFFSET(F789,0,Brains!$D$1,1,1)","v":60000},"Accounting/Financial Analyst","Analyst","USA","USA","4 to 6","4 to 6 hours a day",null,"50-74.9K",5,null,4,null,2,4]
["ID0236","2012-05-26T01:01:32",60000,60000,"USD",60000,60000,{"$f":"OFFSET(F790,0,Brains!$D$1,1,1)","v":60000},"Energy Analyst","Analyst","USA","USA","4 to 6","4 to 6 hours a day",null,"50-74.9K",5,null,4,null,2,4]
["ID0320","2012-05-26T01:27:29",60000,60000,"USD",60000,60000,{"$f":"OFFSET(F791,0,Brains!$D$1,1,1)","v":60000},"Management Analyst","Analyst","USA","USA","4 to 6","4 to 6 hours a day",null,"50-74.9K",5,null,4,null,2,4]
["ID0410","2012-05-26T02:12:58",60000,60000,"USD",60000,60000,{"$f":"OFFSET(F792,0,Brains!$D$1,1,1)","v":60000},"Sr financial analyst ","Analyst","USA","USA","4 to 6","4 to 6 hours a day",null,"50-74.9K",5,null,4,null,2,4]
["ID0107","2012-05-26T00:41:02",57400,57400,"USD",57400,57400,{"$f":"OFFSET(F793,0,Brains!$D$1,1,1)","v":57400},"IT Analyst","Analyst","USA","USA","4 to 6","4 to 6 hours a day",null,"50-74.9K",5,null,4,null,2,4]
["ID0071","2012-05-25T22:49:00",57000,57000,"USD",57000,57000,{"$f":"OFFSET(F794,0,Brains!$D$1,1,1)","v":57000},"sales analyst","Analyst","USA","USA","4 to 6","4 to 6 hours a day",null,"50-74.9K",5,null,4,null,2,4]
["ID0118","2012-05-26T00:41:35",56160,56160,"USD",56160,56160,{"$f":"OFFSET(F795,0,Brains!$D$1,1,1)","v":56160},"Utilization Analyst","Analyst","USA","USA","4 to 6","4 to 6 hours a day",null,"50-74.9K",5,null,4,null,2,4]
["ID0413","2012-05-26T02:14:29",56000,56000,"USD",56000,56000,{"$f":"OFFSET(F796,0,Brains!$D$1,1,1)","v":56000},"Staff assistant ","Analyst","USA","USA","4 to 6","4 to 6 hours a day",null,"50-74.9K",5,null,4,null,2,4]
["ID0349","2012-05-26T01:40:18",56000,56000,"CAD",55068.245289698301,44835.868694955956,{"$f":"OFFSET(F797,0,Brains!$D$1,1,1)","v":44835.868694955956},"Online Analyst","Analyst","Canada","Canada","4 to 6","4 to 6 hours a day",null,"30-49.9K",5,null,4,null,2,3]
["ID0319","2012-05-26T01:27:26",55,55000,"USD",55000,55000,{"$f":"OFFSET(F798,0,Brains!$D$1,1,1)","v":55000},"Business Analyst","Analyst","USA","USA","4 to 6","4 to 6 hours a day",null,"50-74.9K",5,null,4,null,2,4]
["ID0517","2012-05-26T04:27:12",54000,54000,"USD",54000,54000,{"$f":"OFFSET(F799,0,Brains!$D$1,1,1)","v":54000},"Business Analyst","Analyst","USA","USA","4 to 6","4 to 6 hours a day",null,"50-74.9K",5,null,4,null,2,4]
["ID0142","2012-05-26T00:43:36",53000,53000,"USD",53000,53000,{"$f":"OFFSET(F800,0,Brains!$D$1,1,1)","v":53000},"Data Analyst","Analyst","USA","USA","4 to 6","4 to 6 hours a day",null,"50-74.9K",5,null,4,null,2,4]
["ID0304","2012-05-26T01:22:45",53000,53000,"USD",53000,53000,{"$f":"OFFSET(F801,0,Brains!$D$1,1,1)","v":53000},"Data Analyst","Analyst","USA","USA","4 to 6","4 to 6 hours a day",null,"50-74.9K",5,null,4,null,2,4]
["ID0234","2012-05-26T01:00:51","52500.00 USD",52500,"USD",52500,52500,{"$f":"OFFSET(F802,0,Brains!$D$1,1,1)","v":52500},"HRIS Analyst","Analyst","USA","USA","4 to 6","4 to 6 hours a day",null,"50-74.9K",5,null,4,null,2,4]
["ID0253","2012-05-26T01:05:18",52500,52500,"USD",52500,52500,{"$f":"OFFSET(F803,0,Brains!$D$1,1,1)","v":52500},"Analyst","Analyst","USA","USA","4 to 6","4 to 6 hours a day",null,"50-74.9K",5,null,4,null,2,4]
["ID0405","2012-05-26T02:07:49",52000,52000,"USD",52000,52000,{"$f":"OFFSET(F804,0,Brains!$D$1,1,1)","v":52000},"Data Analyst","Analyst","USA","USA","4 to 6","4 to 6 hours a day",null,"50-74.9K",5,null,4,null,2,4]
["ID0481","2012-05-26T03:22:33",52000,52000,"USD",52000,52000,{"$f":"OFFSET(F805,0,Brains!$D$1,1,1)","v":52000},"budget analyst","Analyst","USA","USA","4 to 6","4 to 6 hours a day",null,"50-74.9K",5,null,4,null,2,4]
["ID0047","2012-05-25T05:47:10",32000,32000,"GBP",50437.70470615309,47477.744807121657,{"$f":"OFFSET(F806,0,Brains!$D$1,1,1)","v":47477.744807121657},"Senior intelligence analyst","Analyst","UK","UK","4 to 6","4 to 6 hours a day",null,"30-49.9K",5,null,4,null,2,3]
["ID0451","2012-05-26T02:55:27",50000,50000,"USD",50000,50000,{"$f":"OFFSET(F807,0,Brains!$D$1,1,1)","v":50000},"Wine Analyst","Analyst","USA","USA","4 to 6","4 to 6 hours a day",null,"50-74.9K",5,null,4,null,2,4]
["ID0471","2012-05-26T03:15:01",50000,50000,"USD",50000,50000,{"$f":"OFFSET(F808,0,Brains!$D$1,1,1)","v":50000},"Researcher & Data Analyst","Analyst","USA","USA","4 to 6","4 to 6 hours a day",null,"50-74.9K",5,null,4,null,2,4]
["ID0487","2012-05-26T03:31:34",50000,50000,"USD",50000,50000,{"$f":"OFFSET(F809,0,Brains!$D$1,1,1)","v":50000},"Workforce Analyst","Analyst","USA","USA","4 to 6","4 to 6 hours a day",null,"50-74.9K",5,null,4,null,2,4]
["ID0539","2012-05-26T05:24:16",50000,50000,"USD",50000,50000,{"$f":"OFFSET(F810,0,Brains!$D$1,1,1)","v":50000},"Excel professional","Analyst","self-employed","USA","4 to 6","4 to 6 hours a day",null,"50-74.9K",5,null,4,null,2,4]
["ID0251","2012-05-26T01:04:50",47700,47700,"USD",47700,47700,{"$f":"OFFSET(F811,0,Brains!$D$1,1,1)","v":47700},"Customer Operations Analyst","Analyst","USA","USA","4 to 6","4 to 6 hours a day",null,"30-49.9K",5,null,4,null,2,3]
["ID0173","2012-05-26T00:48:48",46584,46584,"USD",46584,46584,{"$f":"OFFSET(F812,0,Brains!$D$1,1,1)","v":46584},"Budget Analyst","Analyst","USA","USA","4 to 6","4 to 6 hours a day",null,"30-49.9K",5,null,4,null,2,3]
["ID0384","2012-05-26T01:59:45","46000 usd",46000,"USD",46000,46000,{"$f":"OFFSET(F813,0,Brains!$D$1,1,1)","v":46000},"Financial analyst","Analyst","USA","USA","4 to 6","4 to 6 hours a day",null,"30-49.9K",5,null,4,null,2,3]
["ID0325","2012-05-26T01:29:37","Â£29000",29000,"GBP",45709.169889951241,43026.706231454002,{"$f":"OFFSET(F814,0,Brains!$D$1,1,1)","v":43026.706231454002},"ICT Technical Analyst","Analyst","UK","UK","4 to 6","4 to 6 hours a day",null,"30-49.9K",5,null,4,null,2,3]
["ID0132","2012-05-26T00:42:46",45000,45000,"USD",45000,45000,{"$f":"OFFSET(F815,0,Brains!$D$1,1,1)","v":45000},"DBA","Analyst","USA","USA","4 to 6","4 to 6 hours a day",null,"30-49.9K",5,null,4,null,2,3]
["ID0296","2012-05-26T01:19:22",45000,45000,"USD",45000,45000,{"$f":"OFFSET(F816,0,Brains!$D$1,1,1)","v":45000},"sales support","Analyst","USA","USA","4 to 6","4 to 6 hours a day",null,"30-49.9K",5,null,4,null,2,3]
["ID0463","2012-05-26T03:07:46",45000,45000,"USD",45000,45000,{"$f":"OFFSET(F817,0,Brains!$D$1,1,1)","v":45000},"Analyst","Analyst","USA","USA","4 to 6","4 to 6 hours a day",null,"30-49.9K",5,null,4,null,2,3]
["ID0216","2012-05-26T00:55:50",42140,42140,"USD",42140,42140,{"$f":"OFFSET(F818,0,Brains!$D$1,1,1)","v":42140},"Information Analyst II","Analyst","USA","USA","4 to 6","4 to 6 hours a day",null,"30-49.9K",5,null,4,null,2,3]
["ID0090","2012-05-26T00:39:28",42000,42000,"CAD",41301.183967273726,33626.901521216969,{"$f":"OFFSET(F819,0,Brains!$D$1,1,1)","v":33626.901521216969},"IT Asset Administrator","Analyst","Canada","Canada","4 to 6","4 to 6 hours a day",null,"30-49.9K",5,null,4,null,2,3]
["ID0312","2012-05-26T01:25:05",41000,41000,"USD",41000,41000,{"$f":"OFFSET(F820,0,Brains!$D$1,1,1)","v":41000},"Operations Analyst","Analyst","USA","USA","4 to 6","4 to 6 hours a day",null,"30-49.9K",5,null,4,null,2,3]
["ID0089","2012-05-26T00:39:04",40000,40000,"USD",40000,40000,{"$f":"OFFSET(F821,0,Brains!$D$1,1,1)","v":40000},"Admin","Analyst","USA","USA","4 to 6","4 to 6 hours a day",null,"30-49.9K",5,null,4,null,2,3]
["ID0098","2012-05-26T00:40:39",40000,40000,"USD",40000,40000,{"$f":"OFFSET(F822,0,Brains!$D$1,1,1)","v":40000},"Sales and Marketing Analyst ","Analyst","USA","USA","4 to 6","4 to 6 hours a day",null,"30-49.9K",5,null,4,null,2,3]
["ID0139","2012-05-26T00:43:27",40000,40000,"USD",40000,40000,{"$f":"OFFSET(F823,0,Brains!$D$1,1,1)","v":40000},"Business Analyst","Analyst","USA","USA","4 to 6","4 to 6 hours a day",null,"30-49.9K",5,null,4,null,2,3]
["ID0185","2012-05-26T00:50:32",40000,40000,"USD",40000,40000,{"$f":"OFFSET(F824,0,Brains!$D$1,1,1)","v":40000},"analyst","Analyst","USA","USA","4 to 6","4 to 6 hours a day",null,"30-49.9K",5,null,4,null,2,3]
["ID0272","2012-05-26T01:09:56",40000,40000,"USD",40000,40000,{"$f":"OFFSET(F825,0,Brains!$D$1,1,1)","v":40000},"Analyst 2","Analyst","USA","USA","4 to 6","4 to 6 hours a day",null,"30-49.9K",5,null,4,null,2,3]
["ID0464","2012-05-26T03:08:28",25000,25000,"GBP",39404.456801682099,37091.988130563797,{"$f":"OFFSET(F826,0,Brains!$D$1,1,1)","v":37091.988130563797},"Analyst","Analyst","UK","UK","4 to 6","4 to 6 hours a day",null,"30-49.9K",5,null,4,null,2,3]
["ID0059","2012-05-25T06:57:52",38000,38000,"USD",38000,38000,{"$f":"OFFSET(F827,0,Brains!$D$1,1,1)","v":38000},"Senior Analyst","Analyst","USA","USA","4 to 6","4 to 6 hours a day",null,"30-49.9K",5,null,4,null,2,3]
["ID0106","2012-05-26T00:40:57",36000,36000,"USD",36000,36000,{"$f":"OFFSET(F828,0,Brains!$D$1,1,1)","v":36000},"Analyst","Analyst","USA","USA","4 to 6","4 to 6 hours a day",null,"30-49.9K",5,null,4,null,2,3]
["ID0416","2012-05-26T02:17:01",35000,35000,"USD",35000,35000,{"$f":"OFFSET(F829,0,Brains!$D$1,1,1)","v":35000},"Credit Analyst","Analyst","Russia","Russia","4 to 6","4 to 6 hours a day",null,"30-49.9K",5,null,4,null,2,3]
["ID0404","2012-05-26T02:07:28",34000,34000,"USD",34000,34000,{"$f":"OFFSET(F830,0,Brains!$D$1,1,1)","v":34000},"Information Research Technician II","Analyst","USA","USA","4 to 6","4 to 6 hours a day",null,"30-49.9K",5,null,4,null,2,3]
["ID0255","2012-05-26T01:06:02","$31,000 USD",31000,"USD",31000,31000,{"$f":"OFFSET(F831,0,Brains!$D$1,1,1)","v":31000},"Site Technician","Analyst","USA","USA","4 to 6","4 to 6 hours a day",null,"30-49.9K",5,null,4,null,2,3]
["ID0192","2012-05-26T00:51:43",28000,28000,"USD",28000,28000,{"$f":"OFFSET(F832,0,Brains!$D$1,1,1)","v":28000},"Administrative Assistant","Analyst","USA","USA","4 to 6","4 to 6 hours a day",null,"15-29.9K",5,null,4,null,2,2]
["ID0513","2012-05-26T04:19:05","Â£16400",16400,"GBP",25849.323661903458,24332.344213649849,{"$f":"OFFSET(F833,0,Brains!$D$1,1,1)","v":24332.344213649849},"Job Build analyst","Analyst","UK","UK","4 to 6","4 to 6 hours a day",null,"15-29.9K",5,null,4,null,2,2]
["ID0105","2012-05-26T00:40:52",19200,19200,"USD",19200,19200,{"$f":"OFFSET(F834,0,Brains!$D$1,1,1)","v":19200},"Sr Administrative Assistant","Analyst","Mexico","Mexico","4 to 6","4 to 6 hours a day",null,{"$f":"IF(H834<15000,\"0-14.9K\",IF(H834<30000,\"15-29.9K\",IF(H834<50000,\"30-49.9K\",IF(H834<75000,\"50-74.9K\",IF(H834<100000,\"75-99.9K\",IF(H834<150000,\"100-149.9K\",IF(H834<250000,\"150-249.9K\",\"250K+\")))))))","v":"15-29.9K"},5,null,4,null,2,{"$f":"IF(H834<15000,1,IF(H834<30000,2,IF(H834<50000,3,IF(H834<75000,4,IF(H834<100000,5,IF(H834<150000,6,IF(H834<250000,7,8)))))))","v":2}]
["ID0042","2012-05-25T05:20:10",14500,14500,"USD",14500,14500,{"$f":"OFFSET(F835,0,Brains!$D$1,1,1)","v":14500},"Business Analsyt","Analyst","India","India","4 to 6","4 to 6 hours a day",null,"0-14.9K",5,null,4,null,2,1]
["ID0452","2012-05-26T02:55:29","500000 rupees",500000,"INR",8903.9583437212841,24897.918534010558,{"$f":"OFFSET(F836,0,Brains!$D$1,1,1)","v":24897.918534010558},"Business Analyst","Analyst","India","India","4 to 6","4 to 6 hours a day",null,"15-29.9K",5,null,4,null,2,2]
["ID0294","2012-05-26T01:19:09","4.5 lakh INR",450000,"INR",8013.5625093491553,22408.126680609501,{"$f":"OFFSET(F837,0,Brains!$D$1,1,1)","v":22408.126680609501},"Business Analyst","Analyst","India","India","4 to 6","4 to 6 hours a day",null,"15-29.9K",5,null,4,null,2,2]
["ID0056","2012-05-25T06:26:44",7500,7500,"USD",7500,7500,{"$f":"OFFSET(F838,0,Brains!$D$1,1,1)","v":7500},"Analyst","Analyst","India","India","4 to 6","4 to 6 hours a day",null,"0-14.9K",5,null,4,null,2,1]
["ID0336","2012-05-26T01:33:37","400000 INR",400000,"INR",7123.1666749770275,19918.334827208444,{"$f":"OFFSET(F839,0,Brains!$D$1,1,1)","v":19918.334827208444},"Test Analyst","Analyst","India","India","4 to 6","4 to 6 hours a day",null,"15-29.9K",5,null,4,null,2,2]
["ID0407","2012-05-26T02:09:57",400000,400000,"INR",7123.1666749770275,19918.334827208444,{"$f":"OFFSET(F840,0,Brains!$D$1,1,1)","v":19918.334827208444},"Analyst","Analyst","India","India","4 to 6","4 to 6 hours a day",null,"15-29.9K",5,null,4,null,2,2]
["ID0001","2012-05-25T03:11:32",5846,5846,"USD",5846,5846,{"$f":"OFFSET(F841,0,Brains!$D$1,1,1)","v":5846},"MIS Analyst","Analyst","India","India","4 to 6","4 to 6 hours a day",null,"0-14.9K",5,null,4,null,2,1]
["ID0172","2012-05-26T00:48:48",180000,180000,"INR",3205.4250037396623,8963.2506722437993,{"$f":"OFFSET(F842,0,Brains!$D$1,1,1)","v":8963.2506722437993},"Sr. Associate","Analyst","India","India","4 to 6","4 to 6 hours a day",null,"0-14.9K",5,null,4,null,2,1]
["ID0178","2012-05-26T00:49:35",180000,180000,"INR",3205.4250037396623,8963.2506722437993,{"$f":"OFFSET(F843,0,Brains!$D$1,1,1)","v":8963.2506722437993},"Sr. Associate","Analyst","India","India","4 to 6","4 to 6 hours a day",null,"0-14.9K",5,null,4,null,2,1]
["ID0469","2012-05-26T03:13:13",125000,125000,"INR",2225.989585930321,6224.4796335026394,{"$f":"OFFSET(F844,0,Brains!$D$1,1,1)","v":6224.4796335026394},"clerk","Analyst","India","India","4 to 6","4 to 6 hours a day",null,"0-14.9K",5,null,4,null,2,1]
["ID0397","2012-05-26T02:04:01",100000,100000,"USD",100000,100000,{"$f":"OFFSET(F845,0,Brains!$D$1,1,1)","v":100000},"Sales Operations Analyst","Analyst","USA","USA","All 8","All the 8 hours baby, all the 8!",null,"100-149.9K",8,null,5,null,2,6]
["ID0290","2012-05-26T01:17:57",97000,97000,"USD",97000,97000,{"$f":"OFFSET(F846,0,Brains!$D$1,1,1)","v":97000},"business analyst","Analyst","USA","USA","All 8","All the 8 hours baby, all the 8!",null,"75-99.9K",8,null,5,null,2,5]
["ID0381","2012-05-26T01:58:42",95000,95000,"USD",95000,95000,{"$f":"OFFSET(F847,0,Brains!$D$1,1,1)","v":95000},"Senior Financial Analyst","Analyst","USA","USA","All 8","All the 8 hours baby, all the 8!",null,"75-99.9K",8,null,5,null,2,5]
["ID0422","2012-05-26T02:19:52",90000,90000,"USD",90000,90000,{"$f":"OFFSET(F848,0,Brains!$D$1,1,1)","v":90000},"Financial Analyst","Analyst","USA","USA","All 8","All the 8 hours baby, all the 8!",null,"75-99.9K",8,null,5,null,2,5]
["ID0498","2012-05-26T03:50:24",84000,84000,"USD",84000,84000,{"$f":"OFFSET(F849,0,Brains!$D$1,1,1)","v":84000},"Senior Analyst","Analyst","USA","USA","All 8","All the 8 hours baby, all the 8!",null,"75-99.9K",8,null,5,null,2,5]
["ID0551","2012-05-26T05:44:42","80,000 USD",80000,"USD",80000,80000,{"$f":"OFFSET(F850,0,Brains!$D$1,1,1)","v":80000},"Cost Analyst","Analyst","USA","USA","All 8","All the 8 hours baby, all the 8!",null,"75-99.9K",8,null,5,null,2,5]
["ID0504","2012-05-26T04:03:33",77000,77000,"USD",77000,77000,{"$f":"OFFSET(F851,0,Brains!$D$1,1,1)","v":77000},"Senior Financial Analyst","Analyst","USA","USA","All 8","All the 8 hours baby, all the 8!",null,"75-99.9K",8,null,5,null,2,5]
["ID0360","2012-05-26T01:44:59",75000,75000,"USD",75000,75000,{"$f":"OFFSET(F852,0,Brains!$D$1,1,1)","v":75000},"Sr. Financial Analyst","Analyst","USA","USA","All 8","All the 8 hours baby, all the 8!",null,"75-99.9K",8,null,5,null,2,5]
["ID0520","2012-05-26T04:34:41",70000,70000,"USD",70000,70000,{"$f":"OFFSET(F853,0,Brains!$D$1,1,1)","v":70000},"Metrics Analyst","Analyst","USA","USA","All 8","All the 8 hours baby, all the 8!",null,"50-74.9K",8,null,5,null,2,4]
["ID0061","2012-05-25T07:11:09",68000,68000,"USD",68000,68000,{"$f":"OFFSET(F854,0,Brains!$D$1,1,1)","v":68000},"Engineering Data Analyst","Analyst","USA","USA","All 8","All the 8 hours baby, all the 8!",null,"50-74.9K",8,null,5,null,2,4]
["ID0157","2012-05-26T00:45:46",66500,66500,"USD",66500,66500,{"$f":"OFFSET(F855,0,Brains!$D$1,1,1)","v":66500},"Sr Business Analyst","Analyst","USA","USA","All 8","All the 8 hours baby, all the 8!",null,"50-74.9K",8,null,5,null,2,4]
["ID0327","2012-05-26T01:30:39",65000,65000,"USD",65000,65000,{"$f":"OFFSET(F856,0,Brains!$D$1,1,1)","v":65000},"business analyst","Analyst","USA","USA","All 8","All the 8 hours baby, all the 8!",null,"50-74.9K",8,null,5,null,2,4]
["ID0343","2012-05-26T01:38:06","63000 USD",63000,"USD",63000,63000,{"$f":"OFFSET(F857,0,Brains!$D$1,1,1)","v":63000},"Sales Analyst","Analyst","USA","USA","All 8","All the 8 hours baby, all the 8!",null,"50-74.9K",8,null,5,null,2,4]
["ID0026","2012-05-25T04:45:01",60000,60000,"USD",60000,60000,{"$f":"OFFSET(F858,0,Brains!$D$1,1,1)","v":60000},"Analyst II","Analyst","USA","USA","All 8","All the 8 hours baby, all the 8!",null,"50-74.9K",8,null,5,null,2,4]
["ID0456","2012-05-26T03:01:42",60000,60000,"USD",60000,60000,{"$f":"OFFSET(F859,0,Brains!$D$1,1,1)","v":60000},"Finalcial Reporting Analyst","Analyst","USA","USA","All 8","All the 8 hours baby, all the 8!",null,"50-74.9K",8,null,5,null,2,4]
["ID0003","2012-05-25T03:16:26",58000,58000,"USD",58000,58000,{"$f":"OFFSET(F860,0,Brains!$D$1,1,1)","v":58000},"Financial Analyst","Analyst","USA","USA","All 8","All the 8 hours baby, all the 8!",null,"50-74.9K",8,null,5,null,2,4]
["ID0274","2012-05-26T01:10:24",55000,55000,"USD",55000,55000,{"$f":"OFFSET(F861,0,Brains!$D$1,1,1)","v":55000},"data analyst","Analyst","USA","USA","All 8","All the 8 hours baby, all the 8!",null,"50-74.9K",8,null,5,null,2,4]
["ID0415","2012-05-26T02:15:19",51613,51613,"USD",51613,51613,{"$f":"OFFSET(F862,0,Brains!$D$1,1,1)","v":51613},"Air Planning Analyst","Analyst","USA","USA","All 8","All the 8 hours baby, all the 8!",null,"50-74.9K",8,null,5,null,2,4]
["ID0069","2012-05-25T07:38:22",50000,50000,"USD",50000,50000,{"$f":"OFFSET(F863,0,Brains!$D$1,1,1)","v":50000},"Financial Analyst II","Analyst","USA","USA","All 8","All the 8 hours baby, all the 8!",null,"50-74.9K",8,null,5,null,2,4]
["ID0242","2012-05-26T01:02:47",50000,50000,"USD",50000,50000,{"$f":"OFFSET(F864,0,Brains!$D$1,1,1)","v":50000},"data analyst","Analyst","USA","USA","All 8","All the 8 hours baby, all the 8!",null,"50-74.9K",8,null,5,null,2,4]
["ID0295","2012-05-26T01:19:09",50000,50000,"USD",50000,50000,{"$f":"OFFSET(F865,0,Brains!$D$1,1,1)","v":50000},"Mathematical Data Analyist","Analyst","USA","USA","All 8","All the 8 hours baby, all the 8!",null,"50-74.9K",8,null,5,null,2,4]
["ID0334","2012-05-26T01:32:26",50000,50000,"USD",50000,50000,{"$f":"OFFSET(F866,0,Brains!$D$1,1,1)","v":50000},"Supply Chain Analyst","Analyst","USA","USA","All 8","All the 8 hours baby, all the 8!",null,"50-74.9K",8,null,5,null,2,4]
["ID0014","2012-05-25T03:50:58",49000,49000,"USD",49000,49000,{"$f":"OFFSET(F867,0,Brains!$D$1,1,1)","v":49000},"business analyst","Analyst","USA","USA","All 8","All the 8 hours baby, all the 8!",null,"30-49.9K",8,null,5,null,2,3]
["ID0281","2012-05-26T01:14:27",46000,46000,"USD",46000,46000,{"$f":"OFFSET(F868,0,Brains!$D$1,1,1)","v":46000},"University Relations Intern","Analyst","USA","USA","All 8","All the 8 hours baby, all the 8!",null,"30-49.9K",8,null,5,null,2,3]
["ID0354","2012-05-26T01:41:54",44200,44200,"USD",44200,44200,{"$f":"OFFSET(F869,0,Brains!$D$1,1,1)","v":44200},"Planning and Analysis Supervisor","Analyst","USA","USA","All 8","All the 8 hours baby, all the 8!",null,"30-49.9K",8,null,5,null,2,3]
["ID0212","2012-05-26T00:54:41",43000,43000,"USD",43000,43000,{"$f":"OFFSET(F870,0,Brains!$D$1,1,1)","v":43000},"Reporting Analyst Team Lead","Analyst","USA","USA","All 8","All the 8 hours baby, all the 8!",null,"30-49.9K",8,null,5,null,2,3]
["ID0180","2012-05-26T00:49:50",40000,40000,"USD",40000,40000,{"$f":"OFFSET(F871,0,Brains!$D$1,1,1)","v":40000},"Senior analyst","Analyst","USA","USA","All 8","All the 8 hours baby, all the 8!",null,"30-49.9K",8,null,5,null,2,3]
["ID0254","2012-05-26T01:05:27",40000,40000,"USD",40000,40000,{"$f":"OFFSET(F872,0,Brains!$D$1,1,1)","v":40000},"Business Analyst","Analyst","USA","USA","All 8","All the 8 hours baby, all the 8!",null,"30-49.9K",8,null,5,null,2,3]
["ID0280","2012-05-26T01:13:50",40000,40000,"USD",40000,40000,{"$f":"OFFSET(F873,0,Brains!$D$1,1,1)","v":40000},"Business Analyst","Analyst","USA","USA","All 8","All the 8 hours baby, all the 8!",null,"30-49.9K",8,null,5,null,2,3]
["ID0154","2012-05-26T00:45:06",37440,37440,"USD",37440,37440,{"$f":"OFFSET(F874,0,Brains!$D$1,1,1)","v":37440},"sales analyst","Analyst","USA","USA","All 8","All the 8 hours baby, all the 8!",null,"30-49.9K",8,null,5,null,2,3]
["ID0302","2012-05-26T01:22:22","36,000 USD",36000,"USD",36000,36000,{"$f":"OFFSET(F875,0,Brains!$D$1,1,1)","v":36000},"PRODUCTION ASSISTANT","Analyst","USA","USA","All 8","All the 8 hours baby, all the 8!",null,"30-49.9K",8,null,5,null,2,3]
["ID0358","2012-05-26T01:42:53","170000 usd",170000,"USD",170000,170000,{"$f":"OFFSET(F876,0,Brains!$D$1,1,1)","v":170000},"RS","Analyst","UK","UK","Excel??","Excel ?!? What Excel?",null,"150-249.9K",0,null,1,null,2,7]
["ID0121","2012-05-26T00:41:41",60000,60000,"CAD",59001.691381819612,48038.430744595673,{"$f":"OFFSET(F877,0,Brains!$D$1,1,1)","v":48038.430744595673},"Web Developer","Analyst","Canada","Canada","Excel??","Excel ?!? What Excel?",null,"30-49.9K",0,null,1,null,2,3]
["ID0120","2012-05-26T00:41:38",52000,52000,"USD",52000,52000,{"$f":"OFFSET(F878,0,Brains!$D$1,1,1)","v":52000},"Market Analyst","Analyst","USA","USA","Excel??","Excel ?!? What Excel?",null,"50-74.9K",0,null,1,null,2,4]
["ID0478","2012-05-26T03:19:00",30000,30000,"USD",30000,30000,{"$f":"OFFSET(F879,0,Brains!$D$1,1,1)","v":30000},"video production","Analyst","USA","USA","Excel??","Excel ?!? What Excel?",null,"30-49.9K",0,null,1,null,2,3]
["ID1850","2012-06-15T01:10:09",37500,37500,"USD",37500,37500,{"$f":"OFFSET(F880,0,Brains!$D$1,1,1)","v":37500},"consultant","Consultant","India","India","All 8","All the 8 hours baby, all the 8!","0-5 yrs","30-49.9K",8,0,5,1,3,3]
["ID1666","2012-06-04T21:43:15",56000,56000,"CAD",55068.245289698301,44835.868694955956,{"$f":"OFFSET(F881,0,Brains!$D$1,1,1)","v":44835.868694955956},"consultant","Consultant","Canada","Canada","All 8","All the 8 hours baby, all the 8!","0-5 yrs","30-49.9K",8,1,5,1,3,3]
["ID0774","2012-05-26T17:51:27",48000,48000,"USD",48000,48000,{"$f":"OFFSET(F882,0,Brains!$D$1,1,1)","v":48000},"Consultant","Consultant","Singapore","Singapore","All 8","All the 8 hours baby, all the 8!","0-5 yrs","30-49.9K",8,3,5,1,3,3]
["ID0679","2012-05-26T13:02:50",470000,470000,"INR",8369.7208430980063,23404.043421969924,{"$f":"OFFSET(F883,0,Brains!$D$1,1,1)","v":23404.043421969924},"Consultant","Consultant","India","India","All 8","All the 8 hours baby, all the 8!","0-5 yrs","15-29.9K",8,4,5,1,3,2]
["ID1043","2012-05-28T13:40:58","USD 60000",60000,"USD",60000,60000,{"$f":"OFFSET(F884,0,Brains!$D$1,1,1)","v":60000},"Excel Developer","Consultant","Finland","Finland","All 8","All the 8 hours baby, all the 8!","0-5 yrs","50-74.9K",8,5,5,1,3,4]
["ID1736","2012-06-07T17:09:18",360000,360000,"INR",6410.8500074793246,17926.501344487599,{"$f":"OFFSET(F885,0,Brains!$D$1,1,1)","v":17926.501344487599},"Baan ERP Functional Consultant","Consultant","India","India","1 or 2","1 or 2 hours a day","0-5 yrs","15-29.9K",1.5,2,2,1,3,2]
["ID1242","2012-05-29T04:08:45",71000,71000,"EUR",90198.36016840415,89190.153407063874,{"$f":"OFFSET(F886,0,Brains!$D$1,1,1)","v":89190.153407063874},"Consultant","Consultant","Germany","Germany","1 or 2","1 or 2 hours a day","0-5 yrs","75-99.9K",1.5,3,2,1,3,5]
["ID1262","2012-05-29T08:25:51","120,000  US$",120000,"USD",120000,120000,{"$f":"OFFSET(F887,0,Brains!$D$1,1,1)","v":120000},"Consultant - Process Improvement","Consultant","Singapore","Singapore","1 or 2","1 or 2 hours a day","0-5 yrs","100-149.9K",1.5,5,2,1,3,6]
["ID1069","2012-05-28T14:52:45","Rs. 25000",300000,"INR",5342.3750062327708,14938.751120406334,{"$f":"OFFSET(F888,0,Brains!$D$1,1,1)","v":14938.751120406334},"Professional consultant-Finance","Consultant","India","India","2 to 3","2 to 3 hours per day","0-5 yrs","0-14.9K",2.5,1,3,1,3,1]
["ID0695","2012-05-26T13:29:12","3000 $",3000,"USD",3000,3000,{"$f":"OFFSET(F889,0,Brains!$D$1,1,1)","v":3000},"Call Centre Consultant","Consultant","Cambodia","Cambodia","2 to 3","2 to 3 hours per day","0-5 yrs","0-14.9K",2.5,2,3,1,3,1]
["ID0951","2012-05-28T01:17:17","42000 â‚¬",42000,"EUR",53356.776437647524,52760.372437981445,{"$f":"OFFSET(F890,0,Brains!$D$1,1,1)","v":52760.372437981445},"Consultant","Consultant","Germany","Germany","2 to 3","2 to 3 hours per day","0-5 yrs","50-74.9K",2.5,3,3,1,3,4]
["ID1214","2012-05-29T00:28:38",500000,500000,"INR",8903.9583437212841,24897.918534010558,{"$f":"OFFSET(F891,0,Brains!$D$1,1,1)","v":24897.918534010558},"Consultant","Consultant","India","India","2 to 3","2 to 3 hours per day","0-5 yrs","15-29.9K",2.5,3,3,1,3,2]
["ID1643","2012-06-03T12:27:07",100000,100000,"USD",100000,100000,{"$f":"OFFSET(F892,0,Brains!$D$1,1,1)","v":100000},"Consultant","Consultant","USA","USA","2 to 3","2 to 3 hours per day","0-5 yrs","100-149.9K",2.5,4,3,1,3,6]
["ID1332","2012-05-29T16:39:11","Â£45000",45000,"GBP",70928.022243027779,66765.578635014841,{"$f":"OFFSET(F893,0,Brains!$D$1,1,1)","v":66765.578635014841},"Senior Consultant","Consultant","UK","UK","2 to 3","2 to 3 hours per day","0-5 yrs","50-74.9K",2.5,4,3,1,3,4]
["ID0711","2012-05-26T14:14:35",400000,400000,"INR",7123.1666749770275,19918.334827208444,{"$f":"OFFSET(F894,0,Brains!$D$1,1,1)","v":19918.334827208444},"Consultant","Consultant","India","India","4 to 6","4 to 6 hours a day","0-5 yrs","15-29.9K",5,0,4,1,3,2]
["ID1297","2012-05-29T13:16:45",1000,12000,"USD",12000,12000,{"$f":"OFFSET(F895,0,Brains!$D$1,1,1)","v":12000},"excel prof","Consultant","pakistan","Pakistan","4 to 6","4 to 6 hours a day","0-5 yrs","0-14.9K",5,1,4,1,3,1]
["ID0944","2012-05-28T00:10:43",63200,63200,"EUR",80289.244544269619,79391.798525724458,{"$f":"OFFSET(F896,0,Brains!$D$1,1,1)","v":79391.798525724458},"Consultant","Consultant","France","France","4 to 6","4 to 6 hours a day","0-5 yrs","75-99.9K",5,3,4,1,3,5]
["ID1201","2012-05-28T23:51:37","Euro 15.000",15000,"EUR",19055.991584874118,18842.990156421944,{"$f":"OFFSET(F897,0,Brains!$D$1,1,1)","v":18842.990156421944},"business consultant","Consultant","Italy","Italy","4 to 6","4 to 6 hours a day","0-5 yrs","15-29.9K",5,3,4,1,3,2]
["ID1433","2012-05-30T02:22:39",14000,14000,"USD",14000,14000,{"$f":"OFFSET(F898,0,Brains!$D$1,1,1)","v":14000},"Consultant","Consultant","India","India","4 to 6","4 to 6 hours a day","0-5 yrs",{"$f":"IF(H898<15000,\"0-14.9K\",IF(H898<30000,\"15-29.9K\",IF(H898<50000,\"30-49.9K\",IF(H898<75000,\"50-74.9K\",IF(H898<100000,\"75-99.9K\",IF(H898<150000,\"100-149.9K\",IF(H898<250000,\"150-249.9K\",\"250K+\")))))))","v":"0-14.9K"},5,3,4,1,3,{"$f":"IF(H898<15000,1,IF(H898<30000,2,IF(H898<50000,3,IF(H898<75000,4,IF(H898<100000,5,IF(H898<150000,6,IF(H898<250000,7,8)))))))","v":1}]
["ID0935","2012-05-27T22:58:39",60000,60000,"USD",60000,60000,{"$f":"OFFSET(F899,0,Brains!$D$1,1,1)","v":60000},"Consultant","Consultant","Singapore","Singapore","4 to 6","4 to 6 hours a day","0-5 yrs","50-74.9K",5,5,4,1,3,4]
["ID1635","2012-06-03T02:54:32",36000,36000,"USD",36000,36000,{"$f":"OFFSET(F900,0,Brains!$D$1,1,1)","v":36000},"Environmental Adviser","Consultant","Azerbaijan","Azerbaijan","4 to 6","4 to 6 hours a day","0-5 yrs","30-49.9K",5,5,4,1,3,3]
["ID1203","2012-05-28T23:53:02",1100000,1100000,"INR",19588.708356186824,54775.420774823222,{"$f":"OFFSET(F901,0,Brains!$D$1,1,1)","v":54775.420774823222},"Sr. Consultant","Consultant","India","India","All 8","All the 8 hours baby, all the 8!","11-20 yrs","50-74.9K",8,13,5,3,3,4]
["ID1202","2012-05-28T23:52:42",480000,480000,"INR",8547.8000099724322,23902.001792650135,{"$f":"OFFSET(F902,0,Brains!$D$1,1,1)","v":23902.001792650135},"Documentation Consultant","Consultant","India","India","All 8","All the 8 hours baby, all the 8!","11-20 yrs","15-29.9K",8,15,5,3,3,2]
["ID0864","2012-05-27T04:12:04",5000,5000,"USD",5000,5000,{"$f":"OFFSET(F903,0,Brains!$D$1,1,1)","v":5000},"Policy advisor","Consultant","Aruba","Aruba","1 or 2","1 or 2 hours a day","11-20 yrs","0-14.9K",1.5,13,2,3,3,1]
["ID0623","2012-05-26T11:03:02","A$85000",85000,"AUD",86692.320794224041,54071.246819338427,{"$f":"OFFSET(F904,0,Brains!$D$1,1,1)","v":54071.246819338427},"Trainer","Consultant","Australia","Australia","1 or 2","1 or 2 hours a day","11-20 yrs","50-74.9K",1.5,20,2,3,3,4]
["ID1769","2012-06-09T01:47:30",72000,72000,"USD",72000,72000,{"$f":"OFFSET(F905,0,Brains!$D$1,1,1)","v":72000},"Consultant","Consultant","USA","USA","2 to 3","2 to 3 hours per day","11-20 yrs","50-74.9K",2.5,13,3,3,3,4]
["ID0677","2012-05-26T13:01:44",105000,105000,"USD",105000,105000,{"$f":"OFFSET(F906,0,Brains!$D$1,1,1)","v":105000},"Senior Consultant","Consultant","USA","USA","2 to 3","2 to 3 hours per day","11-20 yrs","100-149.9K",2.5,15,3,3,3,6]
["ID0763","2012-05-26T17:07:30",20000,20000,"USD",20000,20000,{"$f":"OFFSET(F907,0,Brains!$D$1,1,1)","v":20000},"Consultat","Consultant","Denmark","Denmark","2 to 3","2 to 3 hours per day","11-20 yrs","15-29.9K",2.5,15,3,3,3,2]
["ID0863","2012-05-27T04:07:07",12000,12000,"USD",12000,12000,{"$f":"OFFSET(F908,0,Brains!$D$1,1,1)","v":12000},"Guide for About.com","Consultant","Spain","Spain","2 to 3","2 to 3 hours per day","11-20 yrs","0-14.9K",2.5,15,3,3,3,1]
["ID1150","2012-05-28T20:05:20","â‚¬70k",70000,"EUR",88927.960729412545,87933.954063302401,{"$f":"OFFSET(F909,0,Brains!$D$1,1,1)","v":87933.954063302401},"Construction Planner","Consultant","Ireland","Ireland","2 to 3","2 to 3 hours per day","11-20 yrs","75-99.9K",2.5,20,3,3,3,5]
["ID1600","2012-06-01T19:57:45","Â£80000",80000,"GBP",126094.26176538273,118694.36201780415,{"$f":"OFFSET(F910,0,Brains!$D$1,1,1)","v":118694.36201780415},"Owner of Business Improvement Consultancy","Consultant","UK","UK","4 to 6","4 to 6 hours a day","11-20 yrs","100-149.9K",5,12,4,3,3,6]
["ID1541","2012-05-31T16:16:11","Â£30500",30500,"GBP",48073.437298052166,45252.225519287829,{"$f":"OFFSET(F911,0,Brains!$D$1,1,1)","v":45252.225519287829},"Construction Estimator","Consultant","UK","UK","4 to 6","4 to 6 hours a day","11-20 yrs","30-49.9K",5,14,4,3,3,3]
["ID1348","2012-05-29T18:05:50","Â£70000",70000,"GBP",110332.47904470989,103857.56676557862,{"$f":"OFFSET(F912,0,Brains!$D$1,1,1)","v":103857.56676557862},"Consultant","Consultant","UK","UK","4 to 6","4 to 6 hours a day","11-20 yrs","100-149.9K",5,15,4,3,3,6]
["ID1268","2012-05-29T09:25:31",100000,100000,"AUD",101990.96564026357,63613.231552162855,{"$f":"OFFSET(F913,0,Brains!$D$1,1,1)","v":63613.231552162855},"Contractor/Consultant","Consultant","Australia","Australia","4 to 6","4 to 6 hours a day","11-20 yrs","50-74.9K",5,15,4,3,3,4]
["ID0918","2012-05-27T18:19:31",64210.1,64210,"GBP",101206.40684944032,95267.06231454006,{"$f":"OFFSET(F914,0,Brains!$D$1,1,1)","v":95267.06231454006},"HR Advisor - Systems & MI","Consultant","UK","UK","4 to 6","4 to 6 hours a day","11-20 yrs","75-99.9K",5,16,4,3,3,5]
["ID1516","2012-05-31T02:37:09",250000,250000,"USD",250000,250000,{"$f":"OFFSET(F915,0,Brains!$D$1,1,1)","v":250000},"consultant","Consultant","USA","USA","All 8","All the 8 hours baby, all the 8!","11-20 yrs","250K+",8,20,5,3,3,8]
["ID1356","2012-05-29T18:55:18",100000,100000,"AUD",101990.96564026357,63613.231552162855,{"$f":"OFFSET(F916,0,Brains!$D$1,1,1)","v":63613.231552162855},"Principal advisor","Consultant","Australia","Australia","1 or 2","1 or 2 hours a day","21-30 yrs","50-74.9K",1.5,30,2,4,3,4]
["ID1342","2012-05-29T17:30:43",1200000,1200000,"INR",21369.500024931083,59755.004481625336,{"$f":"OFFSET(F917,0,Brains!$D$1,1,1)","v":59755.004481625336},"Consultant","Consultant","India","India","2 to 3","2 to 3 hours per day","21-30 yrs","50-74.9K",2.5,21,3,4,3,4]
["ID1452","2012-05-30T12:56:38","Rs  6 lakhs/annum",600000,"INR",10684.750012465542,29877.502240812668,{"$f":"OFFSET(F918,0,Brains!$D$1,1,1)","v":29877.502240812668},"consultant","Consultant","India","India","2 to 3","2 to 3 hours per day","31-40 yrs","15-29.9K",2.5,36,3,5,3,2]
["ID0969","2012-05-28T06:35:50",100000,100000,"AUD",101990.96564026357,63613.231552162855,{"$f":"OFFSET(F919,0,Brains!$D$1,1,1)","v":63613.231552162855},"Senior Consultant","Consultant","Australia","Australia","All 8","All the 8 hours baby, all the 8!","6-10 yrs","50-74.9K",8,6,5,2,3,4]
["ID0999","2012-05-28T09:43:33","1200000 INR",1200000,"INR",21369.500024931083,59755.004481625336,{"$f":"OFFSET(F920,0,Brains!$D$1,1,1)","v":59755.004481625336},"Senior Consultant","Consultant","India","India","All 8","All the 8 hours baby, all the 8!","6-10 yrs","50-74.9K",8,6,5,2,3,4]
["ID1495","2012-05-30T21:07:54",42000,42000,"EUR",53356.776437647524,52760.372437981445,{"$f":"OFFSET(F921,0,Brains!$D$1,1,1)","v":52760.372437981445},"Business Intelligence Consultant","Consultant","Germany","Germany","All 8","All the 8 hours baby, all the 8!","6-10 yrs","50-74.9K",8,7,5,2,3,4]
["ID1055","2012-05-28T14:18:40",26000,26000,"GBP",40980.635073749385,38575.667655786347,{"$f":"OFFSET(F922,0,Brains!$D$1,1,1)","v":38575.667655786347},"Consultant","Consultant","UK","UK","All 8","All the 8 hours baby, all the 8!","6-10 yrs","30-49.9K",8,8,5,2,3,3]
["ID1190","2012-05-28T23:06:22","Rupees : 2,000,000",2000000,"PKR",21228.177433598263,48920.089034562043,{"$f":"OFFSET(F923,0,Brains!$D$1,1,1)","v":48920.089034562043},"Excel Corporate Trainer","Consultant","Pakistan","Pakistan","All 8","All the 8 hours baby, all the 8!","6-10 yrs","30-49.9K",8,8,5,2,3,3]
["ID0594","2012-05-26T08:17:53","$36 000",36000,"USD",36000,36000,{"$f":"OFFSET(F924,0,Brains!$D$1,1,1)","v":36000},"Consulting","Consultant","Russia","Russia","All 8","All the 8 hours baby, all the 8!","6-10 yrs","30-49.9K",8,10,5,2,3,3]
["ID1239","2012-05-29T03:51:09",30,30000,"EUR",38111.983169748237,37685.980312843887,{"$f":"OFFSET(F925,0,Brains!$D$1,1,1)","v":37685.980312843887},"education advisor","Consultant","the Netherlands","Netherlands","1 or 2","1 or 2 hours a day","6-10 yrs","30-49.9K",1.5,8,2,2,3,3]
["ID0596","2012-05-26T08:43:07",108000,108000,"USD",108000,108000,{"$f":"OFFSET(F926,0,Brains!$D$1,1,1)","v":108000},"Technology consultant ","Consultant","USA","USA","2 to 3","2 to 3 hours per day","6-10 yrs","100-149.9K",2.5,7,3,2,3,6]
["ID1009","2012-05-28T10:42:08",170000,170000,"AUD",173384.64158844808,108142.49363867685,{"$f":"OFFSET(F927,0,Brains!$D$1,1,1)","v":108142.49363867685},"Business Consultant","Consultant","Australia","Australia","2 to 3","2 to 3 hours per day","6-10 yrs","100-149.9K",2.5,8,3,2,3,6]
["ID1403","2012-05-29T22:50:20",80000,80000,"USD",80000,80000,{"$f":"OFFSET(F928,0,Brains!$D$1,1,1)","v":80000},"Sr Process Consultant","Consultant","USA","USA","2 to 3","2 to 3 hours per day","6-10 yrs","75-99.9K",2.5,8,3,2,3,5]
["ID1058","2012-05-28T14:23:57",1000,12000,"USD",12000,12000,{"$f":"OFFSET(F929,0,Brains!$D$1,1,1)","v":12000},"consultant","Consultant","India","India","2 to 3","2 to 3 hours per day","6-10 yrs","0-14.9K",2.5,8,3,2,3,1]
["ID1594","2012-06-01T18:08:07","75000 $",75000,"USD",75000,75000,{"$f":"OFFSET(F930,0,Brains!$D$1,1,1)","v":75000},"Consultant","Consultant","Germany","Germany","2 to 3","2 to 3 hours per day","6-10 yrs","75-99.9K",2.5,9,3,2,3,5]
["ID1249","2012-05-29T05:11:03","USD72000",72000,"USD",72000,72000,{"$f":"OFFSET(F931,0,Brains!$D$1,1,1)","v":72000},"Markets Adviser","Consultant","New Zealand","New Zealand","2 to 3","2 to 3 hours per day","6-10 yrs","50-74.9K",2.5,10,3,2,3,4]
["ID1659","2012-06-04T13:30:51",84000,84000,"AUD",85672.4111378214,53435.114503816796,{"$f":"OFFSET(F932,0,Brains!$D$1,1,1)","v":53435.114503816796},"consultant","Consultant","Australia","Australia","4 to 6","4 to 6 hours a day","6-10 yrs","50-74.9K",5,6,4,2,3,4]
["ID1085","2012-05-28T15:42:04",80000,80000,"GBP",126094.26176538273,118694.36201780415,{"$f":"OFFSET(F933,0,Brains!$D$1,1,1)","v":118694.36201780415},"Manufacturing consultant","Consultant","UK","UK","4 to 6","4 to 6 hours a day","6-10 yrs","100-149.9K",5,10,4,2,3,6]
["ID1325","2012-05-29T15:51:21","82000 USD",82000,"USD",82000,82000,{"$f":"OFFSET(F934,0,Brains!$D$1,1,1)","v":82000},"Consultant","Consultant","South Africa","South Africa","4 to 6","4 to 6 hours a day","6-10 yrs","75-99.9K",5,10,4,2,3,5]
["ID1575","2012-06-01T04:10:52",41000,41000,"USD",41000,41000,{"$f":"OFFSET(F935,0,Brains!$D$1,1,1)","v":41000},"Excel Developer","Consultant","USA","USA","4 to 6","4 to 6 hours a day","6-10 yrs","30-49.9K",5,10,4,2,3,3]
["ID1512","2012-05-31T01:17:48",1500000,1500000,"INR",26711.875031163851,74693.75560203167,{"$f":"OFFSET(F936,0,Brains!$D$1,1,1)","v":74693.75560203167},"Senior Consultant - PMO","Consultant","India","India","4 to 6","4 to 6 hours a day","6-10 yrs","50-74.9K",5,10,4,2,3,4]
["ID1558","2012-05-31T22:05:03",125000,125000,"USD",125000,125000,{"$f":"OFFSET(F937,0,Brains!$D$1,1,1)","v":125000},"Consultant","Consultant","USA","USA","All 8","All the 8 hours baby, all the 8!","6-10 yrs","100-149.9K",8,8,5,2,3,6]
["ID0374","2012-05-26T01:52:01","2207,00",220700,"USD",220700,220700,{"$f":"OFFSET(F938,0,Brains!$D$1,1,1)","v":220700},"Consultant","Consultant","Brazil","Brazil","All 8","All the 8 hours baby, all the 8!",null,"150-249.9K",8,null,5,null,3,7]
["ID0187","2012-05-26T00:50:41",92000,92000,"CAD",90469.260118790073,73658.927141713357,{"$f":"OFFSET(F939,0,Brains!$D$1,1,1)","v":73658.927141713357},"Consultant - Retail Mkts","Consultant","Canada","Canada","All 8","All the 8 hours baby, all the 8!",null,"50-74.9K",8,null,5,null,3,4]
["ID0256","2012-05-26T01:06:12",4390,52680,"GBP",83033.071372504521,78160.237388724039,{"$f":"OFFSET(F940,0,Brains!$D$1,1,1)","v":78160.237388724039},"Excel Consultant","Consultant","UK","UK","All 8","All the 8 hours baby, all the 8!",null,"75-99.9K",8,null,5,null,3,5]
["ID0265","2012-05-26T01:08:21",2300,27600,"USD",27600,27600,{"$f":"OFFSET(F941,0,Brains!$D$1,1,1)","v":27600},"Software Consultant","Consultant","Singapore","Singapore","All 8","All the 8 hours baby, all the 8!",null,"15-29.9K",8,null,5,null,3,2]
["ID0286","2012-05-26T01:16:18","INR 15,00,000",1500000,"INR",26711.875031163851,74693.75560203167,{"$f":"OFFSET(F942,0,Brains!$D$1,1,1)","v":74693.75560203167},"Consultant","Consultant","India","India","All 8","All the 8 hours baby, all the 8!",null,"50-74.9K",8,null,5,null,3,4]
["ID0036","2012-05-25T05:04:12",500000,500000,"INR",8903.9583437212841,24897.918534010558,{"$f":"OFFSET(F943,0,Brains!$D$1,1,1)","v":24897.918534010558},"Senior Consultant","Consultant","India","India","All 8","All the 8 hours baby, all the 8!",null,"15-29.9K",8,null,5,null,3,2]
["ID0085","2012-05-26T00:10:17",500000,500000,"INR",8903.9583437212841,24897.918534010558,{"$f":"OFFSET(F944,0,Brains!$D$1,1,1)","v":24897.918534010558},"Senior Consultant","Consultant","India","India","All 8","All the 8 hours baby, all the 8!",null,"15-29.9K",8,null,5,null,3,2]
["ID0363","2012-05-26T01:46:24","480 000 SEK / 70000 US$",480000,"SEK",68954.520184280962,50686.378035902846,{"$f":"OFFSET(F945,0,Brains!$D$1,1,1)","v":50686.378035902846},"IT consultant","Consultant","Sweden","Sweden","1 or 2","1 or 2 hours a day",null,"50-74.9K",1.5,null,2,null,3,4]
["ID0048","2012-05-25T05:47:52",1000,12000,"USD",12000,12000,{"$f":"OFFSET(F946,0,Brains!$D$1,1,1)","v":12000},"Freelance consultant","Consultant","USA","USA","1 or 2","1 or 2 hours a day",null,"0-14.9K",1.5,null,2,null,3,1]
["ID0130","2012-05-26T00:42:34",1000,12000,"USD",12000,12000,{"$f":"OFFSET(F947,0,Brains!$D$1,1,1)","v":12000},"Freelance","Consultant","Pakistan","Pakistan","1 or 2","1 or 2 hours a day",null,"0-14.9K",1.5,null,2,null,3,1]
["ID0420","2012-05-26T02:19:12","INR 200000",200000,"INR",3561.5833374885137,9959.167413604222,{"$f":"OFFSET(F948,0,Brains!$D$1,1,1)","v":9959.167413604222},"Consultant","Consultant","India","India","1 or 2","1 or 2 hours a day",null,"0-14.9K",1.5,null,2,null,3,1]
["ID0093","2012-05-26T00:39:54","Rs. 12,000/-",144000,"INR",2564.3400029917298,7170.6005377950405,{"$f":"OFFSET(F949,0,Brains!$D$1,1,1)","v":7170.6005377950405},"Financial Consultant","Consultant","India","India","1 or 2","1 or 2 hours a day",null,"0-14.9K",1.5,null,2,null,3,1]
["ID0353","2012-05-26T01:41:53",160000,160000,"CAD",157337.8436848523,128102.48198558846,{"$f":"OFFSET(F950,0,Brains!$D$1,1,1)","v":128102.48198558846},"Consultant","Consultant","Canada","Canada","2 to 3","2 to 3 hours per day",null,"100-149.9K",2.5,null,3,null,3,6]
["ID0418","2012-05-26T02:17:38","US$115000",115000,"USD",115000,115000,{"$f":"OFFSET(F951,0,Brains!$D$1,1,1)","v":115000},"Consultant","Consultant","USA","USA","2 to 3","2 to 3 hours per day",null,"100-149.9K",2.5,null,3,null,3,6]
["ID0249","2012-05-26T01:04:13","US$ 96k",96000,"USD",96000,96000,{"$f":"OFFSET(F952,0,Brains!$D$1,1,1)","v":96000},"Freellance","Consultant","Poland","Poland","2 to 3","2 to 3 hours per day",null,"75-99.9K",2.5,null,3,null,3,5]
["ID0486","2012-05-26T03:30:42","GB Sterling 59k",59000,"GBP",92994.518051969761,87537.09198813056,{"$f":"OFFSET(F953,0,Brains!$D$1,1,1)","v":87537.09198813056},"Health and safety advisor","Consultant","UK","UK","2 to 3","2 to 3 hours per day",null,"75-99.9K",2.5,null,3,null,3,5]
["ID0041","2012-05-25T05:18:48",70000,70000,"AUD",71393.675948184507,44529.262086513998,{"$f":"OFFSET(F954,0,Brains!$D$1,1,1)","v":44529.262086513998},"consultant","Consultant","Australia","Australia","2 to 3","2 to 3 hours per day",null,"30-49.9K",2.5,null,3,null,3,3]
["ID0039","2012-05-25T05:11:37",30000,30000,"USD",30000,30000,{"$f":"OFFSET(F955,0,Brains!$D$1,1,1)","v":30000},"Academic Advisor","Consultant","USA","USA","2 to 3","2 to 3 hours per day",null,"30-49.9K",2.5,null,3,null,3,3]
["ID0491","2012-05-26T03:34:04","20000 US$",20000,"USD",20000,20000,{"$f":"OFFSET(F956,0,Brains!$D$1,1,1)","v":20000},"Consultant","Consultant","India","India","2 to 3","2 to 3 hours per day",null,"15-29.9K",2.5,null,3,null,3,2]
["ID0531","2012-05-26T05:04:49",95000,95000,"USD",95000,95000,{"$f":"OFFSET(F957,0,Brains!$D$1,1,1)","v":95000},"Process Design Consultant","Consultant","USA","USA","4 to 6","4 to 6 hours a day",null,"75-99.9K",5,null,4,null,3,5]
["ID0450","2012-05-26T02:53:48","Â£60000",60000,"GBP",94570.696324037053,89020.771513353116,{"$f":"OFFSET(F958,0,Brains!$D$1,1,1)","v":89020.771513353116},"Excel Consultant","Consultant","UK","UK","4 to 6","4 to 6 hours a day",null,"75-99.9K",5,null,4,null,3,5]
["ID0088","2012-05-26T00:22:49","81,000USD",81000,"USD",81000,81000,{"$f":"OFFSET(F959,0,Brains!$D$1,1,1)","v":81000},"Strategy Consultant","Consultant","UK","UK","4 to 6","4 to 6 hours a day",null,"75-99.9K",5,null,4,null,3,5]
["ID0169","2012-05-26T00:48:07",80000,80000,"USD",80000,80000,{"$f":"OFFSET(F960,0,Brains!$D$1,1,1)","v":80000},"Consultant, HR Services & Governance","Consultant","USA","USA","4 to 6","4 to 6 hours a day",null,"75-99.9K",5,null,4,null,3,5]
["ID0100","2012-05-26T00:40:41",74000,74000,"USD",74000,74000,{"$f":"OFFSET(F961,0,Brains!$D$1,1,1)","v":74000},"Senior Consultant","Consultant","USA","USA","4 to 6","4 to 6 hours a day",null,"50-74.9K",5,null,4,null,3,4]
["ID0149","2012-05-26T00:44:22",69000,69000,"USD",69000,69000,{"$f":"OFFSET(F962,0,Brains!$D$1,1,1)","v":69000},"Business Technical Consultant","Consultant","USA","USA","4 to 6","4 to 6 hours a day",null,{"$f":"IF(H962<15000,\"0-14.9K\",IF(H962<30000,\"15-29.9K\",IF(H962<50000,\"30-49.9K\",IF(H962<75000,\"50-74.9K\",IF(H962<100000,\"75-99.9K\",IF(H962<150000,\"100-149.9K\",IF(H962<250000,\"150-249.9K\",\"250K+\")))))))","v":"50-74.9K"},5,null,4,null,3,{"$f":"IF(H962<15000,1,IF(H962<30000,2,IF(H962<50000,3,IF(H962<75000,4,IF(H962<100000,5,IF(H962<150000,6,IF(H962<250000,7,8)))))))","v":4}]
["ID0064","2012-05-25T07:18:53",43000,43000,"EUR",54627.175876639136,54016.571781742903,{"$f":"OFFSET(F963,0,Brains!$D$1,1,1)","v":54016.571781742903},"SAP consultant","Consultant","FR","France","4 to 6","4 to 6 hours a day",null,"50-74.9K",5,null,4,null,3,4]
["ID0555","2012-05-26T05:48:12","Â£20000",20000,"GBP",31523.565441345683,29673.590504451036,{"$f":"OFFSET(F964,0,Brains!$D$1,1,1)","v":29673.590504451036},"IT Consultant","Consultant","UK","UK","4 to 6","4 to 6 hours a day",null,"15-29.9K",5,null,4,null,3,2]
["ID0348","2012-05-26T01:40:05",950,11400,"USD",11400,11400,{"$f":"OFFSET(F965,0,Brains!$D$1,1,1)","v":11400},"Advisor","Consultant","Brazil","Brazil","4 to 6","4 to 6 hours a day",null,"0-14.9K",5,null,4,null,3,1]
["ID0541","2012-05-26T05:27:37","PKR 50,000",600000,"PKR",6368.453230079479,14676.026710368613,{"$f":"OFFSET(F966,0,Brains!$D$1,1,1)","v":14676.026710368613},"Trainer","Consultant","Pakistan","Pakistan","4 to 6","4 to 6 hours a day",null,"0-14.9K",5,null,4,null,3,1]
["ID0425","2012-05-26T02:22:17","250000 to 270000",250000,"USD",250000,250000,{"$f":"OFFSET(F967,0,Brains!$D$1,1,1)","v":250000},"consultant","Consultant","USA","USA","All 8","All the 8 hours baby, all the 8!",null,"250K+",8,null,5,null,3,8]
["ID0516","2012-05-26T04:26:10","$150000pa",150000,"USD",150000,150000,{"$f":"OFFSET(F968,0,Brains!$D$1,1,1)","v":150000},"Consultant","Consultant","USA","USA","All 8","All the 8 hours baby, all the 8!",null,"150-249.9K",8,null,5,null,3,7]
["ID0076","2012-05-25T23:12:29",15000,15000,"USD",15000,15000,{"$f":"OFFSET(F969,0,Brains!$D$1,1,1)","v":15000},"Excel Programmer Consultant","Consultant","USA","USA","All 8","All the 8 hours baby, all the 8!",null,"15-29.9K",8,null,5,null,3,2]
["ID0765","2012-05-26T17:09:24","14960 $",14960,"USD",14960,14960,{"$f":"OFFSET(F970,0,Brains!$D$1,1,1)","v":14960},"Stock Controller","Controller","Saudi Arabia","Saudi Arabia","All 8","All the 8 hours baby, all the 8!","0-5 yrs","0-14.9K",8,2,5,1,4,1]
["ID0773","2012-05-26T17:49:17","Rs. 300000",300000,"INR",5342.3750062327708,14938.751120406334,{"$f":"OFFSET(F971,0,Brains!$D$1,1,1)","v":14938.751120406334},"OPEX CONTROL","Controller","India","India","All 8","All the 8 hours baby, all the 8!","0-5 yrs","0-14.9K",8,4,5,1,4,1]
["ID1556","2012-05-31T21:47:37",110000,110000,"USD",110000,110000,{"$f":"OFFSET(F972,0,Brains!$D$1,1,1)","v":110000},"Business Controller","Controller","Norway","Norway","All 8","All the 8 hours baby, all the 8!","0-5 yrs","100-149.9K",8,5,5,1,4,6]
["ID1438","2012-05-30T03:20:17","24000 USD",24000,"USD",24000,24000,{"$f":"OFFSET(F973,0,Brains!$D$1,1,1)","v":24000},"inventory controller","Controller","USA","USA","1 or 2","1 or 2 hours a day","0-5 yrs","15-29.9K",1.5,2,2,1,4,2]
["ID0977","2012-05-28T07:28:34",50000,50000,"AUD",50995.482820131787,31806.615776081428,{"$f":"OFFSET(F974,0,Brains!$D$1,1,1)","v":31806.615776081428},"Operations","Controller","Australia","Australia","1 or 2","1 or 2 hours a day","0-5 yrs","30-49.9K",1.5,5,2,1,4,3]
["ID0744","2012-05-26T16:01:54",15000,15000,"USD",15000,15000,{"$f":"OFFSET(F975,0,Brains!$D$1,1,1)","v":15000},"PROCSS ASOCIATE","Controller","India","India","2 to 3","2 to 3 hours per day","0-5 yrs","15-29.9K",2.5,2,3,1,4,2]
["ID1569","2012-06-01T01:29:02",46325,46325,"USD",46325,46325,{"$f":"OFFSET(F976,0,Brains!$D$1,1,1)","v":46325},"Work Force Scheduler for Call Center","Controller","USA","USA","4 to 6","4 to 6 hours a day","0-5 yrs","30-49.9K",5,1,4,1,4,3]
["ID1477","2012-05-30T17:14:27","ZAR6500",78000,"ZAR",9509.8988293070688,13751.763046544429,{"$f":"OFFSET(F977,0,Brains!$D$1,1,1)","v":13751.763046544429},"Online Stats Controller","Controller","South Africa","South Africa","4 to 6","4 to 6 hours a day","0-5 yrs","0-14.9K",5,2,4,1,4,1]
["ID1373","2012-05-29T20:03:07",33000,33000,"USD",33000,33000,{"$f":"OFFSET(F978,0,Brains!$D$1,1,1)","v":33000},"Quality Control Supervisor","Controller","USA","USA","4 to 6","4 to 6 hours a day","0-5 yrs","30-49.9K",5,3,4,1,4,3]
["ID1052","2012-05-28T14:12:35","12000 $",12000,"USD",12000,12000,{"$f":"OFFSET(F979,0,Brains!$D$1,1,1)","v":12000},"planning & Sales Control emploee","Controller","Iran","Iran","4 to 6","4 to 6 hours a day","0-5 yrs","0-14.9K",5,3,4,1,4,1]
["ID0923","2012-05-27T20:43:13","Rs. 144000",144000,"INR",2564.3400029917298,7170.6005377950405,{"$f":"OFFSET(F980,0,Brains!$D$1,1,1)","v":7170.6005377950405},"operation supervisor","Controller","India","India","4 to 6","4 to 6 hours a day","0-5 yrs","0-14.9K",5,4,4,1,4,1]
["ID0834","2012-05-26T23:17:09","15600 â‚¬",15600,"EUR",19818.231248269083,19596.70976267882,{"$f":"OFFSET(F981,0,Brains!$D$1,1,1)","v":19596.70976267882},"Managment controller","Controller","Portugal","Portugal","4 to 6","4 to 6 hours a day","0-5 yrs","15-29.9K",5,5,4,1,4,2]
["ID0933","2012-05-27T22:35:22",42000,42000,"USD",42000,42000,{"$f":"OFFSET(F982,0,Brains!$D$1,1,1)","v":42000},"Credit Controller","Controller","Saudi Arabia","Saudi Arabia","All 8","All the 8 hours baby, all the 8!","11-20 yrs","30-49.9K",8,15,5,3,4,3]
["ID1609","2012-06-02T01:43:24",2300,27600,"EUR",35063.024516168378,34671.101887816374,{"$f":"OFFSET(F983,0,Brains!$D$1,1,1)","v":34671.101887816374},"controller","Controller","Hungary","Hungary","All 8","All the 8 hours baby, all the 8!","11-20 yrs","30-49.9K",8,15,5,3,4,3]
["ID1804","2012-06-12T03:32:27",65000,65000,"USD",65000,65000,{"$f":"OFFSET(F984,0,Brains!$D$1,1,1)","v":65000},"Assistant Controller","Controller","USA","USA","2 to 3","2 to 3 hours per day","11-20 yrs","50-74.9K",2.5,13,3,3,4,4]
["ID1816","2012-06-12T20:47:33","aud145000",145000,"AUD",147886.90017838217,92239.185750636141,{"$f":"OFFSET(F985,0,Brains!$D$1,1,1)","v":92239.185750636141},"Financial controller","Controller","Australia","Australia","2 to 3","2 to 3 hours per day","11-20 yrs","75-99.9K",2.5,15,3,3,4,5]
["ID1660","2012-06-04T14:25:45","240000 INR",240000,"INR",4273.9000049862161,11951.000896325068,{"$f":"OFFSET(F986,0,Brains!$D$1,1,1)","v":11951.000896325068},"Exicutive TQM","Controller","India","India","2 to 3","2 to 3 hours per day","11-20 yrs","0-14.9K",2.5,15,3,3,4,1]
["ID0844","2012-05-27T00:19:04",100000,100000,"GBP",157617.8272067284,148367.95252225519,{"$f":"OFFSET(F987,0,Brains!$D$1,1,1)","v":148367.95252225519},"Financial Controller","Controller","UK","UK","2 to 3","2 to 3 hours per day","11-20 yrs","100-149.9K",2.5,20,3,3,4,6]
["ID1867","2012-06-15T20:50:49","EUR 90000",90000,"EUR",114335.9495092447,113057.94093853167,{"$f":"OFFSET(F988,0,Brains!$D$1,1,1)","v":113057.94093853167},"Controller","Controller","mainland Europe (Euro zone)","Europe","2 to 3","2 to 3 hours per day","11-20 yrs","100-149.9K",2.5,20,3,3,4,6]
["ID1167","2012-05-28T22:36:22",75000,75000,"USD",75000,75000,{"$f":"OFFSET(F989,0,Brains!$D$1,1,1)","v":75000},"Controller","Controller","USA","USA","2 to 3","2 to 3 hours per day","11-20 yrs","75-99.9K",2.5,20,3,3,4,5]
["ID1235","2012-05-29T02:26:28","100000 USD",100000,"USD",100000,100000,{"$f":"OFFSET(F990,0,Brains!$D$1,1,1)","v":100000},"Controller","Controller","Norway","Norway","4 to 6","4 to 6 hours a day","11-20 yrs","100-149.9K",5,12,4,3,4,6]
["ID0820","2012-05-26T22:43:11","Â£55000",55000,"GBP",86689.804963700633,81602.373887240348,{"$f":"OFFSET(F991,0,Brains!$D$1,1,1)","v":81602.373887240348},"Financial controller","Controller","UK","UK","4 to 6","4 to 6 hours a day","11-20 yrs","75-99.9K",5,12,4,3,4,5]
["ID1367","2012-05-29T19:33:07",45000,45000,"EUR",57167.974754622352,56528.970469265834,{"$f":"OFFSET(F992,0,Brains!$D$1,1,1)","v":56528.970469265834},"Junior Controller","Controller","Germany","Germany","4 to 6","4 to 6 hours a day","11-20 yrs","50-74.9K",5,12,4,3,4,4]
["ID0903","2012-05-27T15:25:40",1300,15600,"USD",15600,15600,{"$f":"OFFSET(F993,0,Brains!$D$1,1,1)","v":15600},"Document controller ","Controller","Kuwait ","Kuwait","4 to 6","4 to 6 hours a day","11-20 yrs","15-29.9K",5,13,4,3,4,2]
["ID1394","2012-05-29T22:04:09",180000,180000,"EUR",228671.89901848941,226115.88187706334,{"$f":"OFFSET(F994,0,Brains!$D$1,1,1)","v":226115.88187706334},"MIS Controller","Controller","Europe","Europe","4 to 6","4 to 6 hours a day","11-20 yrs","150-249.9K",5,15,4,3,4,7]
["ID1170","2012-05-28T22:39:09","Â£80000",80000,"GBP",126094.26176538273,118694.36201780415,{"$f":"OFFSET(F995,0,Brains!$D$1,1,1)","v":118694.36201780415},"Financial Controller","Controller","UK","UK","4 to 6","4 to 6 hours a day","11-20 yrs","100-149.9K",5,15,4,3,4,6]
["ID0618","2012-05-26T10:51:05",80000,80000,"USD",80000,80000,{"$f":"OFFSET(F996,0,Brains!$D$1,1,1)","v":80000},"Sales Controller","Controller","USA","USA","4 to 6","4 to 6 hours a day","11-20 yrs","75-99.9K",5,15,4,3,4,5]
["ID1370","2012-05-29T19:50:25",62000,62000,"EUR",78764.765217479682,77884.359313210705,{"$f":"OFFSET(F997,0,Brains!$D$1,1,1)","v":77884.359313210705},"Controller","Controller","Netherlands","Netherlands","4 to 6","4 to 6 hours a day","11-20 yrs","75-99.9K",5,15,4,3,4,5]
["ID1638","2012-06-03T07:16:47","485000 DKK",485000,"DKK",82888.5550559455,55836.979046741879,{"$f":"OFFSET(F998,0,Brains!$D$1,1,1)","v":55836.979046741879},"Controller","Controller","Denmark","Denmark","4 to 6","4 to 6 hours a day","11-20 yrs","50-74.9K",5,18,4,3,4,4]
["ID1271","2012-05-29T09:38:14",69000,69000,"USD",69000,69000,{"$f":"OFFSET(F999,0,Brains!$D$1,1,1)","v":69000},"master scheduler","Controller","USA","USA","4 to 6","4 to 6 hours a day","11-20 yrs","50-74.9K",5,20,4,3,4,4]
["ID0561","2012-05-26T06:01:57",1300,15600,"USD",15600,15600,{"$f":"OFFSET(F1000,0,Brains!$D$1,1,1)","v":15600},"CONTROLLER","Controller","BRA","Brazil","4 to 6","4 to 6 hours a day","11-20 yrs","15-29.9K",5,20,4,3,4,2]
["ID0615","2012-05-26T10:32:07","1150 $",13800,"USD",13800,13800,{"$f":"OFFSET(F1001,0,Brains!$D$1,1,1)","v":13800},"QS","Controller","Sri Lanka","Sri Lanka","4 to 6","4 to 6 hours a day","11-20 yrs","0-14.9K",5,20,4,3,4,1]
["ID1825","2012-06-13T03:23:05","$214,000  USD",214000,"USD",214000,214000,{"$f":"OFFSET(F1002,0,Brains!$D$1,1,1)","v":214000},"Assistant Corporate Controller","Controller","USA","USA","All 8","All the 8 hours baby, all the 8!","11-20 yrs","150-249.9K",8,20,5,3,4,7]
["ID1848","2012-06-15T00:52:38",2000,24000,"USD",24000,24000,{"$f":"OFFSET(F1003,0,Brains!$D$1,1,1)","v":24000},"Plant Controller","Controller","Russia","Russia","All 8","All the 8 hours baby, all the 8!","21-30 yrs","15-29.9K",8,23,5,4,4,2]
["ID1379","2012-05-29T21:25:03",103000,103000,"USD",103000,103000,{"$f":"OFFSET(F1004,0,Brains!$D$1,1,1)","v":103000},"Controller","Controller","USA","USA","4 to 6","4 to 6 hours a day","21-30 yrs","100-149.9K",5,22,4,4,4,6]
["ID0927","2012-05-27T21:21:41",150000,150000,"USD",150000,150000,{"$f":"OFFSET(F1005,0,Brains!$D$1,1,1)","v":150000},"Controller","Controller","USA","USA","4 to 6","4 to 6 hours a day","21-30 yrs","150-249.9K",5,25,4,4,4,7]
["ID1251","2012-05-29T05:47:34","GBP 43,000",43000,"GBP",67775.665698893223,63798.219584569728,{"$f":"OFFSET(F1006,0,Brains!$D$1,1,1)","v":63798.219584569728},"Financial Controller","Controller","UK","UK","4 to 6","4 to 6 hours a day","21-30 yrs","50-74.9K",5,25,4,4,4,4]
["ID1307","2012-05-29T14:10:28","AUS 49,000",49000,"AUD",49975.573163729154,31170.483460559797,{"$f":"OFFSET(F1007,0,Brains!$D$1,1,1)","v":31170.483460559797},"Document Control","Controller","Australia","Australia","4 to 6","4 to 6 hours a day","21-30 yrs","30-49.9K",5,30,4,4,4,3]
["ID1500","2012-05-30T22:31:33","33500 â‚¬",33500,"EUR",42558.381206218859,42082.678016009006,{"$f":"OFFSET(F1008,0,Brains!$D$1,1,1)","v":42082.678016009006},"Controller / VBA Developet","Controller","Germany","Germany","All 8","All the 8 hours baby, all the 8!","6-10 yrs","30-49.9K",8,8,5,2,4,3]
["ID1285","2012-05-29T11:46:47","INR 900000",900000,"INR",16027.125018698311,44816.253361219002,{"$f":"OFFSET(F1009,0,Brains!$D$1,1,1)","v":44816.253361219002},"RENTAL INVENTORY CONTROLLER","Controller","India","India","All 8","All the 8 hours baby, all the 8!","6-10 yrs","30-49.9K",8,8,5,2,4,3]
["ID1580","2012-06-01T05:56:20","120000 MAD",120000,"MAD",13745.704467353951,24096.385542168671,{"$f":"OFFSET(F1010,0,Brains!$D$1,1,1)","v":24096.385542168671},"Supply chain Controller","Controller","Morocco","Morocco","All 8","All the 8 hours baby, all the 8!","6-10 yrs","15-29.9K",8,8,5,2,4,2]
["ID1045","2012-05-28T13:42:12",725,8700,"USD",8700,8700,{"$f":"OFFSET(F1011,0,Brains!$D$1,1,1)","v":8700},"Project Controlling (MIS Reports)","Controller","India","India","2 to 3","2 to 3 hours per day","6-10 yrs","0-14.9K",2.5,7,3,2,4,1]
["ID1431","2012-05-30T02:18:02","92000 USD",92000,"USD",92000,92000,{"$f":"OFFSET(F1012,0,Brains!$D$1,1,1)","v":92000},"Controller","Controller","USA","USA","2 to 3","2 to 3 hours per day","6-10 yrs","75-99.9K",2.5,9,3,2,4,5]
["ID0914","2012-05-27T17:10:36",36000,36000,"USD",36000,36000,{"$f":"OFFSET(F1013,0,Brains!$D$1,1,1)","v":36000},"QA Supervisor","Controller","Czech Republic","Czech Republic","2 to 3","2 to 3 hours per day","6-10 yrs","30-49.9K",2.5,9,3,2,4,3]
["ID0565","2012-05-26T06:20:38",140000,140000,"USD",140000,140000,{"$f":"OFFSET(F1014,0,Brains!$D$1,1,1)","v":140000},"controller","Controller","USA","USA","2 to 3","2 to 3 hours per day","6-10 yrs","100-149.9K",2.5,10,3,2,4,6]
["ID1186","2012-05-28T22:58:25",48000,48000,"USD",48000,48000,{"$f":"OFFSET(F1015,0,Brains!$D$1,1,1)","v":48000},"Cost Controlling Executive","Controller","Qatar","Qatar","2 to 3","2 to 3 hours per day","6-10 yrs","30-49.9K",2.5,10,3,2,4,3]
["ID0827","2012-05-26T23:03:21","US$30,000",30000,"USD",30000,30000,{"$f":"OFFSET(F1016,0,Brains!$D$1,1,1)","v":30000},"Financial Control Section Headm","Controller","Inonesia","Indonesia","4 to 6","4 to 6 hours a day","6-10 yrs","30-49.9K",5,7,4,2,4,3]
["ID1739","2012-06-07T20:48:04","Â£73000",73000,"GBP",115061.01386091174,108308.60534124629,{"$f":"OFFSET(F1017,0,Brains!$D$1,1,1)","v":108308.60534124629},"Financial Controller","Controller","UK","UK","4 to 6","4 to 6 hours a day","6-10 yrs","100-149.9K",5,8,4,2,4,6]
["ID1899","2012-06-19T04:55:06",28000,28000,"EUR",35571.184291765021,35173.581625320963,{"$f":"OFFSET(F1018,0,Brains!$D$1,1,1)","v":35173.581625320963},"controller","Controller","Spain","Spain","4 to 6","4 to 6 hours a day","6-10 yrs","30-49.9K",5,8,4,2,4,3]
["ID1084","2012-05-28T15:37:23",1200000,1200000,"INR",21369.500024931083,59755.004481625336,{"$f":"OFFSET(F1019,0,Brains!$D$1,1,1)","v":59755.004481625336},"finance controller","Controller","India","India","4 to 6","4 to 6 hours a day","6-10 yrs","50-74.9K",5,8,4,2,4,4]
["ID1494","2012-05-30T20:53:12","7200 USD per year aprox",7200,"USD",7200,7200,{"$f":"OFFSET(F1020,0,Brains!$D$1,1,1)","v":7200},"control process auxiliary","Controller","Colombia","Colombia","4 to 6","4 to 6 hours a day","6-10 yrs","0-14.9K",5,8,4,2,4,1]
["ID1842","2012-06-14T07:16:41",80000,80000,"USD",80000,80000,{"$f":"OFFSET(F1021,0,Brains!$D$1,1,1)","v":80000},"Project Controller","Controller","USA","USA","4 to 6","4 to 6 hours a day","6-10 yrs","75-99.9K",5,9,4,2,4,5]
["ID1025","2012-05-28T12:26:42",65000,65000,"USD",65000,65000,{"$f":"OFFSET(F1022,0,Brains!$D$1,1,1)","v":65000},"Controller","Controller","USA","USA","4 to 6","4 to 6 hours a day","6-10 yrs","50-74.9K",5,9,4,2,4,4]
["ID1608","2012-06-02T01:29:04","â‚¬ 50k",50000,"EUR",63519.971949580387,62809.967188073148,{"$f":"OFFSET(F1023,0,Brains!$D$1,1,1)","v":62809.967188073148},"Controller","Controller","Netherlands","Netherlands","4 to 6","4 to 6 hours a day","6-10 yrs","50-74.9K",5,10,4,2,4,4]
["ID1323","2012-05-29T15:46:17","about 24.000 â‚¬",24000,"EUR",30489.586535798586,30148.784250275108,{"$f":"OFFSET(F1024,0,Brains!$D$1,1,1)","v":30148.784250275108},"Controller","Controller","Italy","Italy","4 to 6","4 to 6 hours a day","6-10 yrs","30-49.9K",5,10,4,2,4,3]
["ID0167","2012-05-26T00:47:57",145000,145000,"USD",145000,145000,{"$f":"OFFSET(F1025,0,Brains!$D$1,1,1)","v":145000},"Financialcontroller","Controller","Switzerland","Switzerland","All 8","All the 8 hours baby, all the 8!",null,"100-149.9K",8,null,5,null,4,6]
["ID0305","2012-05-26T01:22:48","65000 euro",65000,"EUR",82575.963534454509,81652.957344495095,{"$f":"OFFSET(F1026,0,Brains!$D$1,1,1)","v":81652.957344495095},"controller","Controller","germany","Germany","All 8","All the 8 hours baby, all the 8!",null,{"$f":"IF(H1026<15000,\"0-14.9K\",IF(H1026<30000,\"15-29.9K\",IF(H1026<50000,\"30-49.9K\",IF(H1026<75000,\"50-74.9K\",IF(H1026<100000,\"75-99.9K\",IF(H1026<150000,\"100-149.9K\",IF(H1026<250000,\"150-249.9K\",\"250K+\")))))))","v":"75-99.9K"},8,null,5,null,4,{"$f":"IF(H1026<15000,1,IF(H1026<30000,2,IF(H1026<50000,3,IF(H1026<75000,4,IF(H1026<100000,5,IF(H1026<150000,6,IF(H1026<250000,7,8)))))))","v":5}]
["ID0002","2012-05-25T03:13:13","15000 usd",15000,"USD",15000,15000,{"$f":"OFFSET(F1027,0,Brains!$D$1,1,1)","v":15000},"cost control","Controller","europe/Croatia","Croatia","All 8","All the 8 hours baby, all the 8!",null,"15-29.9K",8,null,5,null,4,2]
["ID0446","2012-05-26T02:48:32",110000,110000,"CAD",108169.76753333595,88070.456365092061,{"$f":"OFFSET(F1028,0,Brains!$D$1,1,1)","v":88070.456365092061},"Continuos improvment","Controller","Canad","Canada","2 to 3","2 to 3 hours per day",null,"75-99.9K",2.5,null,3,null,4,5]
["ID0433","2012-05-26T02:33:10","Â£65000",65000,"GBP",102451.58768437347,96439.16913946587,{"$f":"OFFSET(F1029,0,Brains!$D$1,1,1)","v":96439.16913946587},"Financial Controller","Controller","UK","UK","2 to 3","2 to 3 hours per day",null,"75-99.9K",2.5,null,3,null,4,5]
["ID0004","2012-05-25T03:23:42",48000,48000,"USD",48000,48000,{"$f":"OFFSET(F1030,0,Brains!$D$1,1,1)","v":48000},"Quality Control","Controller","Pakistan","Pakistan","2 to 3","2 to 3 hours per day",null,"30-49.9K",2.5,null,3,null,4,3]
["ID0198","2012-05-26T00:52:37","US$ 99000",99000,"USD",99000,99000,{"$f":"OFFSET(F1031,0,Brains!$D$1,1,1)","v":99000},"Business Controller","Controller","USA","USA","4 to 6","4 to 6 hours a day",null,"75-99.9K",5,null,4,null,4,5]
["ID0117","2012-05-26T00:41:35",85000,85000,"USD",85000,85000,{"$f":"OFFSET(F1032,0,Brains!$D$1,1,1)","v":85000},"Financial Controller","Controller","UAE","UAE","4 to 6","4 to 6 hours a day",null,"75-99.9K",5,null,4,null,4,5]
["ID0223","2012-05-26T00:57:44",72500,72500,"USD",72500,72500,{"$f":"OFFSET(F1033,0,Brains!$D$1,1,1)","v":72500},"Assistant Controller","Controller","USA","USA","4 to 6","4 to 6 hours a day",null,"50-74.9K",5,null,4,null,4,4]
["ID0403","2012-05-26T02:06:56",72000,72000,"CAD",70802.029658183528,57646.116893514802,{"$f":"OFFSET(F1034,0,Brains!$D$1,1,1)","v":57646.116893514802},"Controller","Controller","Canada","Canada","4 to 6","4 to 6 hours a day",null,"50-74.9K",5,null,4,null,4,4]
["ID0506","2012-05-26T04:10:53",55500,55500,"USD",55500,55500,{"$f":"OFFSET(F1035,0,Brains!$D$1,1,1)","v":55500},"Sr QS","Controller","UAE","UAE","4 to 6","4 to 6 hours a day",null,"50-74.9K",5,null,4,null,4,4]
["ID0308","2012-05-26T01:23:43",85000,85000,"USD",85000,85000,{"$f":"OFFSET(F1036,0,Brains!$D$1,1,1)","v":85000},"Plant Controller","Controller","USA","USA","All 8","All the 8 hours baby, all the 8!",null,"75-99.9K",8,null,5,null,4,5]
["ID1653","2012-06-04T02:30:11",10000,10000,"USD",10000,10000,{"$f":"OFFSET(F1037,0,Brains!$D$1,1,1)","v":10000},"ceo","CXO or Top Mgmt.","India","India","All 8","All the 8 hours baby, all the 8!","0-5 yrs","0-14.9K",8,1,5,1,5,1]
["ID1012","2012-05-28T11:33:05","AUD$70,000",70000,"AUD",71393.675948184507,44529.262086513998,{"$f":"OFFSET(F1038,0,Brains!$D$1,1,1)","v":44529.262086513998},"Director","CXO or Top Mgmt.","Australia","Australia","All 8","All the 8 hours baby, all the 8!","0-5 yrs","30-49.9K",8,2,5,1,5,3]
["ID1423","2012-05-30T01:12:35","INR 750000",750000,"INR",13355.937515581925,37346.877801015835,{"$f":"OFFSET(F1039,0,Brains!$D$1,1,1)","v":37346.877801015835},"Associate - Indirect Tax","CXO or Top Mgmt.","India","India","1 or 2","1 or 2 hours a day","0-5 yrs","30-49.9K",1.5,1,2,1,5,3]
["ID1697","2012-06-05T22:05:10",75000,75000,"USD",75000,75000,{"$f":"OFFSET(F1040,0,Brains!$D$1,1,1)","v":75000},"Directer of Sales Support","CXO or Top Mgmt.","USA","USA","2 to 3","2 to 3 hours per day","0-5 yrs","75-99.9K",2.5,3,3,1,5,5]
["ID1928","2012-06-20T20:58:23",8400,100800,"USD",100800,100800,{"$f":"OFFSET(F1041,0,Brains!$D$1,1,1)","v":100800},"AVP","CXO or Top Mgmt.","Oman","Oman","4 to 6","4 to 6 hours a day","0-5 yrs","100-149.9K",5,4,4,1,5,6]
["ID0697","2012-05-26T13:31:20","Rs. 150000",150000,"INR",2671.1875031163854,7469.375560203167,{"$f":"OFFSET(F1042,0,Brains!$D$1,1,1)","v":7469.375560203167},"Oprations head","CXO or Top Mgmt.","India","India","4 to 6","4 to 6 hours a day","0-5 yrs","0-14.9K",5,4.5,4,1,5,1]
["ID0793","2012-05-26T20:27:19",100000,100000,"CAD",98336.152303032693,80064.051240992791,{"$f":"OFFSET(F1043,0,Brains!$D$1,1,1)","v":80064.051240992791},"VP Infrastructure","CXO or Top Mgmt.","Canada","Canada","4 to 6","4 to 6 hours a day","0-5 yrs","75-99.9K",5,5,4,1,5,5]
["ID1704","2012-06-06T01:41:40","US$45,000",45000,"USD",45000,45000,{"$f":"OFFSET(F1044,0,Brains!$D$1,1,1)","v":45000},"CFO","CXO or Top Mgmt.","Mexico","Mexico","4 to 6","4 to 6 hours a day","0-5 yrs","30-49.9K",5,5,4,1,5,3]
["ID1277","2012-05-29T10:11:28",35000,35000,"USD",35000,35000,{"$f":"OFFSET(F1045,0,Brains!$D$1,1,1)","v":35000},"AVP Securitisation","CXO or Top Mgmt.","Malaysia","Malaysia","All 8","All the 8 hours baby, all the 8!","11-20 yrs","30-49.9K",8,12,5,3,5,3]
["ID1247","2012-05-29T05:03:26","dkk 450000",450000,"DKK",76906.906752939132,51807.506332028548,{"$f":"OFFSET(F1046,0,Brains!$D$1,1,1)","v":51807.506332028548},"owner","CXO or Top Mgmt.","Denmark","Denmark","All 8","All the 8 hours baby, all the 8!","11-20 yrs","50-74.9K",8,17,5,3,5,4]
["ID1357","2012-05-29T18:55:20",105000,105000,"USD",105000,105000,{"$f":"OFFSET(F1047,0,Brains!$D$1,1,1)","v":105000},"Director of Technology","CXO or Top Mgmt.","USA","USA","1 or 2","1 or 2 hours a day","11-20 yrs","100-149.9K",1.5,15,2,3,5,6]
["ID0563","2012-05-26T06:10:08",188000,188000,"USD",188000,188000,{"$f":"OFFSET(F1048,0,Brains!$D$1,1,1)","v":188000},"Director, Supply Chain Operations","CXO or Top Mgmt.","USA","USA","1 or 2","1 or 2 hours a day","11-20 yrs","150-249.9K",1.5,20,2,3,5,7]
["ID1137","2012-05-28T18:38:06",100000,100000,"EUR",127039.94389916077,125619.9343761463,{"$f":"OFFSET(F1049,0,Brains!$D$1,1,1)","v":125619.9343761463},"Finance Director","CXO or Top Mgmt.","Spain","Spain","1 or 2","1 or 2 hours a day","11-20 yrs","100-149.9K",1.5,20,2,3,5,6]
["ID1852","2012-06-15T02:30:11","US$ 85000",85000,"USD",85000,85000,{"$f":"OFFSET(F1050,0,Brains!$D$1,1,1)","v":85000},"Chief Financial Officer","CXO or Top Mgmt.","USA","USA","2 to 3","2 to 3 hours per day","11-20 yrs","75-99.9K",2.5,15,3,3,5,5]
["ID1523","2012-05-31T05:31:54",170000,170000,"USD",170000,170000,{"$f":"OFFSET(F1051,0,Brains!$D$1,1,1)","v":170000},"CFO","CXO or Top Mgmt.","USA","USA","2 to 3","2 to 3 hours per day","11-20 yrs","150-249.9K",2.5,18,3,3,5,7]
["ID0778","2012-05-26T18:38:41",55000,55000,"EUR",69871.969144538423,69090.963906880454,{"$f":"OFFSET(F1052,0,Brains!$D$1,1,1)","v":69090.963906880454},"CFO","CXO or Top Mgmt.","italy","Italy","2 to 3","2 to 3 hours per day","11-20 yrs","50-74.9K",2.5,18,3,3,5,4]
["ID1382","2012-05-29T21:29:36",100000,100000,"USD",100000,100000,{"$f":"OFFSET(F1053,0,Brains!$D$1,1,1)","v":100000},"Vice Head of Dpt in Education","CXO or Top Mgmt.","Sweden","Sweden","2 to 3","2 to 3 hours per day","11-20 yrs","100-149.9K",2.5,20,3,3,5,6]
["ID1656","2012-06-04T10:23:27",225000,225000,"USD",225000,225000,{"$f":"OFFSET(F1054,0,Brains!$D$1,1,1)","v":225000},"SVP of Acquisitions","CXO or Top Mgmt.","USA","USA","4 to 6","4 to 6 hours a day","11-20 yrs","150-249.9K",5,15,4,3,5,7]
["ID0978","2012-05-28T07:29:43",125000,125000,"AUD",127488.70705032947,79516.53944020356,{"$f":"OFFSET(F1055,0,Brains!$D$1,1,1)","v":79516.53944020356},"Director, Informatics","CXO or Top Mgmt.","Australia","Australia","4 to 6","4 to 6 hours a day","11-20 yrs","75-99.9K",5,15,4,3,5,5]
["ID0806","2012-05-26T21:27:17",85000,85000,"USD",85000,85000,{"$f":"OFFSET(F1056,0,Brains!$D$1,1,1)","v":85000},"Director, IT/Operations","CXO or Top Mgmt.","USA","USA","4 to 6","4 to 6 hours a day","11-20 yrs","75-99.9K",5,15,4,3,5,5]
["ID0896","2012-05-27T14:27:33","rs 100000",1200000,"INR",21369.500024931083,59755.004481625336,{"$f":"OFFSET(F1057,0,Brains!$D$1,1,1)","v":59755.004481625336},"ASST VICE PREDISDENT","CXO or Top Mgmt.","India","India","4 to 6","4 to 6 hours a day","11-20 yrs","50-74.9K",5,17,4,3,5,4]
["ID1539","2012-05-31T16:00:16",8000,8000,"USD",8000,8000,{"$f":"OFFSET(F1058,0,Brains!$D$1,1,1)","v":8000},"Owner","CXO or Top Mgmt.","India","India","4 to 6","4 to 6 hours a day","11-20 yrs","0-14.9K",5,18,4,3,5,1]
["ID0887","2012-05-27T13:29:52","$125000 / a excl bonus",125000,"USD",125000,125000,{"$f":"OFFSET(F1059,0,Brains!$D$1,1,1)","v":125000},"Commercial Director","CXO or Top Mgmt.","South Africa","South Africa","4 to 6","4 to 6 hours a day","11-20 yrs","100-149.9K",5,20,4,3,5,6]
["ID0869","2012-05-27T06:37:15",50000,50000,"USD",50000,50000,{"$f":"OFFSET(F1060,0,Brains!$D$1,1,1)","v":50000},"Boss","CXO or Top Mgmt.","USA","USA","All 8","All the 8 hours baby, all the 8!","11-20 yrs","50-74.9K",8,15,5,3,5,4]
["ID1070","2012-05-28T14:53:02",50000,50000,"USD",50000,50000,{"$f":"OFFSET(F1061,0,Brains!$D$1,1,1)","v":50000},"Managing Partner","CXO or Top Mgmt.","India","India","1 or 2","1 or 2 hours a day","21-30 yrs","50-74.9K",1.5,26,2,4,5,4]
["ID1087","2012-05-28T15:47:46","Â£55000",55000,"GBP",86689.804963700633,81602.373887240348,{"$f":"OFFSET(F1062,0,Brains!$D$1,1,1)","v":81602.373887240348},"Finance Director","CXO or Top Mgmt.","UK","UK","2 to 3","2 to 3 hours per day","21-30 yrs","75-99.9K",2.5,22,3,4,5,5]
["ID0584","2012-05-26T07:44:04",300000,300000,"USD",300000,300000,{"$f":"OFFSET(F1063,0,Brains!$D$1,1,1)","v":300000},"CEO","CXO or Top Mgmt.","USA","USA","2 to 3","2 to 3 hours per day","21-30 yrs","250K+",2.5,30,3,4,5,8]
["ID1577","2012-06-01T05:32:31","35000 GBP",35000,"GBP",55166.239522354947,51928.783382789312,{"$f":"OFFSET(F1064,0,Brains!$D$1,1,1)","v":51928.783382789312},"finance director","CXO or Top Mgmt.","UK","UK","2 to 3","2 to 3 hours per day","21-30 yrs","50-74.9K",2.5,30,3,4,5,4]
["ID0580","2012-05-26T07:23:11",150000,150000,"USD",150000,150000,{"$f":"OFFSET(F1065,0,Brains!$D$1,1,1)","v":150000},"CFO","CXO or Top Mgmt.","USA","USA","4 to 6","4 to 6 hours a day","21-30 yrs","150-249.9K",5,22,4,4,5,7]
["ID0870","2012-05-27T07:19:14",135000,135000,"USD",135000,135000,{"$f":"OFFSET(F1066,0,Brains!$D$1,1,1)","v":135000},"Director, P&A","CXO or Top Mgmt.","USA","USA","4 to 6","4 to 6 hours a day","21-30 yrs","100-149.9K",5,25,4,4,5,6]
["ID1522","2012-05-31T05:23:58",127500,127500,"USD",127500,127500,{"$f":"OFFSET(F1067,0,Brains!$D$1,1,1)","v":127500},"SVP","CXO or Top Mgmt.","USA","USA","All 8","All the 8 hours baby, all the 8!","21-30 yrs","100-149.9K",8,22,5,4,5,6]
["ID1286","2012-05-29T11:51:35",192000,192000,"USD",192000,192000,{"$f":"OFFSET(F1068,0,Brains!$D$1,1,1)","v":192000},"Publisher","CXO or Top Mgmt.","USA","USA","All 8","All the 8 hours baby, all the 8!","21-30 yrs","150-249.9K",8,27,5,4,5,7]
["ID0893","2012-05-27T13:52:53","100,000 usd",100000,"USD",100000,100000,{"$f":"OFFSET(F1069,0,Brains!$D$1,1,1)","v":100000},"Director","CXO or Top Mgmt.","MÃ©xico","Mexico","All 8","All the 8 hours baby, all the 8!","6-10 yrs","100-149.9K",8,10,5,2,5,6]
["ID0641","2012-05-26T11:45:37","4500000 inr/pa",4500000,"INR",80135.625093491559,224081.26680609499,{"$f":"OFFSET(F1070,0,Brains!$D$1,1,1)","v":224081.26680609499},"cmo","CXO or Top Mgmt.","India","India","1 or 2","1 or 2 hours a day","6-10 yrs","150-249.9K",1.5,6,2,2,5,7]
["ID1624","2012-06-02T17:34:20","50000USD",50000,"USD",50000,50000,{"$f":"OFFSET(F1071,0,Brains!$D$1,1,1)","v":50000},"Associate Vice President","CXO or Top Mgmt.","India","India","1 or 2","1 or 2 hours a day","6-10 yrs","50-74.9K",1.5,8,2,2,5,4]
["ID0981","2012-05-28T07:46:28",260000,260000,"USD",260000,260000,{"$f":"OFFSET(F1072,0,Brains!$D$1,1,1)","v":260000},"CFO","CXO or Top Mgmt.","USA","USA","2 to 3","2 to 3 hours per day","6-10 yrs","250K+",2.5,10,3,2,5,8]
["ID1843","2012-06-14T12:27:30",118000,118000,"USD",118000,118000,{"$f":"OFFSET(F1073,0,Brains!$D$1,1,1)","v":118000},"AVP","CXO or Top Mgmt.","USA","USA","4 to 6","4 to 6 hours a day","6-10 yrs","100-149.9K",5,6,4,2,5,6]
["ID1592","2012-06-01T15:09:27",1700000,1700000,"INR",30273.458368652366,84652.923015635897,{"$f":"OFFSET(F1074,0,Brains!$D$1,1,1)","v":84652.923015635897},"AVP","CXO or Top Mgmt.","India","India","4 to 6","4 to 6 hours a day","6-10 yrs","75-99.9K",5,6,4,2,5,5]
["ID1117","2012-05-28T17:05:07","Â£45000",45000,"GBP",70928.022243027779,66765.578635014841,{"$f":"OFFSET(F1075,0,Brains!$D$1,1,1)","v":66765.578635014841},"Assistant Director - Performance Information","CXO or Top Mgmt.","UK","UK","4 to 6","4 to 6 hours a day","6-10 yrs","50-74.9K",5,8,4,2,5,4]
["ID0938","2012-05-27T23:32:30",20571,20571,"USD",20571,20571,{"$f":"OFFSET(F1076,0,Brains!$D$1,1,1)","v":20571},"CFO","CXO or Top Mgmt.","Albania","Albania","4 to 6","4 to 6 hours a day","6-10 yrs","15-29.9K",5,8,4,2,5,2]
["ID1081","2012-05-28T15:33:37","INR 2500000",2500000,"INR",44519.791718606422,124489.59267005278,{"$f":"OFFSET(F1077,0,Brains!$D$1,1,1)","v":124489.59267005278},"Vice President","CXO or Top Mgmt.","India","India","4 to 6","4 to 6 hours a day","6-10 yrs","100-149.9K",5,9,4,2,5,6]
["ID0991","2012-05-28T08:48:56",125000,125000,"USD",125000,125000,{"$f":"OFFSET(F1078,0,Brains!$D$1,1,1)","v":125000},"VP, Operational Analytics","CXO or Top Mgmt.","USA","USA","4 to 6","4 to 6 hours a day","6-10 yrs","100-149.9K",5,10,4,2,5,6]
["ID1919","2012-06-20T02:31:52",110000,110000,"USD",110000,110000,{"$f":"OFFSET(F1079,0,Brains!$D$1,1,1)","v":110000},"Vice President - Finance","CXO or Top Mgmt.","USA","USA","4 to 6","4 to 6 hours a day","6-10 yrs","100-149.9K",5,10,4,2,5,6]
["ID0829","2012-05-26T23:04:02",100000,100000,"USD",100000,100000,{"$f":"OFFSET(F1080,0,Brains!$D$1,1,1)","v":100000},"director","CXO or Top Mgmt.","USA","USA","4 to 6","4 to 6 hours a day","6-10 yrs","100-149.9K",5,10,4,2,5,6]
["ID1695","2012-06-05T21:49:10",50000,50000,"GBP",78808.913603364199,74183.976261127595,{"$f":"OFFSET(F1081,0,Brains!$D$1,1,1)","v":74183.976261127595},"Commercial Director","CXO or Top Mgmt.","UK","UK","4 to 6","4 to 6 hours a day","6-10 yrs","50-74.9K",5,10,4,2,5,4]
["ID1642","2012-06-03T12:16:15",54000,54000,"USD",54000,54000,{"$f":"OFFSET(F1082,0,Brains!$D$1,1,1)","v":54000},"assistant director of finance","CXO or Top Mgmt.","USA","USA","4 to 6","4 to 6 hours a day","6-10 yrs","50-74.9K",5,10,4,2,5,4]
["ID1060","2012-05-28T14:32:11",120000,120000,"ZAR",14630.613583549337,21156.558533145275,{"$f":"OFFSET(F1083,0,Brains!$D$1,1,1)","v":21156.558533145275},"VP","CXO or Top Mgmt.","South Africa","South Africa","4 to 6","4 to 6 hours a day","6-10 yrs","15-29.9K",5,10,4,2,5,2]
["ID0457","2012-05-26T03:02:42","800000 rupees",800000,"INR",14246.333349954055,39836.669654416888,{"$f":"OFFSET(F1084,0,Brains!$D$1,1,1)","v":39836.669654416888},"Partner","CXO or Top Mgmt.","India","India","All 8","All the 8 hours baby, all the 8!",null,"30-49.9K",8,null,5,null,5,3]
["ID0440","2012-05-26T02:39:56",120000,120000,"USD",120000,120000,{"$f":"OFFSET(F1085,0,Brains!$D$1,1,1)","v":120000},"Director","CXO or Top Mgmt.","USA","USA","1 or 2","1 or 2 hours a day",null,"100-149.9K",1.5,null,2,null,5,6]
["ID0009","2012-05-25T03:37:17","44000 $",44000,"USD",44000,44000,{"$f":"OFFSET(F1086,0,Brains!$D$1,1,1)","v":44000},"CFO","CXO or Top Mgmt.","Portugal","Portugal","1 or 2","1 or 2 hours a day",null,"30-49.9K",1.5,null,2,null,5,3]
["ID0301","2012-05-26T01:22:09",16000,16000,"USD",16000,16000,{"$f":"OFFSET(F1087,0,Brains!$D$1,1,1)","v":16000},"VP of Finance","CXO or Top Mgmt.","USA","USA","1 or 2","1 or 2 hours a day",null,"15-29.9K",1.5,null,2,null,5,2]
["ID0527","2012-05-26T04:48:54",200000,200000,"USD",200000,200000,{"$f":"OFFSET(F1088,0,Brains!$D$1,1,1)","v":200000},"COO","CXO or Top Mgmt.","USA","USA","2 to 3","2 to 3 hours per day",null,"150-249.9K",2.5,null,3,null,5,7]
["ID0375","2012-05-26T01:52:04",194000,194000,"USD",194000,194000,{"$f":"OFFSET(F1089,0,Brains!$D$1,1,1)","v":194000},"director","CXO or Top Mgmt.","USA","USA","2 to 3","2 to 3 hours per day",null,"150-249.9K",2.5,null,3,null,5,7]
["ID0482","2012-05-26T03:23:51","US$169,000",169000,"USD",169000,169000,{"$f":"OFFSET(F1090,0,Brains!$D$1,1,1)","v":169000},"Category Director (Marketing)","CXO or Top Mgmt.","USA","USA","2 to 3","2 to 3 hours per day",null,{"$f":"IF(H1090<15000,\"0-14.9K\",IF(H1090<30000,\"15-29.9K\",IF(H1090<50000,\"30-49.9K\",IF(H1090<75000,\"50-74.9K\",IF(H1090<100000,\"75-99.9K\",IF(H1090<150000,\"100-149.9K\",IF(H1090<250000,\"150-249.9K\",\"250K+\")))))))","v":"150-249.9K"},2.5,null,3,null,5,{"$f":"IF(H1090<15000,1,IF(H1090<30000,2,IF(H1090<50000,3,IF(H1090<75000,4,IF(H1090<100000,5,IF(H1090<150000,6,IF(H1090<250000,7,8)))))))","v":7}]
["ID0470","2012-05-26T03:14:44",150000,150000,"USD",150000,150000,{"$f":"OFFSET(F1091,0,Brains!$D$1,1,1)","v":150000},"CFO","CXO or Top Mgmt.","USA","USA","2 to 3","2 to 3 hours per day",null,"150-249.9K",2.5,null,3,null,5,7]
["ID0232","2012-05-26T00:59:09",114000,114000,"USD",114000,114000,{"$f":"OFFSET(F1092,0,Brains!$D$1,1,1)","v":114000},"Director","CXO or Top Mgmt.","USA","USA","2 to 3","2 to 3 hours per day",null,"100-149.9K",2.5,null,3,null,5,6]
["ID0143","2012-05-26T00:43:49",104000,104000,"USD",104000,104000,{"$f":"OFFSET(F1093,0,Brains!$D$1,1,1)","v":104000},"Finance Director","CXO or Top Mgmt.","USA","USA","2 to 3","2 to 3 hours per day",null,"100-149.9K",2.5,null,3,null,5,6]
["ID0270","2012-05-26T01:09:32",103000,103000,"USD",103000,103000,{"$f":"OFFSET(F1094,0,Brains!$D$1,1,1)","v":103000},"VP / Credit Administrator","CXO or Top Mgmt.","USA","USA","2 to 3","2 to 3 hours per day",null,"100-149.9K",2.5,null,3,null,5,6]
["ID0524","2012-05-26T04:41:20",100000,100000,"USD",100000,100000,{"$f":"OFFSET(F1095,0,Brains!$D$1,1,1)","v":100000},"Director","CXO or Top Mgmt.","USA","USA","2 to 3","2 to 3 hours per day",null,"100-149.9K",2.5,null,3,null,5,6]
["ID0536","2012-05-26T05:18:27","US$95K",95000,"USD",95000,95000,{"$f":"OFFSET(F1096,0,Brains!$D$1,1,1)","v":95000},"Director of Supply Chain","CXO or Top Mgmt.","Central America","Central America","2 to 3","2 to 3 hours per day",null,"75-99.9K",2.5,null,3,null,5,5]
["ID0380","2012-05-26T01:58:19","Â£60000",60000,"GBP",94570.696324037053,89020.771513353116,{"$f":"OFFSET(F1097,0,Brains!$D$1,1,1)","v":89020.771513353116},"Managing Director","CXO or Top Mgmt.","UK","UK","2 to 3","2 to 3 hours per day",null,"75-99.9K",2.5,null,3,null,5,5]
["ID0273","2012-05-26T01:10:20",80000,80000,"USD",80000,80000,{"$f":"OFFSET(F1098,0,Brains!$D$1,1,1)","v":80000},"VP","CXO or Top Mgmt.","USA","USA","2 to 3","2 to 3 hours per day",null,"75-99.9K",2.5,null,3,null,5,5]
["ID0402","2012-05-26T02:06:38",30000,30000,"USD",30000,30000,{"$f":"OFFSET(F1099,0,Brains!$D$1,1,1)","v":30000},"ceo","CXO or Top Mgmt.","India","India","2 to 3","2 to 3 hours per day",null,"30-49.9K",2.5,null,3,null,5,3]
["ID0371","2012-05-26T01:50:56",18000,18000,"USD",18000,18000,{"$f":"OFFSET(F1100,0,Brains!$D$1,1,1)","v":18000},"ceo","CXO or Top Mgmt.","India","India","2 to 3","2 to 3 hours per day",null,"15-29.9K",2.5,null,3,null,5,2]
["ID0493","2012-05-26T03:37:33",190000,190000,"GBP",299473.87169278396,281899.10979228484,{"$f":"OFFSET(F1101,0,Brains!$D$1,1,1)","v":281899.10979228484},"Managing Partner","CXO or Top Mgmt.","UK","UK","4 to 6","4 to 6 hours a day",null,"250K+",5,null,4,null,5,8]
["ID0091","2012-05-26T00:39:36",125000,125000,"USD",125000,125000,{"$f":"OFFSET(F1102,0,Brains!$D$1,1,1)","v":125000},"Director of Marketing","CXO or Top Mgmt.","USA","USA","4 to 6","4 to 6 hours a day",null,"100-149.9K",5,null,4,null,5,6]
["ID0554","2012-05-26T05:48:10",120000,120000,"USD",120000,120000,{"$f":"OFFSET(F1103,0,Brains!$D$1,1,1)","v":120000},"Director","CXO or Top Mgmt.","USA","USA","4 to 6","4 to 6 hours a day",null,"100-149.9K",5,null,4,null,5,6]
["ID0215","2012-05-26T00:55:06",100000,100000,"USD",100000,100000,{"$f":"OFFSET(F1104,0,Brains!$D$1,1,1)","v":100000},"Director of Finance","CXO or Top Mgmt.","USA","USA","4 to 6","4 to 6 hours a day",null,"100-149.9K",5,null,4,null,5,6]
["ID0095","2012-05-26T00:40:20",95000,95000,"USD",95000,95000,{"$f":"OFFSET(F1105,0,Brains!$D$1,1,1)","v":95000},"CFO","CXO or Top Mgmt.","USA","USA","4 to 6","4 to 6 hours a day",null,"75-99.9K",5,null,4,null,5,5]
["ID0233","2012-05-26T00:59:27",95000,95000,"USD",95000,95000,{"$f":"OFFSET(F1106,0,Brains!$D$1,1,1)","v":95000},"VP - Procurment","CXO or Top Mgmt.","USA","USA","4 to 6","4 to 6 hours a day",null,"75-99.9K",5,null,4,null,5,5]
["ID0067","2012-05-25T07:25:12",85000,85000,"AUD",86692.320794224041,54071.246819338427,{"$f":"OFFSET(F1107,0,Brains!$D$1,1,1)","v":54071.246819338427},"head of data","CXO or Top Mgmt.","Australia","Australia","4 to 6","4 to 6 hours a day",null,"50-74.9K",5,null,4,null,5,4]
["ID0024","2012-05-25T04:32:49",75000,75000,"USD",75000,75000,{"$f":"OFFSET(F1108,0,Brains!$D$1,1,1)","v":75000},"Marketing Director","CXO or Top Mgmt.","USA","USA","4 to 6","4 to 6 hours a day",null,"75-99.9K",5,null,4,null,5,5]
["ID0421","2012-05-26T02:19:48",72000,72000,"USD",72000,72000,{"$f":"OFFSET(F1109,0,Brains!$D$1,1,1)","v":72000},"IS Director","CXO or Top Mgmt.","USA","USA","4 to 6","4 to 6 hours a day",null,"50-74.9K",5,null,4,null,5,4]
["ID0083","2012-05-26T00:00:52",150000,150000,"USD",150000,150000,{"$f":"OFFSET(F1110,0,Brains!$D$1,1,1)","v":150000},"Director","CXO or Top Mgmt.","USA","USA","All 8","All the 8 hours baby, all the 8!",null,"150-249.9K",8,null,5,null,5,7]
["ID0361","2012-05-26T01:45:50","62500.00 USD",62500,"USD",62500,62500,{"$f":"OFFSET(F1111,0,Brains!$D$1,1,1)","v":62500},"Director of Payroll","CXO or Top Mgmt.","USA","USA","All 8","All the 8 hours baby, all the 8!",null,"50-74.9K",8,null,5,null,5,4]
["ID0717","2012-05-26T14:33:11",500000,500000,"INR",8903.9583437212841,24897.918534010558,{"$f":"OFFSET(F1112,0,Brains!$D$1,1,1)","v":24897.918534010558},"Engineer","Engineer","India","India","All 8","All the 8 hours baby, all the 8!","0-5 yrs","15-29.9K",8,2,5,1,6,2]
["ID0639","2012-05-26T11:39:48","Rs 300000",300000,"INR",5342.3750062327708,14938.751120406334,{"$f":"OFFSET(F1113,0,Brains!$D$1,1,1)","v":14938.751120406334},"Planning Engineer","Engineer","India","India","All 8","All the 8 hours baby, all the 8!","0-5 yrs","0-14.9K",8,2,5,1,6,1]
["ID1139","2012-05-28T18:40:08",400000,400000,"INR",7123.1666749770275,19918.334827208444,{"$f":"OFFSET(F1114,0,Brains!$D$1,1,1)","v":19918.334827208444},"software engineer","Engineer","India","India","1 or 2","1 or 2 hours a day","0-5 yrs","15-29.9K",1.5,2,2,1,6,2]
["ID0821","2012-05-26T22:43:12",15500,15500,"USD",15500,15500,{"$f":"OFFSET(F1115,0,Brains!$D$1,1,1)","v":15500},"Engineer","Engineer","India","India","1 or 2","1 or 2 hours a day","0-5 yrs","15-29.9K",1.5,3,2,1,6,2]
["ID1785","2012-06-11T03:11:39",150000,150000,"INR",2671.1875031163854,7469.375560203167,{"$f":"OFFSET(F1116,0,Brains!$D$1,1,1)","v":7469.375560203167},"ENGINEER","Engineer","India","India","2 to 3","2 to 3 hours per day","0-5 yrs","0-14.9K",2.5,1,3,1,6,1]
["ID1145","2012-05-28T19:23:29",40000,40000,"USD",40000,40000,{"$f":"OFFSET(F1117,0,Brains!$D$1,1,1)","v":40000},"Engineer","Engineer","India","India","2 to 3","2 to 3 hours per day","0-5 yrs","30-49.9K",2.5,2,3,1,6,3]
["ID0650","2012-05-26T12:14:07","Rs 800000",800000,"INR",14246.333349954055,39836.669654416888,{"$f":"OFFSET(F1118,0,Brains!$D$1,1,1)","v":39836.669654416888},"Engineer","Engineer","India","India","2 to 3","2 to 3 hours per day","0-5 yrs","30-49.9K",2.5,3,3,1,6,3]
["ID0898","2012-05-27T14:49:12","5,00,000 INR",500000,"INR",8903.9583437212841,24897.918534010558,{"$f":"OFFSET(F1119,0,Brains!$D$1,1,1)","v":24897.918534010558},"Planning Engineer","Engineer","India","India","2 to 3","2 to 3 hours per day","0-5 yrs","15-29.9K",2.5,3,3,1,6,2]
["ID0953","2012-05-28T01:30:29",57000,57000,"USD",57000,57000,{"$f":"OFFSET(F1120,0,Brains!$D$1,1,1)","v":57000},"Construction Engineer","Engineer","USA","USA","2 to 3","2 to 3 hours per day","0-5 yrs","50-74.9K",2.5,4,3,1,6,4]
["ID1030","2012-05-28T12:51:53",45000,45000,"USD",45000,45000,{"$f":"OFFSET(F1121,0,Brains!$D$1,1,1)","v":45000},"Engineer","Engineer","singapore","Singapore","2 to 3","2 to 3 hours per day","0-5 yrs","30-49.9K",2.5,4,3,1,6,3]
["ID0749","2012-05-26T16:23:30",16000,16000,"USD",16000,16000,{"$f":"OFFSET(F1122,0,Brains!$D$1,1,1)","v":16000},"Engineer","Engineer","India","India","2 to 3","2 to 3 hours per day","0-5 yrs","15-29.9K",2.5,5,3,1,6,2]
["ID1378","2012-05-29T21:17:26",50000,50000,"USD",50000,50000,{"$f":"OFFSET(F1123,0,Brains!$D$1,1,1)","v":50000},"Engineering Intern","Engineer","USA","USA","4 to 6","4 to 6 hours a day","0-5 yrs","50-74.9K",5,0.5,4,1,6,4]
["ID1362","2012-05-29T19:10:05","27,000.GBP 42,353 USD ",27000,"GBP",42556.81334581667,40059.347181008903,{"$f":"OFFSET(F1124,0,Brains!$D$1,1,1)","v":40059.347181008903},"Engineering Tech","Engineer","UK","UK","4 to 6","4 to 6 hours a day","0-5 yrs","30-49.9K",5,1,4,1,6,3]
["ID0830","2012-05-26T23:04:53",42000,42000,"EUR",53356.776437647524,52760.372437981445,{"$f":"OFFSET(F1125,0,Brains!$D$1,1,1)","v":52760.372437981445},"Project Engineer","Engineer","The Netherlands","Netherlands","4 to 6","4 to 6 hours a day","0-5 yrs","50-74.9K",5,2,4,1,6,4]
["ID1261","2012-05-29T08:13:06","RM3000",36000,"MYR",11404.820437438224,18556.701030927838,{"$f":"OFFSET(F1126,0,Brains!$D$1,1,1)","v":18556.701030927838},"Process Engineering","Engineer","Malaysia","Malaysia","4 to 6","4 to 6 hours a day","0-5 yrs","15-29.9K",5,2,4,1,6,2]
["ID1309","2012-05-29T14:34:42","500000 Rupees",500000,"INR",8903.9583437212841,24897.918534010558,{"$f":"OFFSET(F1127,0,Brains!$D$1,1,1)","v":24897.918534010558},"Senior software engineer","Engineer","India","India","4 to 6","4 to 6 hours a day","0-5 yrs","15-29.9K",5,2,4,1,6,2]
["ID0775","2012-05-26T18:19:49","2.2 lakhs per annum",220000,"INR",3917.7416712373652,10955.084154964645,{"$f":"OFFSET(F1128,0,Brains!$D$1,1,1)","v":10955.084154964645},"Associate Software Engineer","Engineer","India","India","4 to 6","4 to 6 hours a day","0-5 yrs","0-14.9K",5,2,4,1,6,1]
["ID1590","2012-06-01T14:32:41",250000,250000,"INR",4451.9791718606421,12448.959267005279,{"$f":"OFFSET(F1129,0,Brains!$D$1,1,1)","v":12448.959267005279},"Analytics engineer","Engineer","India","India","4 to 6","4 to 6 hours a day","0-5 yrs","0-14.9K",5,2.5,4,1,6,1]
["ID1461","2012-05-30T13:56:27",50000,50000,"NZD",39879.404680246938,28985.507246376812,{"$f":"OFFSET(F1130,0,Brains!$D$1,1,1)","v":28985.507246376812},"stress engineer","Engineer","nld","New Zealand","4 to 6","4 to 6 hours a day","0-5 yrs","15-29.9K",5,5,4,1,6,2]
["ID1855","2012-06-15T05:44:30",29000,29000,"USD",29000,29000,{"$f":"OFFSET(F1131,0,Brains!$D$1,1,1)","v":29000},"Customer Experence Engineer","Engineer","USA","USA","All 8","All the 8 hours baby, all the 8!","0-5 yrs","15-29.9K",8,1,5,1,6,2]
["ID1826","2012-06-13T03:48:39",78000,78000,"USD",78000,78000,{"$f":"OFFSET(F1132,0,Brains!$D$1,1,1)","v":78000},"Data Integration Engenieer","Engineer","USA","USA","All 8","All the 8 hours baby, all the 8!","0-5 yrs","75-99.9K",8,5,5,1,6,5]
["ID1810","2012-06-12T15:09:22",156000,156000,"AUD",159105.90639881117,99236.641221374055,{"$f":"OFFSET(F1133,0,Brains!$D$1,1,1)","v":99236.641221374055},"Senior Associate Engineer","Engineer","Australia","Australia","2 to 3","2 to 3 hours per day","11-20 yrs","75-99.9K",2.5,12,3,3,6,5]
["ID1688","2012-06-05T19:14:04",62000,62000,"USD",62000,62000,{"$f":"OFFSET(F1134,0,Brains!$D$1,1,1)","v":62000},"Quality Engineer","Engineer","USA","USA","2 to 3","2 to 3 hours per day","11-20 yrs","50-74.9K",2.5,12,3,3,6,4]
["ID1486","2012-05-30T19:42:50",77000,77000,"USD",77000,77000,{"$f":"OFFSET(F1135,0,Brains!$D$1,1,1)","v":77000},"Chemical Engineer","Engineer","USA","USA","2 to 3","2 to 3 hours per day","11-20 yrs","75-99.9K",2.5,13,3,3,6,5]
["ID1129","2012-05-28T17:42:57",50000,50000,"EUR",63519.971949580387,62809.967188073148,{"$f":"OFFSET(F1136,0,Brains!$D$1,1,1)","v":62809.967188073148},"Network Enginer","Engineer","Portugal","Portugal","2 to 3","2 to 3 hours per day","11-20 yrs","50-74.9K",2.5,14,3,3,6,4]
["ID1492","2012-05-30T20:42:47","AUD 165000",165000,"AUD",168285.09330643489,104961.83206106871,{"$f":"OFFSET(F1137,0,Brains!$D$1,1,1)","v":104961.83206106871},"Engineer","Engineer","Australia","Australia","2 to 3","2 to 3 hours per day","11-20 yrs","100-149.9K",2.5,17,3,3,6,6]
["ID1890","2012-06-18T05:42:18",600000,600000,"DKK",102542.54233725216,69076.675109371397,{"$f":"OFFSET(F1138,0,Brains!$D$1,1,1)","v":69076.675109371397},"Engineer","Engineer","DK","Denmark","2 to 3","2 to 3 hours per day","11-20 yrs","50-74.9K",2.5,20,3,3,6,4]
["ID1333","2012-05-29T16:41:19","41000 â‚¬",41000,"EUR",52086.37699865592,51504.173094219979,{"$f":"OFFSET(F1139,0,Brains!$D$1,1,1)","v":51504.173094219979},"engineer","Engineer","Spain","Spain","4 to 6","4 to 6 hours a day","11-20 yrs","50-74.9K",5,12,4,3,6,4]
["ID1400","2012-05-29T22:35:17",95000,95000,"USD",95000,95000,{"$f":"OFFSET(F1140,0,Brains!$D$1,1,1)","v":95000},"Stress Engineer","Engineer","USA","USA","4 to 6","4 to 6 hours a day","11-20 yrs","75-99.9K",5,14,4,3,6,5]
["ID1392","2012-05-29T21:59:35",44000,44000,"USD",44000,44000,{"$f":"OFFSET(F1141,0,Brains!$D$1,1,1)","v":44000},"Test engineer","Engineer","USA","USA","4 to 6","4 to 6 hours a day","11-20 yrs","30-49.9K",5,15,4,3,6,3]
["ID1415","2012-05-30T00:13:07","216000.00 Saudi Riyak",216000,"SAR",57600,64884.349654550919,{"$f":"OFFSET(F1142,0,Brains!$D$1,1,1)","v":64884.349654550919},"Senior Electrical Engineer","Engineer","Saudi Arabia","Saudi Arabia","4 to 6","4 to 6 hours a day","11-20 yrs","50-74.9K",5,20,4,3,6,4]
["ID1386","2012-05-29T21:44:00",69960,69960,"USD",69960,69960,{"$f":"OFFSET(F1143,0,Brains!$D$1,1,1)","v":69960},"Measurement & Verification Engineer","Engineer","USA","USA","2 to 3","2 to 3 hours per day","21-30 yrs","50-74.9K",2.5,22,3,4,6,4]
["ID1384","2012-05-29T21:38:10",85000,85000,"USD",85000,85000,{"$f":"OFFSET(F1144,0,Brains!$D$1,1,1)","v":85000},"energy engineer","Engineer","USA","USA","2 to 3","2 to 3 hours per day","21-30 yrs","75-99.9K",2.5,25,3,4,6,5]
["ID1185","2012-05-28T22:55:40","S$50000",50000,"USD",50000,50000,{"$f":"OFFSET(F1145,0,Brains!$D$1,1,1)","v":50000},"Engineer","Engineer","Singapore","Singapore","2 to 3","2 to 3 hours per day","21-30 yrs","50-74.9K",2.5,25,3,4,6,4]
["ID1211","2012-05-29T00:25:39",60000,60000,"USD",60000,60000,{"$f":"OFFSET(F1146,0,Brains!$D$1,1,1)","v":60000},"Quality Assurance Engineer","Engineer","USA","USA","1 or 2","1 or 2 hours a day","6-10 yrs","50-74.9K",1.5,6,2,2,6,4]
["ID0752","2012-05-26T16:29:36",36000,36000,"USD",36000,36000,{"$f":"OFFSET(F1147,0,Brains!$D$1,1,1)","v":36000},"ENGINEER","Engineer","uae","UAE","1 or 2","1 or 2 hours a day","6-10 yrs","30-49.9K",1.5,7,2,2,6,3]
["ID0753","2012-05-26T16:33:58",20000,20000,"USD",20000,20000,{"$f":"OFFSET(F1148,0,Brains!$D$1,1,1)","v":20000},"engineer","Engineer","India","India","1 or 2","1 or 2 hours a day","6-10 yrs","15-29.9K",1.5,7,2,2,6,2]
["ID1363","2012-05-29T19:11:31","Rs. 4.5 lakhs ",450000,"INR",8013.5625093491553,22408.126680609501,{"$f":"OFFSET(F1149,0,Brains!$D$1,1,1)","v":22408.126680609501},"Mechanical Design engineer","Engineer","India","India","1 or 2","1 or 2 hours a day","6-10 yrs","15-29.9K",1.5,7,2,2,6,2]
["ID1720","2012-06-06T19:54:49",1200,14400,"USD",14400,14400,{"$f":"OFFSET(F1150,0,Brains!$D$1,1,1)","v":14400},"Engineer","Engineer","India","India","1 or 2","1 or 2 hours a day","6-10 yrs","0-14.9K",1.5,8,2,2,6,1]
["ID1776","2012-06-10T02:29:57",80000,80000,"USD",80000,80000,{"$f":"OFFSET(F1151,0,Brains!$D$1,1,1)","v":80000},"Engineer","Engineer","Brazil","Brazil","1 or 2","1 or 2 hours a day","6-10 yrs","75-99.9K",1.5,9,2,2,6,5]
["ID0889","2012-05-27T13:41:04","400000 Rs",400000,"INR",7123.1666749770275,19918.334827208444,{"$f":"OFFSET(F1152,0,Brains!$D$1,1,1)","v":19918.334827208444},"engineer","Engineer","India","India","2 to 3","2 to 3 hours per day","6-10 yrs","15-29.9K",2.5,6,3,2,6,2]
["ID1854","2012-06-15T03:51:50","Â£33500",33500,"GBP",52801.972114254015,49703.264094955484,{"$f":"OFFSET(F1153,0,Brains!$D$1,1,1)","v":49703.264094955484},"Senior Manufacturing Engineer","Engineer","UK","UK","2 to 3","2 to 3 hours per day","6-10 yrs","30-49.9K",2.5,7,3,2,6,3]
["ID1780","2012-06-10T15:20:01",1000,12000,"USD",12000,12000,{"$f":"OFFSET(F1154,0,Brains!$D$1,1,1)","v":12000},"project engineer ","Engineer","India","India","2 to 3","2 to 3 hours per day","6-10 yrs",{"$f":"IF(H1154<15000,\"0-14.9K\",IF(H1154<30000,\"15-29.9K\",IF(H1154<50000,\"30-49.9K\",IF(H1154<75000,\"50-74.9K\",IF(H1154<100000,\"75-99.9K\",IF(H1154<150000,\"100-149.9K\",IF(H1154<250000,\"150-249.9K\",\"250K+\")))))))","v":"0-14.9K"},2.5,7,3,2,6,{"$f":"IF(H1154<15000,1,IF(H1154<30000,2,IF(H1154<50000,3,IF(H1154<75000,4,IF(H1154<100000,5,IF(H1154<150000,6,IF(H1154<250000,7,8)))))))","v":1}]
["ID1489","2012-05-30T20:26:10",146633,146633,"GBP",231119.74856804207,217556.37982195846,{"$f":"OFFSET(F1155,0,Brains!$D$1,1,1)","v":217556.37982195846},"Senior Planning Engineer","Engineer","UK","UK","2 to 3","2 to 3 hours per day","6-10 yrs","150-249.9K",2.5,10,3,2,6,7]
["ID1020","2012-05-28T12:10:09",7265,7265,"USD",7265,7265,{"$f":"OFFSET(F1156,0,Brains!$D$1,1,1)","v":7265},"Softwar Engineer","Engineer","India","India","4 to 6","4 to 6 hours a day","6-10 yrs","0-14.9K",5,6,4,2,6,1]
["ID1555","2012-05-31T21:45:03","60000 EUR",60000,"EUR",76223.966339496474,75371.960625687774,{"$f":"OFFSET(F1157,0,Brains!$D$1,1,1)","v":75371.960625687774},"Business Engineer","Engineer","Netherlands","Netherlands","4 to 6","4 to 6 hours a day","6-10 yrs","75-99.9K",5,7,4,2,6,5]
["ID1633","2012-06-03T01:36:43","24 K mauritian Rupees",288000,"MUR",9376.2513877177607,16628.175519630484,{"$f":"OFFSET(F1158,0,Brains!$D$1,1,1)","v":16628.175519630484},"IT Support Engineer","Engineer","Mauritius","Mauritius","4 to 6","4 to 6 hours a day","6-10 yrs","15-29.9K",5,7,4,2,6,2]
["ID1430","2012-05-30T01:57:58",77000,77000,"USD",77000,77000,{"$f":"OFFSET(F1159,0,Brains!$D$1,1,1)","v":77000},"Assistant Engineer","Engineer","USA","USA","4 to 6","4 to 6 hours a day","6-10 yrs","75-99.9K",5,10,4,2,6,5]
["ID0663","2012-05-26T12:31:29",37000,37000,"USD",37000,37000,{"$f":"OFFSET(F1160,0,Brains!$D$1,1,1)","v":37000},"Cad Engineer","Engineer","India","India","4 to 6","4 to 6 hours a day","6-10 yrs","30-49.9K",5,10,4,2,6,3]
["ID0434","2012-05-26T02:34:00","US $6,629.00",6629,"USD",6629,6629,{"$f":"OFFSET(F1161,0,Brains!$D$1,1,1)","v":6629},"Engineer","Engineer","Dominican Republic","Dominican Republic","All 8","All the 8 hours baby, all the 8!",null,"0-14.9K",8,null,5,null,6,1]
["ID0480","2012-05-26T03:21:55",92000,92000,"USD",92000,92000,{"$f":"OFFSET(F1162,0,Brains!$D$1,1,1)","v":92000},"principal engineer","Engineer","USA","USA","1 or 2","1 or 2 hours a day",null,"75-99.9K",1.5,null,2,null,6,5]
["ID0015","2012-05-25T03:53:22",85000,85000,"USD",85000,85000,{"$f":"OFFSET(F1163,0,Brains!$D$1,1,1)","v":85000},"Project Engineer","Engineer","USA","USA","1 or 2","1 or 2 hours a day",null,"75-99.9K",1.5,null,2,null,6,5]
["ID0311","2012-05-26T01:24:03","Â£20000/year but i work part time 30h/week",20000,"GBP",31523.565441345683,29673.590504451036,{"$f":"OFFSET(F1164,0,Brains!$D$1,1,1)","v":29673.590504451036},"Graduate Structural Engineer","Engineer","UK","UK","1 or 2","1 or 2 hours a day",null,"15-29.9K",1.5,null,2,null,6,2]
["ID0430","2012-05-26T02:31:24",24,24000,"USD",24000,24000,{"$f":"OFFSET(F1165,0,Brains!$D$1,1,1)","v":24000},"engineer","Engineer","USA","USA","1 or 2","1 or 2 hours a day",null,"15-29.9K",1.5,null,2,null,6,2]
["ID0029","2012-05-25T04:52:23","900000 INR",900000,"INR",16027.125018698311,44816.253361219002,{"$f":"OFFSET(F1166,0,Brains!$D$1,1,1)","v":44816.253361219002},"Applications Engineer","Engineer","India","India","1 or 2","1 or 2 hours a day",null,"30-49.9K",1.5,null,2,null,6,3]
["ID0406","2012-05-26T02:08:10",300000,300000,"INR",5342.3750062327708,14938.751120406334,{"$f":"OFFSET(F1167,0,Brains!$D$1,1,1)","v":14938.751120406334},"Sr. Systems Engineer","Engineer","India","India","1 or 2","1 or 2 hours a day",null,"0-14.9K",1.5,null,2,null,6,1]
["ID0087","2012-05-26T00:15:17",110000,110000,"USD",110000,110000,{"$f":"OFFSET(F1168,0,Brains!$D$1,1,1)","v":110000},"Senior Scheduling Engineer","Engineer","USA","USA","2 to 3","2 to 3 hours per day",null,"100-149.9K",2.5,null,3,null,6,6]
["ID0399","2012-05-26T02:05:06",85000,85000,"USD",85000,85000,{"$f":"OFFSET(F1169,0,Brains!$D$1,1,1)","v":85000},"ENGINEER","Engineer","USA","USA","2 to 3","2 to 3 hours per day",null,"75-99.9K",2.5,null,3,null,6,5]
["ID0356","2012-05-26T01:42:27",72500,72500,"USD",72500,72500,{"$f":"OFFSET(F1170,0,Brains!$D$1,1,1)","v":72500},"Transportation Engineer","Engineer","USA","USA","2 to 3","2 to 3 hours per day",null,"50-74.9K",2.5,null,3,null,6,4]
["ID0043","2012-05-25T05:30:39",70000,70000,"CAD",68835.306612122877,56044.83586869495,{"$f":"OFFSET(F1171,0,Brains!$D$1,1,1)","v":56044.83586869495},"Product Engineer","Engineer","Canada","Canada","2 to 3","2 to 3 hours per day",null,"50-74.9K",2.5,null,3,null,6,4]
["ID0291","2012-05-26T01:18:35","Â£31000",31000,"GBP",48861.526434085805,45994.065281899108,{"$f":"OFFSET(F1172,0,Brains!$D$1,1,1)","v":45994.065281899108},"Telecoms Engineer","Engineer","UK","UK","2 to 3","2 to 3 hours per day",null,"30-49.9K",2.5,null,3,null,6,3]
["ID0479","2012-05-26T03:21:26",2000,24000,"USD",24000,24000,{"$f":"OFFSET(F1173,0,Brains!$D$1,1,1)","v":24000},"engineer","Engineer","mozambique","Mozambique","2 to 3","2 to 3 hours per day",null,"15-29.9K",2.5,null,3,null,6,2]
["ID0224","2012-05-26T00:57:52","US$ 138K",138000,"USD",138000,138000,{"$f":"OFFSET(F1174,0,Brains!$D$1,1,1)","v":138000},"Project engineer","Engineer","Thailand","Thailand","4 to 6","4 to 6 hours a day",null,"100-149.9K",5,null,4,null,6,6]
["ID0351","2012-05-26T01:40:51",130000,130000,"USD",130000,130000,{"$f":"OFFSET(F1175,0,Brains!$D$1,1,1)","v":130000},"Sr Staff Engineer","Engineer","USA","USA","4 to 6","4 to 6 hours a day",null,"100-149.9K",5,null,4,null,6,6]
["ID0176","2012-05-26T00:49:18",92000,92000,"USD",92000,92000,{"$f":"OFFSET(F1176,0,Brains!$D$1,1,1)","v":92000},"Industrial Engineer (Fed)","Engineer","USA","USA","4 to 6","4 to 6 hours a day",null,"75-99.9K",5,null,4,null,6,5]
["ID0449","2012-05-26T02:53:29",74000,74000,"USD",74000,74000,{"$f":"OFFSET(F1177,0,Brains!$D$1,1,1)","v":74000},"Engineer","Engineer","USA","USA","4 to 6","4 to 6 hours a day",null,"50-74.9K",5,null,4,null,6,4]
["ID0038","2012-05-25T05:10:29",69000,69000,"USD",69000,69000,{"$f":"OFFSET(F1178,0,Brains!$D$1,1,1)","v":69000},"Design Engineer","Engineer","USA","USA","4 to 6","4 to 6 hours a day",null,"50-74.9K",5,null,4,null,6,4]
["ID0144","2012-05-26T00:44:02",57000,57000,"USD",57000,57000,{"$f":"OFFSET(F1179,0,Brains!$D$1,1,1)","v":57000},"Industrial Engineer","Engineer","USA","USA","4 to 6","4 to 6 hours a day",null,"50-74.9K",5,null,4,null,6,4]
["ID0546","2012-05-26T05:30:12",1500,18000,"USD",18000,18000,{"$f":"OFFSET(F1180,0,Brains!$D$1,1,1)","v":18000},"Engineer","Engineer","Brazil","Brazil","4 to 6","4 to 6 hours a day",null,"15-29.9K",5,null,4,null,6,2]
["ID0012","2012-05-25T03:43:56",14000,14000,"USD",14000,14000,{"$f":"OFFSET(F1181,0,Brains!$D$1,1,1)","v":14000},"quality engineer","Engineer","Hungary","Hungary","4 to 6","4 to 6 hours a day",null,"0-14.9K",5,null,4,null,6,1]
["ID0382","2012-05-26T01:59:21","INR 5,40,000",540000,"INR",9616.275011218986,26889.7520167314,{"$f":"OFFSET(F1182,0,Brains!$D$1,1,1)","v":26889.7520167314},"Senior Billing Engineer","Engineer","India","India","4 to 6","4 to 6 hours a day",null,"15-29.9K",5,null,4,null,6,2]
["ID0016","2012-05-25T03:56:40",75000,75000,"USD",75000,75000,{"$f":"OFFSET(F1183,0,Brains!$D$1,1,1)","v":75000},"Sr Project Engineer","Engineer","USA","USA","All 8","All the 8 hours baby, all the 8!",null,"75-99.9K",8,null,5,null,6,5]
["ID0283","2012-05-26T01:15:05",70000,70000,"USD",70000,70000,{"$f":"OFFSET(F1184,0,Brains!$D$1,1,1)","v":70000},"Engineering Tech Sr.","Engineer","USA","USA","All 8","All the 8 hours baby, all the 8!",null,"50-74.9K",8,null,5,null,6,4]
["ID0005","2012-05-25T03:27:04",54000,54000,"USD",54000,54000,{"$f":"OFFSET(F1185,0,Brains!$D$1,1,1)","v":54000},"Quality Engineer","Engineer","USA","USA","All 8","All the 8 hours baby, all the 8!",null,"50-74.9K",8,null,5,null,6,4]
["ID0971","2012-05-28T06:52:05",43000,43000,"AUD",43856.11522531334,27353.689567430025,{"$f":"OFFSET(F1186,0,Brains!$D$1,1,1)","v":27353.689567430025},"Finance Officer","Manager","Australia","Australia","All 8","All the 8 hours baby, all the 8!","0-5 yrs","15-29.9K",8,1,5,1,7,2]
["ID0648","2012-05-26T11:58:23",8000,8000,"USD",8000,8000,{"$f":"OFFSET(F1187,0,Brains!$D$1,1,1)","v":8000},"Quality officer","Manager","bangkok","Thailand","All 8","All the 8 hours baby, all the 8!","0-5 yrs","0-14.9K",8,1,5,1,7,1]
["ID0826","2012-05-26T23:02:00","INR 1700000",1700000,"INR",30273.458368652366,84652.923015635897,{"$f":"OFFSET(F1188,0,Brains!$D$1,1,1)","v":84652.923015635897},"Operations Lead","Manager","India","India","All 8","All the 8 hours baby, all the 8!","0-5 yrs","75-99.9K",8,1.1000000000000001,5,1,7,5]
["ID0792","2012-05-26T20:20:34","Rs 450000",450000,"INR",8013.5625093491553,22408.126680609501,{"$f":"OFFSET(F1189,0,Brains!$D$1,1,1)","v":22408.126680609501},"Material Planner","Manager","India","India","All 8","All the 8 hours baby, all the 8!","0-5 yrs","15-29.9K",8,1.5,5,1,7,2]
["ID1223","2012-05-29T01:19:26","INR 450000",450000,"INR",8013.5625093491553,22408.126680609501,{"$f":"OFFSET(F1190,0,Brains!$D$1,1,1)","v":22408.126680609501},"ASSISTANT MANAGER","Manager","India","India","All 8","All the 8 hours baby, all the 8!","0-5 yrs","15-29.9K",8,2,5,1,7,2]
["ID0723","2012-05-26T14:57:45","PKR 17000",204000,"PKR",2165.2740982270229,4989.8490815253281,{"$f":"OFFSET(F1191,0,Brains!$D$1,1,1)","v":4989.8490815253281},"Accounts Manager","Manager","Pakistan","Pakistan","All 8","All the 8 hours baby, all the 8!","0-5 yrs","0-14.9K",8,2,5,1,7,1]
["ID1017","2012-05-28T11:58:39","R308 500",308500,"ZAR",37612.869087708088,54389.985895627644,{"$f":"OFFSET(F1192,0,Brains!$D$1,1,1)","v":54389.985895627644},"Management Information Consultant","Manager","South Africa","South Africa","All 8","All the 8 hours baby, all the 8!","0-5 yrs","50-74.9K",8,3,5,1,7,4]
["ID0997","2012-05-28T09:40:10","US$12,000/year",12000,"USD",12000,12000,{"$f":"OFFSET(F1193,0,Brains!$D$1,1,1)","v":12000},"Manager","Manager","Asia","Asia","All 8","All the 8 hours baby, all the 8!","0-5 yrs","0-14.9K",8,3,5,1,7,1]
["ID0817","2012-05-26T22:29:16","3500 Rs",504000,"INR",8975.1900104710548,25097.101882282641,{"$f":"OFFSET(F1194,0,Brains!$D$1,1,1)","v":25097.101882282641},"MNR","Manager","India","India","All 8","All the 8 hours baby, all the 8!","0-5 yrs","15-29.9K",8,3,5,1,7,2]
["ID1290","2012-05-29T12:20:32","400000INR",400000,"INR",7123.1666749770275,19918.334827208444,{"$f":"OFFSET(F1195,0,Brains!$D$1,1,1)","v":19918.334827208444},"PMO","Manager","India","India","All 8","All the 8 hours baby, all the 8!","0-5 yrs","15-29.9K",8,3,5,1,7,2]
["ID0654","2012-05-26T12:20:07",450,5400,"USD",5400,5400,{"$f":"OFFSET(F1196,0,Brains!$D$1,1,1)","v":5400},"manager","Manager","India","India","All 8","All the 8 hours baby, all the 8!","0-5 yrs","0-14.9K",8,3,5,1,7,1]
["ID1819","2012-06-12T21:58:21",4800,4800,"USD",4800,4800,{"$f":"OFFSET(F1197,0,Brains!$D$1,1,1)","v":4800},"Sr Executive","Manager","India","India","All 8","All the 8 hours baby, all the 8!","0-5 yrs","0-14.9K",8,3,5,1,7,1]
["ID1636","2012-06-03T04:14:45","Rs. 3.70 lacs",3700000,"INR",65889.291743537498,184244.59715167811,{"$f":"OFFSET(F1198,0,Brains!$D$1,1,1)","v":184244.59715167811},"Senior Officer","Manager","India","India","All 8","All the 8 hours baby, all the 8!","0-5 yrs","150-249.9K",8,4,5,1,7,7]
["ID1497","2012-05-30T21:26:04",5000,5000,"USD",5000,5000,{"$f":"OFFSET(F1199,0,Brains!$D$1,1,1)","v":5000},"Officer MIS","Manager","India","India","All 8","All the 8 hours baby, all the 8!","0-5 yrs","0-14.9K",8,4,5,1,7,1]
["ID1334","2012-05-29T16:49:44",275000,275000,"INR",4897.177089046706,13693.855193705806,{"$f":"OFFSET(F1200,0,Brains!$D$1,1,1)","v":13693.855193705806},"TL WFM","Manager","India","India","All 8","All the 8 hours baby, all the 8!","0-5 yrs","0-14.9K",8,4,5,1,7,1]
["ID0886","2012-05-27T13:27:19","Rs. 35000",420000,"PKR",4457.9172610556352,10273.218697258029,{"$f":"OFFSET(F1201,0,Brains!$D$1,1,1)","v":10273.218697258029},"Assistant Manager","Manager","Pakistan","Pakistan","All 8","All the 8 hours baby, all the 8!","0-5 yrs","0-14.9K",8,4,5,1,7,1]
["ID0756","2012-05-26T16:50:08","US $ 11,000",11000,"USD",11000,11000,{"$f":"OFFSET(F1202,0,Brains!$D$1,1,1)","v":11000},"Assistant Manager - Group MIS","Manager","Sri Lanka","Sri Lanka","All 8","All the 8 hours baby, all the 8!","0-5 yrs","0-14.9K",8,4.5,5,1,7,1]
["ID1037","2012-05-28T13:06:37",3500,42000,"USD",42000,42000,{"$f":"OFFSET(F1203,0,Brains!$D$1,1,1)","v":42000},"Category Operations Supv.","Manager","Kuwait","Kuwait","All 8","All the 8 hours baby, all the 8!","0-5 yrs","30-49.9K",8,5,5,1,7,3]
["ID0913","2012-05-27T16:50:50","1050000 INR",1050000,"INR",18698.312521814696,52285.628921422169,{"$f":"OFFSET(F1204,0,Brains!$D$1,1,1)","v":52285.628921422169},"Manager Market Reesrach","Manager","India","India","All 8","All the 8 hours baby, all the 8!","0-5 yrs","50-74.9K",8,5,5,1,7,4]
["ID1028","2012-05-28T12:40:26",900,10800,"USD",10800,10800,{"$f":"OFFSET(F1205,0,Brains!$D$1,1,1)","v":10800},"Project Managment Office","Manager","Pakistan","Pakistan","All 8","All the 8 hours baby, all the 8!","0-5 yrs","0-14.9K",8,5,5,1,7,1]
["ID0885","2012-05-27T13:06:50",600000,600000,"INR",10684.750012465542,29877.502240812668,{"$f":"OFFSET(F1206,0,Brains!$D$1,1,1)","v":29877.502240812668},"Asst Manager","Manager","India","India","All 8","All the 8 hours baby, all the 8!","0-5 yrs","15-29.9K",8,5,5,1,7,2]
["ID1324","2012-05-29T15:49:41",314000,314000,"INR",5591.6858398569666,15635.892839358628,{"$f":"OFFSET(F1207,0,Brains!$D$1,1,1)","v":15635.892839358628},"relationship manager","Manager","India","India","1 or 2","1 or 2 hours a day","0-5 yrs","15-29.9K",1.5,0.1,2,1,7,2]
["ID1629","2012-06-02T21:42:42","6.8 Lac INR",680000,"INR",12109.383347460946,33861.169206254359,{"$f":"OFFSET(F1208,0,Brains!$D$1,1,1)","v":33861.169206254359},"Deputy Manager","Manager","India","India","1 or 2","1 or 2 hours a day","0-5 yrs","30-49.9K",1.5,2,2,1,7,3]
["ID0706","2012-05-26T14:01:00",600000,600000,"INR",10684.750012465542,29877.502240812668,{"$f":"OFFSET(F1209,0,Brains!$D$1,1,1)","v":29877.502240812668},"senior executive","Manager","India","India","1 or 2","1 or 2 hours a day","0-5 yrs","15-29.9K",1.5,2,2,1,7,2]
["ID1782","2012-06-10T17:21:08",72000,72000,"EUR",91468.759607395754,90446.352750825332,{"$f":"OFFSET(F1210,0,Brains!$D$1,1,1)","v":90446.352750825332},"regional sales manager","Manager","croatia","Croatia","1 or 2","1 or 2 hours a day","0-5 yrs","75-99.9K",1.5,3,2,1,7,5]
["ID1673","2012-06-05T00:22:14",59000,59000,"USD",59000,59000,{"$f":"OFFSET(F1211,0,Brains!$D$1,1,1)","v":59000},"Category Leader","Manager","USA","USA","1 or 2","1 or 2 hours a day","0-5 yrs","50-74.9K",1.5,3,2,1,7,4]
["ID0988","2012-05-28T08:39:53",3000,36000,"USD",36000,36000,{"$f":"OFFSET(F1212,0,Brains!$D$1,1,1)","v":36000},"Project manager","Manager","malaysia","Malaysia","1 or 2","1 or 2 hours a day","0-5 yrs","30-49.9K",1.5,3,2,1,7,3]
["ID0911","2012-05-27T16:24:50",1300000,1300000,"INR",23150.291693675339,64734.588188427442,{"$f":"OFFSET(F1213,0,Brains!$D$1,1,1)","v":64734.588188427442},"banker","Manager","India","India","1 or 2","1 or 2 hours a day","0-5 yrs","50-74.9K",1.5,3,2,1,7,4]
["ID0598","2012-05-26T08:51:04","4,00,000",400000,"INR",7123.1666749770275,19918.334827208444,{"$f":"OFFSET(F1214,0,Brains!$D$1,1,1)","v":19918.334827208444},"BPO","Manager","India","India","1 or 2","1 or 2 hours a day","0-5 yrs","15-29.9K",1.5,3,2,1,7,2]
["ID0669","2012-05-26T12:50:08","23000 Rupees",276000,"INR",4914.9850057341491,13743.651030773826,{"$f":"OFFSET(F1215,0,Brains!$D$1,1,1)","v":13743.651030773826},"Education Officer","Manager","Pakistan","Pakistan","1 or 2","1 or 2 hours a day","0-5 yrs","0-14.9K",1.5,3,2,1,7,1]
["ID1126","2012-05-28T17:42:11",5000,60000,"EUR",76223.966339496474,75371.960625687774,{"$f":"OFFSET(F1216,0,Brains!$D$1,1,1)","v":75371.960625687774},"Development Manager","Manager","Finland","Finland","1 or 2","1 or 2 hours a day","0-5 yrs","75-99.9K",1.5,4,2,1,7,5]
["ID1553","2012-05-31T21:05:02","55000 EUR",55000,"EUR",69871.969144538423,69090.963906880454,{"$f":"OFFSET(F1217,0,Brains!$D$1,1,1)","v":69090.963906880454},"Risk Officer","Manager","The Netherlands","Netherlands","1 or 2","1 or 2 hours a day","0-5 yrs","50-74.9K",1.5,5,2,1,7,4]
["ID1677","2012-06-05T03:50:02",3300,39600,"EUR",50307.817784067665,49745.494012953932,{"$f":"OFFSET(F1218,0,Brains!$D$1,1,1)","v":49745.494012953932},"Maintenance Manager","Manager","Europe","Europe","1 or 2","1 or 2 hours a day","0-5 yrs",{"$f":"IF(H1218<15000,\"0-14.9K\",IF(H1218<30000,\"15-29.9K\",IF(H1218<50000,\"30-49.9K\",IF(H1218<75000,\"50-74.9K\",IF(H1218<100000,\"75-99.9K\",IF(H1218<150000,\"100-149.9K\",IF(H1218<250000,\"150-249.9K\",\"250K+\")))))))","v":"30-49.9K"},1.5,5,2,1,7,{"$f":"IF(H1218<15000,1,IF(H1218<30000,2,IF(H1218<50000,3,IF(H1218<75000,4,IF(H1218<100000,5,IF(H1218<150000,6,IF(H1218<250000,7,8)))))))","v":3}]
["ID1169","2012-05-28T22:38:37","$50,000 U.S.",50000,"USD",50000,50000,{"$f":"OFFSET(F1219,0,Brains!$D$1,1,1)","v":50000},"Program Manager","Manager","Canada","Canada","1 or 2","1 or 2 hours a day","0-5 yrs","50-74.9K",1.5,5,2,1,7,4]
["ID0891","2012-05-27T13:42:15","inr 500000",500000,"INR",8903.9583437212841,24897.918534010558,{"$f":"OFFSET(F1220,0,Brains!$D$1,1,1)","v":24897.918534010558},"team coach","Manager","India","India","1 or 2","1 or 2 hours a day","0-5 yrs","15-29.9K",1.5,5,2,1,7,2]
["ID0645","2012-05-26T11:50:03","Rs 4,00,000",400000,"INR",7123.1666749770275,19918.334827208444,{"$f":"OFFSET(F1221,0,Brains!$D$1,1,1)","v":19918.334827208444},"Sr Processor","Manager","India","India","1 or 2","1 or 2 hours a day","0-5 yrs","15-29.9K",1.5,5,2,1,7,2]
["ID1756","2012-06-08T15:43:16","INR800000",800000,"INR",14246.333349954055,39836.669654416888,{"$f":"OFFSET(F1222,0,Brains!$D$1,1,1)","v":39836.669654416888},"MANAGER","Manager","India","India","2 to 3","2 to 3 hours per day","0-5 yrs","30-49.9K",2.5,0,3,1,7,3]
["ID1757","2012-06-08T15:45:14",800000,800000,"INR",14246.333349954055,39836.669654416888,{"$f":"OFFSET(F1223,0,Brains!$D$1,1,1)","v":39836.669654416888},"MANAGER","Manager","India","India","2 to 3","2 to 3 hours per day","0-5 yrs","30-49.9K",2.5,0,3,1,7,3]
["ID1454","2012-05-30T13:21:06",500000,500000,"INR",8903.9583437212841,24897.918534010558,{"$f":"OFFSET(F1224,0,Brains!$D$1,1,1)","v":24897.918534010558},"Project Management","Manager","India","India","2 to 3","2 to 3 hours per day","0-5 yrs","15-29.9K",2.5,0,3,1,7,2]
["ID1010","2012-05-28T11:11:53",650000,650000,"INR",11575.14584683767,32367.294094213721,{"$f":"OFFSET(F1225,0,Brains!$D$1,1,1)","v":32367.294094213721},"Ass Research  Manager","Manager","India","India","2 to 3","2 to 3 hours per day","0-5 yrs","30-49.9K",2.5,1,3,1,7,3]
["ID0974","2012-05-28T07:21:12",56600,56600,"AUD",57726.886552389187,36005.089058524172,{"$f":"OFFSET(F1226,0,Brains!$D$1,1,1)","v":36005.089058524172},"Operations Coordinator","Manager","Australia","Australia","2 to 3","2 to 3 hours per day","0-5 yrs","30-49.9K",2.5,2,3,1,7,3]
["ID1054","2012-05-28T14:12:52","Rs. 1200000",1200000,"INR",21369.500024931083,59755.004481625336,{"$f":"OFFSET(F1227,0,Brains!$D$1,1,1)","v":59755.004481625336},"Management Trainee","Manager","India","India","2 to 3","2 to 3 hours per day","0-5 yrs","50-74.9K",2.5,2,3,1,7,4]
["ID1299","2012-05-29T13:23:45","6,00,000 INR",600000,"INR",10684.750012465542,29877.502240812668,{"$f":"OFFSET(F1228,0,Brains!$D$1,1,1)","v":29877.502240812668},"Senior Business Executive","Manager","India","India","2 to 3","2 to 3 hours per day","0-5 yrs","15-29.9K",2.5,2,3,1,7,2]
["ID0946","2012-05-28T00:28:56","Rs 40000",480000,"INR",8547.8000099724322,23902.001792650135,{"$f":"OFFSET(F1229,0,Brains!$D$1,1,1)","v":23902.001792650135},"Manager","Manager","India","India","2 to 3","2 to 3 hours per day","0-5 yrs","15-29.9K",2.5,2,3,1,7,2]
["ID0970","2012-05-28T06:51:54",60000,60000,"USD",60000,60000,{"$f":"OFFSET(F1230,0,Brains!$D$1,1,1)","v":60000},"Sales Manager","Manager","USA","USA","2 to 3","2 to 3 hours per day","0-5 yrs","50-74.9K",2.5,3,3,1,7,4]
["ID1273","2012-05-29T09:47:47",30000,30000,"USD",30000,30000,{"$f":"OFFSET(F1231,0,Brains!$D$1,1,1)","v":30000},"Practice Manager - Business Operations","Manager","India","India","2 to 3","2 to 3 hours per day","0-5 yrs","30-49.9K",2.5,3,3,1,7,3]
["ID0900","2012-05-27T14:55:30","INR 850,000",850000,"INR",15136.729184326183,42326.461507817949,{"$f":"OFFSET(F1232,0,Brains!$D$1,1,1)","v":42326.461507817949},"Assistant Manager","Manager","India","India","2 to 3","2 to 3 hours per day","0-5 yrs","30-49.9K",2.5,3,3,1,7,3]
["ID1217","2012-05-29T00:32:35","INR 750,000",750000,"INR",13355.937515581925,37346.877801015835,{"$f":"OFFSET(F1233,0,Brains!$D$1,1,1)","v":37346.877801015835},"Assistant Manager","Manager","India","India","2 to 3","2 to 3 hours per day","0-5 yrs","30-49.9K",2.5,3,3,1,7,3]
["ID0691","2012-05-26T13:22:43",300000,300000,"INR",5342.3750062327708,14938.751120406334,{"$f":"OFFSET(F1234,0,Brains!$D$1,1,1)","v":14938.751120406334},"govt","Manager","India","India","2 to 3","2 to 3 hours per day","0-5 yrs","0-14.9K",2.5,3,3,1,7,1]
["ID0813","2012-05-26T22:08:56","Rs 20000",240000,"INR",4273.9000049862161,11951.000896325068,{"$f":"OFFSET(F1235,0,Brains!$D$1,1,1)","v":11951.000896325068},"MANAGER","Manager","India","India","2 to 3","2 to 3 hours per day","0-5 yrs","0-14.9K",2.5,3,3,1,7,1]
["ID1459","2012-05-30T13:41:41",60000,60000,"USD",60000,60000,{"$f":"OFFSET(F1236,0,Brains!$D$1,1,1)","v":60000},"Business Intelligence Supervisor","Manager","USA","USA","2 to 3","2 to 3 hours per day","0-5 yrs","50-74.9K",2.5,4,3,1,7,4]
["ID1270","2012-05-29T09:37:40","AUD $43000",43000,"USD",43000,43000,{"$f":"OFFSET(F1237,0,Brains!$D$1,1,1)","v":43000},"Operations Support Officer","Manager","Australia","Australia","2 to 3","2 to 3 hours per day","0-5 yrs","30-49.9K",2.5,4,3,1,7,3]
["ID1344","2012-05-29T17:39:55","41000 $",41000,"USD",41000,41000,{"$f":"OFFSET(F1238,0,Brains!$D$1,1,1)","v":41000},"PO/PMO/Planner/PM","Manager","Israel","Israel","2 to 3","2 to 3 hours per day","0-5 yrs","30-49.9K",2.5,4,3,1,7,3]
["ID1811","2012-06-12T15:58:36",560000,560000,"INR",9972.4333449678379,27885.668758091822,{"$f":"OFFSET(F1239,0,Brains!$D$1,1,1)","v":27885.668758091822},"Associate Manager","Manager","India","India","2 to 3","2 to 3 hours per day","0-5 yrs","15-29.9K",2.5,4,3,1,7,2]
["ID1033","2012-05-28T12:59:59",18000,18000,"USD",18000,18000,{"$f":"OFFSET(F1240,0,Brains!$D$1,1,1)","v":18000},"Area Sales Manager","Manager","India","India","2 to 3","2 to 3 hours per day","0-5 yrs","15-29.9K",2.5,4.5999999999999996,3,1,7,2]
["ID1385","2012-05-29T21:42:44",120000,120000,"USD",120000,120000,{"$f":"OFFSET(F1241,0,Brains!$D$1,1,1)","v":120000},"Finance Manager","Manager","USA","USA","2 to 3","2 to 3 hours per day","0-5 yrs","100-149.9K",2.5,5,3,1,7,6]
["ID1122","2012-05-28T17:18:47","GBP Â£45200",45200,"GBP",71243.257897441246,67062.314540059349,{"$f":"OFFSET(F1242,0,Brains!$D$1,1,1)","v":67062.314540059349},"Clinical audit manager","Manager","UK","UK","2 to 3","2 to 3 hours per day","0-5 yrs","50-74.9K",2.5,5,3,1,7,4]
["ID0968","2012-05-28T06:25:36","AU$65",65000,"AUD",66294.12766617132,41348.600508905853,{"$f":"OFFSET(F1243,0,Brains!$D$1,1,1)","v":41348.600508905853},"Business Support ","Manager","Australia","Australia","2 to 3","2 to 3 hours per day","0-5 yrs","30-49.9K",2.5,5,3,1,7,3]
["ID1548","2012-05-31T17:35:33","45.000 USD",45000,"USD",45000,45000,{"$f":"OFFSET(F1244,0,Brains!$D$1,1,1)","v":45000},"Junior Reporting Manager","Manager","Germany","Germany","2 to 3","2 to 3 hours per day","0-5 yrs","30-49.9K",2.5,5,3,1,7,3]
["ID0812","2012-05-26T22:07:39","24000 $",24000,"USD",24000,24000,{"$f":"OFFSET(F1245,0,Brains!$D$1,1,1)","v":24000},"Logistic KA Manager","Manager","Croatia","Croatia","2 to 3","2 to 3 hours per day","0-5 yrs","15-29.9K",2.5,5,3,1,7,2]
["ID1110","2012-05-28T16:45:28",100000,1200000,"INR",21369.500024931083,59755.004481625336,{"$f":"OFFSET(F1246,0,Brains!$D$1,1,1)","v":59755.004481625336},"coordinator","Manager","India","India","2 to 3","2 to 3 hours per day","0-5 yrs","50-74.9K",2.5,5,3,1,7,4]
["ID1918","2012-06-20T01:54:10",20000,20000,"USD",20000,20000,{"$f":"OFFSET(F1247,0,Brains!$D$1,1,1)","v":20000},"Monitoring and Evaluation Officer","Manager","India","India","2 to 3","2 to 3 hours per day","0-5 yrs","15-29.9K",2.5,5,3,1,7,2]
["ID1499","2012-05-30T22:11:21","15000 USD",15000,"USD",15000,15000,{"$f":"OFFSET(F1248,0,Brains!$D$1,1,1)","v":15000},"Manager","Manager","Romania","Romania","2 to 3","2 to 3 hours per day","0-5 yrs","15-29.9K",2.5,5,3,1,7,2]
["ID0814","2012-05-26T22:16:10","INR 650000",650000,"INR",11575.14584683767,32367.294094213721,{"$f":"OFFSET(F1249,0,Brains!$D$1,1,1)","v":32367.294094213721},"Deputy Manager","Manager","India","India","2 to 3","2 to 3 hours per day","0-5 yrs","30-49.9K",2.5,5,3,1,7,3]
["ID1308","2012-05-29T14:16:06","5,75,000",575000,"INR",10239.552095279476,28632.606314112141,{"$f":"OFFSET(F1250,0,Brains!$D$1,1,1)","v":28632.606314112141},"Asst Manager HR","Manager","India","India","2 to 3","2 to 3 hours per day","0-5 yrs","15-29.9K",2.5,5,3,1,7,2]
["ID0628","2012-05-26T11:07:01",10000,10000,"USD",10000,10000,{"$f":"OFFSET(F1251,0,Brains!$D$1,1,1)","v":10000},"executive","Manager","Indonesia","Indonesia","2 to 3","2 to 3 hours per day","0-5 yrs","0-14.9K",2.5,5,3,1,7,1]
["ID0759","2012-05-26T17:03:02",1488000,1488000,"NAIRA",9171.0323574730355,15293.222882279182,{"$f":"OFFSET(F1252,0,Brains!$D$1,1,1)","v":15293.222882279182},"Company Systems Integration Manager","Manager","Nigeria","Nigeria","2 to 3","2 to 3 hours per day","0-5 yrs","15-29.9K",2.5,5,3,1,7,2]
["ID1339","2012-05-29T17:16:20",500000,500000,"INR",8903.9583437212841,24897.918534010558,{"$f":"OFFSET(F1253,0,Brains!$D$1,1,1)","v":24897.918534010558},"support manager","Manager","India","India","2 to 3","2 to 3 hours per day","0-5 yrs","15-29.9K",2.5,5,3,1,7,2]
["ID0652","2012-05-26T12:19:47","Rs. 4.32 Lakhs",432000,"INR",7693.0200089751897,21511.80161338512,{"$f":"OFFSET(F1254,0,Brains!$D$1,1,1)","v":21511.80161338512},"Assistant Manager - IT","Manager","India","India","2 to 3","2 to 3 hours per day","0-5 yrs","15-29.9K",2.5,5,3,1,7,2]
["ID1031","2012-05-28T12:57:13","Rs. 4,00,000/-",400000,"INR",7123.1666749770275,19918.334827208444,{"$f":"OFFSET(F1255,0,Brains!$D$1,1,1)","v":19918.334827208444},"Sr. Executive","Manager","India","India","2 to 3","2 to 3 hours per day","0-5 yrs","15-29.9K",2.5,5,3,1,7,2]
["ID1771","2012-06-09T12:01:19",444,5320,"USD",5320,5320,{"$f":"OFFSET(F1256,0,Brains!$D$1,1,1)","v":5320},"Officer","Manager","India","India","2 to 3","2 to 3 hours per day","0-5 yrs","0-14.9K",2.5,5,3,1,7,1]
["ID1860","2012-06-15T15:43:42",270000,270000,"INR",4808.137505609493,13444.8760083657,{"$f":"OFFSET(F1257,0,Brains!$D$1,1,1)","v":13444.8760083657},"Team Lead","Manager","India","India","2 to 3","2 to 3 hours per day","0-5 yrs","0-14.9K",2.5,5,3,1,7,1]
["ID0678","2012-05-26T13:01:53","2.5lakh",250000,"INR",4451.9791718606421,12448.959267005279,{"$f":"OFFSET(F1258,0,Brains!$D$1,1,1)","v":12448.959267005279},"ASM","Manager","India","India","2 to 3","2 to 3 hours per day","0-5 yrs","0-14.9K",2.5,5,3,1,7,1]
["ID1221","2012-05-29T01:06:44",4400,4400,"USD",4400,4400,{"$f":"OFFSET(F1259,0,Brains!$D$1,1,1)","v":4400},"Manager Corporate Finance","Manager","Latin America","Latin America","2 to 3","2 to 3 hours per day","0-5 yrs","0-14.9K",2.5,5,3,1,7,1]
["ID1065","2012-05-28T14:44:26","Rs 200000",200000,"INR",3561.5833374885137,9959.167413604222,{"$f":"OFFSET(F1260,0,Brains!$D$1,1,1)","v":9959.167413604222},"Business Development Executive","Manager","India","India","2 to 3","2 to 3 hours per day","0-5 yrs","0-14.9K",2.5,5,3,1,7,1]
["ID1132","2012-05-28T18:05:13",150252,150252,"INR",2675.675098121621,7481.924111144308,{"$f":"OFFSET(F1261,0,Brains!$D$1,1,1)","v":7481.924111144308},"KEY","Manager","India","India","2 to 3","2 to 3 hours per day","0-5 yrs","0-14.9K",2.5,5,3,1,7,1]
["ID0649","2012-05-26T12:05:35",150000,150000,"INR",2671.1875031163854,7469.375560203167,{"$f":"OFFSET(F1262,0,Brains!$D$1,1,1)","v":7469.375560203167},"Executive","Manager","India","India","2 to 3","2 to 3 hours per day","0-5 yrs","0-14.9K",2.5,5,3,1,7,1]
["ID0816","2012-05-26T22:23:38",516000,516000,"INR",9188.8850107203652,25694.651927098894,{"$f":"OFFSET(F1263,0,Brains!$D$1,1,1)","v":25694.651927098894},"Management Trainee","Manager","India","India","4 to 6","4 to 6 hours a day","0-5 yrs","15-29.9K",5,0,4,1,7,2]
["ID0998","2012-05-28T09:41:04",204000,204000,"INR",3632.815004238284,10158.350761876307,{"$f":"OFFSET(F1264,0,Brains!$D$1,1,1)","v":10158.350761876307},"Retired Government Officer, having knowledge in excel.","Manager","India","India","4 to 6","4 to 6 hours a day","0-5 yrs","0-14.9K",5,0,4,1,7,1]
["ID1409","2012-05-29T23:20:41",40000,40000,"USD",40000,40000,{"$f":"OFFSET(F1265,0,Brains!$D$1,1,1)","v":40000},"Project Coordinator","Manager","USA","USA","4 to 6","4 to 6 hours a day","0-5 yrs","30-49.9K",5,1,4,1,7,3]
["ID0856","2012-05-27T03:19:29",32000,32000,"USD",32000,32000,{"$f":"OFFSET(F1266,0,Brains!$D$1,1,1)","v":32000},"Reporting Manager","Manager","USA","USA","4 to 6","4 to 6 hours a day","0-5 yrs","30-49.9K",5,1,4,1,7,3]
["ID1747","2012-06-08T03:34:51",30000,30000,"USD",30000,30000,{"$f":"OFFSET(F1267,0,Brains!$D$1,1,1)","v":30000},"Inventory Manager","Manager","USA","USA","4 to 6","4 to 6 hours a day","0-5 yrs","30-49.9K",5,1,4,1,7,3]
["ID1606","2012-06-01T22:20:26","20000 $",20000,"USD",20000,20000,{"$f":"OFFSET(F1268,0,Brains!$D$1,1,1)","v":20000},"Manager","Manager","India","India","4 to 6","4 to 6 hours a day","0-5 yrs","15-29.9K",5,1,4,1,7,2]
["ID1229","2012-05-29T01:47:39",750,9000,"USD",9000,9000,{"$f":"OFFSET(F1269,0,Brains!$D$1,1,1)","v":9000},"assurance manager","Manager","India","India","4 to 6","4 to 6 hours a day","0-5 yrs","0-14.9K",5,1,4,1,7,1]
["ID1234","2012-05-29T02:22:13",400000,400000,"INR",7123.1666749770275,19918.334827208444,{"$f":"OFFSET(F1270,0,Brains!$D$1,1,1)","v":19918.334827208444},"Pmo","Manager","India","India","4 to 6","4 to 6 hours a day","0-5 yrs","15-29.9K",5,1,4,1,7,2]
["ID0847","2012-05-27T01:04:46",5000,5000,"USD",5000,5000,{"$f":"OFFSET(F1271,0,Brains!$D$1,1,1)","v":5000},"Management Intern","Manager","India","India","4 to 6","4 to 6 hours a day","0-5 yrs","0-14.9K",5,1,4,1,7,1]
["ID1207","2012-05-29T00:07:00",250000,250000,"INR",4451.9791718606421,12448.959267005279,{"$f":"OFFSET(F1272,0,Brains!$D$1,1,1)","v":12448.959267005279},"Officer Production","Manager","India","India","4 to 6","4 to 6 hours a day","0-5 yrs","0-14.9K",5,1,4,1,7,1]
["ID0640","2012-05-26T11:40:34","4000000 INR",4000000,"INR",71231.666749770273,199183.34827208446,{"$f":"OFFSET(F1273,0,Brains!$D$1,1,1)","v":199183.34827208446},"Senior Executive","Manager","India","India","4 to 6","4 to 6 hours a day","0-5 yrs","150-249.9K",5,1.5,4,1,7,7]
["ID1355","2012-05-29T18:38:51",125000,125000,"USD",125000,125000,{"$f":"OFFSET(F1274,0,Brains!$D$1,1,1)","v":125000},"Vice President of Performance Management","Manager","USA","USA","4 to 6","4 to 6 hours a day","0-5 yrs","100-149.9K",5,2,4,1,7,6]
["ID1198","2012-05-28T23:33:59",88000,88000,"USD",88000,88000,{"$f":"OFFSET(F1275,0,Brains!$D$1,1,1)","v":88000},"Manager, Strategy & Insights","Manager","USA","USA","4 to 6","4 to 6 hours a day","0-5 yrs","75-99.9K",5,2,4,1,7,5]
["ID1821","2012-06-13T00:23:31",80000,80000,"USD",80000,80000,{"$f":"OFFSET(F1276,0,Brains!$D$1,1,1)","v":80000},"Manager, Operations","Manager","USA","USA","4 to 6","4 to 6 hours a day","0-5 yrs","75-99.9K",5,2,4,1,7,5]
["ID1768","2012-06-09T01:15:44",65000,65000,"USD",65000,65000,{"$f":"OFFSET(F1277,0,Brains!$D$1,1,1)","v":65000},"Compliance Officer","Manager","USA","USA","4 to 6","4 to 6 hours a day","0-5 yrs","50-74.9K",5,2,4,1,7,4]
["ID1001","2012-05-28T10:15:27","RM48,000",48000,"MYR",15206.427249917633,24742.268041237116,{"$f":"OFFSET(F1278,0,Brains!$D$1,1,1)","v":24742.268041237116},"Credit Risk Manager","Manager","Malaysia","Malaysia","4 to 6","4 to 6 hours a day","0-5 yrs","15-29.9K",5,2,4,1,7,2]
["ID0713","2012-05-26T14:18:11",636000,636000,"INR",11325.835013213473,31670.152375261427,{"$f":"OFFSET(F1279,0,Brains!$D$1,1,1)","v":31670.152375261427},"Audit Manager","Manager","India","India","4 to 6","4 to 6 hours a day","0-5 yrs","30-49.9K",5,2,4,1,7,3]
["ID1576","2012-06-01T04:44:29",11000,11000,"USD",11000,11000,{"$f":"OFFSET(F1280,0,Brains!$D$1,1,1)","v":11000},"Coordinator","Manager","MÃ©xico","Mexico","4 to 6","4 to 6 hours a day","0-5 yrs","0-14.9K",5,2,4,1,7,1]
["ID0707","2012-05-26T14:01:09",10000,10000,"USD",10000,10000,{"$f":"OFFSET(F1281,0,Brains!$D$1,1,1)","v":10000},"Executive","Manager","India","India","4 to 6","4 to 6 hours a day","0-5 yrs","0-14.9K",5,2,4,1,7,1]
["ID1136","2012-05-28T18:34:12","PhP 216,000",216000,"PHP",5120.2912876821438,8473.5789102036015,{"$f":"OFFSET(F1282,0,Brains!$D$1,1,1)","v":8473.5789102036015},"Planner","Manager","Philippines","Philippines","4 to 6","4 to 6 hours a day","0-5 yrs",{"$f":"IF(H1282<15000,\"0-14.9K\",IF(H1282<30000,\"15-29.9K\",IF(H1282<50000,\"30-49.9K\",IF(H1282<75000,\"50-74.9K\",IF(H1282<100000,\"75-99.9K\",IF(H1282<150000,\"100-149.9K\",IF(H1282<250000,\"150-249.9K\",\"250K+\")))))))","v":"0-14.9K"},5,2,4,1,7,{"$f":"IF(H1282<15000,1,IF(H1282<30000,2,IF(H1282<50000,3,IF(H1282<75000,4,IF(H1282<100000,5,IF(H1282<150000,6,IF(H1282<250000,7,8)))))))","v":1}]
["ID1034","2012-05-28T13:01:42","PK RS 456000",456000,"PKR",4840.0244548604041,11153.780299880145,{"$f":"OFFSET(F1283,0,Brains!$D$1,1,1)","v":11153.780299880145},"Strategic Planning Executive","Manager","Pakistan","Pakistan","4 to 6","4 to 6 hours a day","0-5 yrs","0-14.9K",5,2,4,1,7,1]
["ID0725","2012-05-26T15:01:00","USD130000",130000,"USD",130000,130000,{"$f":"OFFSET(F1284,0,Brains!$D$1,1,1)","v":130000},"Modeller","Manager","Australia","Australia","4 to 6","4 to 6 hours a day","0-5 yrs","100-149.9K",5,3,4,1,7,6]
["ID1786","2012-06-11T05:59:09",27000,27000,"GBP",42556.81334581667,40059.347181008903,{"$f":"OFFSET(F1285,0,Brains!$D$1,1,1)","v":40059.347181008903},"assistant account manager","Manager","UK","UK","4 to 6","4 to 6 hours a day","0-5 yrs","30-49.9K",5,3,4,1,7,3]
["ID1787","2012-06-11T05:59:55",27000,27000,"GBP",42556.81334581667,40059.347181008903,{"$f":"OFFSET(F1286,0,Brains!$D$1,1,1)","v":40059.347181008903},"assistant account manager","Manager","UK","UK","4 to 6","4 to 6 hours a day","0-5 yrs","30-49.9K",5,3,4,1,7,3]
["ID0883","2012-05-27T12:41:29","US 2130",25560,"USD",25560,25560,{"$f":"OFFSET(F1287,0,Brains!$D$1,1,1)","v":25560},"Training Coordinator","Manager","saudi arabia","Saudi Arabia","4 to 6","4 to 6 hours a day","0-5 yrs","15-29.9K",5,3,4,1,7,2]
["ID1526","2012-05-31T06:23:09",22000,22000,"USD",22000,22000,{"$f":"OFFSET(F1288,0,Brains!$D$1,1,1)","v":22000},"Data Manager","Manager","USA","USA","4 to 6","4 to 6 hours a day","0-5 yrs","15-29.9K",5,3,4,1,7,2]
["ID1846","2012-06-14T22:03:05",1720,20640,"USD",20640,20640,{"$f":"OFFSET(F1289,0,Brains!$D$1,1,1)","v":20640},"Programme Officer","Manager","Singapore","Singapore","4 to 6","4 to 6 hours a day","0-5 yrs","15-29.9K",5,3,4,1,7,2]
["ID1446","2012-05-30T11:20:33","MYR60000",60000,"MYR",19008.034062397041,30927.835051546394,{"$f":"OFFSET(F1290,0,Brains!$D$1,1,1)","v":30927.835051546394},"Liquidity Management Executive","Manager","Malaysia","Malaysia","4 to 6","4 to 6 hours a day","0-5 yrs","30-49.9K",5,3,4,1,7,3]
["ID0660","2012-05-26T12:28:05","INR 9,50,000",950000,"INR",16917.52085307044,47306.045214620055,{"$f":"OFFSET(F1291,0,Brains!$D$1,1,1)","v":47306.045214620055},"Investment Banker","Manager","India","India","4 to 6","4 to 6 hours a day","0-5 yrs","30-49.9K",5,3,4,1,7,3]
["ID0928","2012-05-27T21:24:42","7 Lakhs",700000,"INR",12465.541681209797,34857.085947614782,{"$f":"OFFSET(F1292,0,Brains!$D$1,1,1)","v":34857.085947614782},"Business Support Executive","Manager","India","India","4 to 6","4 to 6 hours a day","0-5 yrs","30-49.9K",5,3,4,1,7,3]
["ID1014","2012-05-28T11:37:17","LKR 240000",240000,"LKR",1805.7739622442759,4045.4438188989652,{"$f":"OFFSET(F1293,0,Brains!$D$1,1,1)","v":4045.4438188989652},"Management Trainee","Manager","Sri Lanka","Sri Lanka","4 to 6","4 to 6 hours a day","0-5 yrs","0-14.9K",5,3,4,1,7,1]
["ID0945","2012-05-28T00:17:26",70000,70000,"USD",70000,70000,{"$f":"OFFSET(F1294,0,Brains!$D$1,1,1)","v":70000},"Client Manager","Manager","USA","USA","4 to 6","4 to 6 hours a day","0-5 yrs","50-74.9K",5,4,4,1,7,4]
["ID1216","2012-05-29T00:30:42",2600000,2600000,"INR",46300.583387350678,129469.17637685488,{"$f":"OFFSET(F1295,0,Brains!$D$1,1,1)","v":129469.17637685488},"Practice Manager","Manager","India","India","4 to 6","4 to 6 hours a day","0-5 yrs","100-149.9K",5,4,4,1,7,6]
["ID1016","2012-05-28T11:41:11",15000,15000,"USD",15000,15000,{"$f":"OFFSET(F1296,0,Brains!$D$1,1,1)","v":15000},"Operations Management","Manager","India","India","4 to 6","4 to 6 hours a day","0-5 yrs","15-29.9K",5,4,4,1,7,2]
["ID1513","2012-05-31T01:45:48","Rs 5,36,000",536000,"INR",9545.0433444692171,26690.568668459317,{"$f":"OFFSET(F1297,0,Brains!$D$1,1,1)","v":26690.568668459317},"Team Lead","Manager","India","India","4 to 6","4 to 6 hours a day","0-5 yrs","15-29.9K",5,4,4,1,7,2]
["ID1105","2012-05-28T16:28:25",3500,3500,"USD",3500,3500,{"$f":"OFFSET(F1298,0,Brains!$D$1,1,1)","v":3500},"OFFICER","Manager","PAKISTAN","Pakistan","4 to 6","4 to 6 hours a day","0-5 yrs","0-14.9K",5,4,4,1,7,1]
["ID1026","2012-05-28T12:32:12",300000,300000,"PKR",3184.2266150397395,7338.0133551843064,{"$f":"OFFSET(F1299,0,Brains!$D$1,1,1)","v":7338.0133551843064},"Banker","Manager","Pakistan","Pakistan","4 to 6","4 to 6 hours a day","0-5 yrs","0-14.9K",5,4,4,1,7,1]
["ID0746","2012-05-26T16:10:08",74000,74000,"GBP",116637.19213297902,109792.28486646884,{"$f":"OFFSET(F1300,0,Brains!$D$1,1,1)","v":109792.28486646884},"Corporate Finance Manager","Manager","UK","UK","4 to 6","4 to 6 hours a day","0-5 yrs","100-149.9K",5,5,4,1,7,6]
["ID1138","2012-05-28T18:39:19",90000,90000,"USD",90000,90000,{"$f":"OFFSET(F1301,0,Brains!$D$1,1,1)","v":90000},"Performance manager","Manager","USA","USA","4 to 6","4 to 6 hours a day","0-5 yrs","75-99.9K",5,5,4,1,7,5]
["ID0614","2012-05-26T10:31:42",61000,61000,"USD",61000,61000,{"$f":"OFFSET(F1302,0,Brains!$D$1,1,1)","v":61000},"Sales ops","Manager","USA","USA","4 to 6","4 to 6 hours a day","0-5 yrs","50-74.9K",5,5,4,1,7,4]
["ID0642","2012-05-26T11:46:20",55000,55000,"CAD",54084.883766667976,44035.22818254603,{"$f":"OFFSET(F1303,0,Brains!$D$1,1,1)","v":44035.22818254603},"Project coordinator","Manager","Canada","Canada","4 to 6","4 to 6 hours a day","0-5 yrs","30-49.9K",5,5,4,1,7,3]
["ID0960","2012-05-28T04:40:41","48000 $",48000,"USD",48000,48000,{"$f":"OFFSET(F1304,0,Brains!$D$1,1,1)","v":48000},"Merchandise planner","Manager","France","France","4 to 6","4 to 6 hours a day","0-5 yrs","30-49.9K",5,5,4,1,7,3]
["ID1878","2012-06-16T17:14:03",40000,40000,"USD",40000,40000,{"$f":"OFFSET(F1305,0,Brains!$D$1,1,1)","v":40000},"Assistant Manager","Manager","India","India","4 to 6","4 to 6 hours a day","0-5 yrs","30-49.9K",5,5,4,1,7,3]
["ID1545","2012-05-31T17:08:59",30000,30000,"USD",30000,30000,{"$f":"OFFSET(F1306,0,Brains!$D$1,1,1)","v":30000},"Marketing Services Manager","Manager","Pakistan","Pakistan","4 to 6","4 to 6 hours a day","0-5 yrs","30-49.9K",5,5,4,1,7,3]
["ID1180","2012-05-28T22:50:51",28000,28000,"USD",28000,28000,{"$f":"OFFSET(F1307,0,Brains!$D$1,1,1)","v":28000},"Business Intelligence Manager","Manager","Poland","Poland","4 to 6","4 to 6 hours a day","0-5 yrs","15-29.9K",5,5,4,1,7,2]
["ID1336","2012-05-29T17:05:31",24000,24000,"USD",24000,24000,{"$f":"OFFSET(F1308,0,Brains!$D$1,1,1)","v":24000},"Dir. Revenue Mgt","Manager","Kingdom of Saudi Arabia","Saudi Arabia","4 to 6","4 to 6 hours a day","0-5 yrs","15-29.9K",5,5,4,1,7,2]
["ID0899","2012-05-27T14:50:56",1000000,1000000,"INR",17807.916687442568,49795.837068021116,{"$f":"OFFSET(F1309,0,Brains!$D$1,1,1)","v":49795.837068021116},"Engagement Lead","Manager","India","India","4 to 6","4 to 6 hours a day","0-5 yrs","30-49.9K",5,5,4,1,7,3]
["ID0908","2012-05-27T15:48:03",16350,16350,"USD",16350,16350,{"$f":"OFFSET(F1310,0,Brains!$D$1,1,1)","v":16350},"Estimator","Manager","India","India","4 to 6","4 to 6 hours a day","0-5 yrs","15-29.9K",5,5,4,1,7,2]
["ID1812","2012-06-12T16:16:25",14000,14000,"USD",14000,14000,{"$f":"OFFSET(F1311,0,Brains!$D$1,1,1)","v":14000},"Manager","Manager","India","India","4 to 6","4 to 6 hours a day","0-5 yrs","0-14.9K",5,5,4,1,7,1]
["ID1157","2012-05-28T20:54:29","Rs. 59,000 (Per Month)",708000,"INR",12608.005014709339,35255.452644158948,{"$f":"OFFSET(F1312,0,Brains!$D$1,1,1)","v":35255.452644158948},"Manager-Operation","Manager","India","India","4 to 6","4 to 6 hours a day","0-5 yrs","30-49.9K",5,5,4,1,7,3]
["ID0958","2012-05-28T03:44:00","2,000,000 Naira",2000000,"NAIRA",12326.656394453004,20555.407099837612,{"$f":"OFFSET(F1313,0,Brains!$D$1,1,1)","v":20555.407099837612},"Head Business Advisory","Manager","Nigeria","Nigeria","4 to 6","4 to 6 hours a day","0-5 yrs","15-29.9K",5,5,4,1,7,2]
["ID0825","2012-05-26T22:53:35","12000 $",12000,"USD",12000,12000,{"$f":"OFFSET(F1314,0,Brains!$D$1,1,1)","v":12000},"Investment manager","Manager","Ukraine","Ukraine","4 to 6","4 to 6 hours a day","0-5 yrs","0-14.9K",5,5,4,1,7,1]
["ID0741","2012-05-26T15:54:00","50 k per month",600000,"INR",10684.750012465542,29877.502240812668,{"$f":"OFFSET(F1315,0,Brains!$D$1,1,1)","v":29877.502240812668},"Finance Manager","Manager","India","India","4 to 6","4 to 6 hours a day","0-5 yrs","15-29.9K",5,5,4,1,7,2]
["ID1651","2012-06-04T01:45:03",340000,340000,"INR",6054.6916737304728,16930.584603127179,{"$f":"OFFSET(F1316,0,Brains!$D$1,1,1)","v":16930.584603127179},"Assistant Manager","Manager","India","India","4 to 6","4 to 6 hours a day","0-5 yrs","15-29.9K",5,5,4,1,7,2]
["ID1039","2012-05-28T13:11:42",6000,6000,"USD",6000,6000,{"$f":"OFFSET(F1317,0,Brains!$D$1,1,1)","v":6000},"Manager","Manager","India","India","4 to 6","4 to 6 hours a day","0-5 yrs","0-14.9K",5,5,4,1,7,1]
["ID1632","2012-06-03T01:33:57",320000,320000,"INR",5698.5333399816218,15934.667861766757,{"$f":"OFFSET(F1318,0,Brains!$D$1,1,1)","v":15934.667861766757},"senior executive","Manager","India","India","4 to 6","4 to 6 hours a day","0-5 yrs","15-29.9K",5,5,4,1,7,2]
["ID1350","2012-05-29T18:14:53","USD 5300",5300,"USD",5300,5300,{"$f":"OFFSET(F1319,0,Brains!$D$1,1,1)","v":5300},"Asst. Production Manager","Manager","Pakistan","Pakistan","4 to 6","4 to 6 hours a day","0-5 yrs","0-14.9K",5,5,4,1,7,1]
["ID0698","2012-05-26T13:37:50",278400,278400,"INR",4957.7240057840108,13863.161039737077,{"$f":"OFFSET(F1320,0,Brains!$D$1,1,1)","v":13863.161039737077},"Asst. Manager","Manager","India","India","4 to 6","4 to 6 hours a day","0-5 yrs","0-14.9K",5,5,4,1,7,1]
["ID1547","2012-05-31T17:34:34","Rs. 180000",180000,"INR",3205.4250037396623,8963.2506722437993,{"$f":"OFFSET(F1321,0,Brains!$D$1,1,1)","v":8963.2506722437993},"Asst Store Manager","Manager","India","India","4 to 6","4 to 6 hours a day","0-5 yrs","0-14.9K",5,5,4,1,7,1]
["ID0897","2012-05-27T14:47:21",120000,120000,"INR",2136.9500024931081,5975.5004481625338,{"$f":"OFFSET(F1322,0,Brains!$D$1,1,1)","v":5975.5004481625338},"co ordinator","Manager","India","India","4 to 6","4 to 6 hours a day","0-5 yrs","0-14.9K",5,5,4,1,7,1]
["ID1754","2012-06-08T14:43:05",60000,60000,"USD",60000,60000,{"$f":"OFFSET(F1323,0,Brains!$D$1,1,1)","v":60000},"Project Lead ","Manager","USA","USA","All 8","All the 8 hours baby, all the 8!","0-5 yrs","50-74.9K",8,2,5,1,7,4]
["ID1755","2012-06-08T14:43:40",60000,60000,"USD",60000,60000,{"$f":"OFFSET(F1324,0,Brains!$D$1,1,1)","v":60000},"Project Lead ","Manager","USA","USA","All 8","All the 8 hours baby, all the 8!","0-5 yrs","50-74.9K",8,2,5,1,7,4]
["ID1770","2012-06-09T03:20:15",52500,52500,"USD",52500,52500,{"$f":"OFFSET(F1325,0,Brains!$D$1,1,1)","v":52500},"Data Management Solutions Supervisor","Manager","USA","USA","All 8","All the 8 hours baby, all the 8!","0-5 yrs","50-74.9K",8,3,5,1,7,4]
["ID0880","2012-05-27T12:32:45","62000 USD",62000,"USD",62000,62000,{"$f":"OFFSET(F1326,0,Brains!$D$1,1,1)","v":62000},"Deputy Manager Finance","Manager","Qatar","Qatar","All 8","All the 8 hours baby, all the 8!","11-20 yrs","50-74.9K",8,11,5,3,7,4]
["ID0661","2012-05-26T12:28:11","INR 165000",165000,"INR",2938.3062534280239,8216.313116223484,{"$f":"OFFSET(F1327,0,Brains!$D$1,1,1)","v":8216.313116223484},"Co-operative bank","Manager","India","India","All 8","All the 8 hours baby, all the 8!","11-20 yrs","0-14.9K",8,11,5,3,7,1]
["ID1466","2012-05-30T14:28:57","Rs. 1150000/-",1150000,"INR",20479.104190558952,57265.212628224283,{"$f":"OFFSET(F1328,0,Brains!$D$1,1,1)","v":57265.212628224283},"Project Manager","Manager","India","India","All 8","All the 8 hours baby, all the 8!","11-20 yrs","50-74.9K",8,12,5,3,7,4]
["ID1604","2012-06-01T20:38:57",10000,10000,"USD",10000,10000,{"$f":"OFFSET(F1329,0,Brains!$D$1,1,1)","v":10000},"dgm","Manager","India","India","All 8","All the 8 hours baby, all the 8!","11-20 yrs","0-14.9K",8,12,5,3,7,1]
["ID1121","2012-05-28T17:17:39",60000,60000,"USD",60000,60000,{"$f":"OFFSET(F1330,0,Brains!$D$1,1,1)","v":60000},"manager","Manager","India","India","All 8","All the 8 hours baby, all the 8!","11-20 yrs","50-74.9K",8,14,5,3,7,4]
["ID0770","2012-05-26T17:44:34","Rs 1200000",1200000,"INR",21369.500024931083,59755.004481625336,{"$f":"OFFSET(F1331,0,Brains!$D$1,1,1)","v":59755.004481625336},"Regional Formwork Head ","Manager","India","India","All 8","All the 8 hours baby, all the 8!","11-20 yrs","50-74.9K",8,14,5,3,7,4]
["ID1884","2012-06-17T04:02:00","US$100,000",100000,"USD",100000,100000,{"$f":"OFFSET(F1332,0,Brains!$D$1,1,1)","v":100000},"Senior Manager MIS","Manager","UAE","UAE","All 8","All the 8 hours baby, all the 8!","11-20 yrs","100-149.9K",8,15,5,3,7,6]
["ID1021","2012-05-28T12:15:53","SGD92,000",92000,"SGD",72571.80269935554,88038.277511961729,{"$f":"OFFSET(F1333,0,Brains!$D$1,1,1)","v":88038.277511961729},"Finance Manager","Manager","Singapore","Singapore","All 8","All the 8 hours baby, all the 8!","11-20 yrs","75-99.9K",8,15,5,3,7,5]
["ID0737","2012-05-26T15:35:43",40000,40000,"USD",40000,40000,{"$f":"OFFSET(F1334,0,Brains!$D$1,1,1)","v":40000},"Revenue Manager","Manager","India","India","All 8","All the 8 hours baby, all the 8!","11-20 yrs","30-49.9K",8,15,5,3,7,3]
["ID1116","2012-05-28T17:04:04","R100,000",100000,"ZAR",12192.177986291113,17630.465444287729,{"$f":"OFFSET(F1335,0,Brains!$D$1,1,1)","v":17630.465444287729},"Q.A.Officer","Manager","South Africa","South Africa","All 8","All the 8 hours baby, all the 8!","11-20 yrs","15-29.9K",8,15,5,3,7,2]
["ID1023","2012-05-28T12:20:48","INR 4.5 Lac",450000,"INR",8013.5625093491553,22408.126680609501,{"$f":"OFFSET(F1336,0,Brains!$D$1,1,1)","v":22408.126680609501},"Asst. Manager","Manager","India","India","All 8","All the 8 hours baby, all the 8!","11-20 yrs","15-29.9K",8,15,5,3,7,2]
["ID1057","2012-05-28T14:22:02","16000 euro",16000,"EUR",20326.391023865726,20099.189500183405,{"$f":"OFFSET(F1337,0,Brains!$D$1,1,1)","v":20099.189500183405},"Management Information Systems","Manager","Greece","Greece","All 8","All the 8 hours baby, all the 8!","11-20 yrs","15-29.9K",8,16,5,3,7,2]
["ID1162","2012-05-28T22:10:12",30000,30000,"USD",30000,30000,{"$f":"OFFSET(F1338,0,Brains!$D$1,1,1)","v":30000},"pricing and cost manager","Manager","mexico","Mexico","All 8","All the 8 hours baby, all the 8!","11-20 yrs","30-49.9K",8,17,5,3,7,3]
["ID0878","2012-05-27T11:50:16",1000,12000,"USD",12000,12000,{"$f":"OFFSET(F1339,0,Brains!$D$1,1,1)","v":12000},"sup","Manager","UAE","UAE","All 8","All the 8 hours baby, all the 8!","11-20 yrs","0-14.9K",8,18,5,3,7,1]
["ID1481","2012-05-30T18:47:17","US $ 3200",3200,"USD",3200,3200,{"$f":"OFFSET(F1340,0,Brains!$D$1,1,1)","v":3200},"Regional Business Manager ","Manager","India","India","All 8","All the 8 hours baby, all the 8!","11-20 yrs","0-14.9K",8,19,5,3,7,1]
["ID1337","2012-05-29T17:09:02","60000 USD p.a.",60000,"USD",60000,60000,{"$f":"OFFSET(F1341,0,Brains!$D$1,1,1)","v":60000},"Controlling Manager","Manager","CEE","CEE","All 8","All the 8 hours baby, all the 8!","11-20 yrs","50-74.9K",8,20,5,3,7,4]
["ID1476","2012-05-30T17:07:47","Â£37000",37000,"GBP",58318.59606648951,54896.142433234418,{"$f":"OFFSET(F1342,0,Brains!$D$1,1,1)","v":54896.142433234418},"Planning & Scheduling Manager","Manager","UK","UK","All 8","All the 8 hours baby, all the 8!","11-20 yrs","50-74.9K",8,20,5,3,7,4]
["ID0835","2012-05-26T23:21:57","Rs.6,00,000/-",600000,"INR",10684.750012465542,29877.502240812668,{"$f":"OFFSET(F1343,0,Brains!$D$1,1,1)","v":29877.502240812668},"AO","Manager","India","India","All 8","All the 8 hours baby, all the 8!","11-20 yrs","15-29.9K",8,20,5,3,7,2]
["ID1661","2012-06-04T16:31:09","Rs. 5 lacs",500000,"INR",8903.9583437212841,24897.918534010558,{"$f":"OFFSET(F1344,0,Brains!$D$1,1,1)","v":24897.918534010558},"Team Leader","Manager","India","India","All 8","All the 8 hours baby, all the 8!","11-20 yrs","15-29.9K",8,20,5,3,7,2]
["ID1420","2012-05-30T00:50:03",81000,81000,"USD",81000,81000,{"$f":"OFFSET(F1345,0,Brains!$D$1,1,1)","v":81000},"Finance & IT Manager","Manager","USA","USA","1 or 2","1 or 2 hours a day","11-20 yrs","75-99.9K",1.5,12,2,3,7,5]
["ID1208","2012-05-29T00:07:36",20000,20000,"EUR",25407.988779832154,25123.986875229257,{"$f":"OFFSET(F1346,0,Brains!$D$1,1,1)","v":25123.986875229257},"warehouse management","Manager","GREECE","Greece","1 or 2","1 or 2 hours a day","11-20 yrs",{"$f":"IF(H1346<15000,\"0-14.9K\",IF(H1346<30000,\"15-29.9K\",IF(H1346<50000,\"30-49.9K\",IF(H1346<75000,\"50-74.9K\",IF(H1346<100000,\"75-99.9K\",IF(H1346<150000,\"100-149.9K\",IF(H1346<250000,\"150-249.9K\",\"250K+\")))))))","v":"15-29.9K"},1.5,12,2,3,7,{"$f":"IF(H1346<15000,1,IF(H1346<30000,2,IF(H1346<50000,3,IF(H1346<75000,4,IF(H1346<100000,5,IF(H1346<150000,6,IF(H1346<250000,7,8)))))))","v":2}]
["ID0789","2012-05-26T20:08:21",10000,10000,"USD",10000,10000,{"$f":"OFFSET(F1347,0,Brains!$D$1,1,1)","v":10000},"BDM","Manager","India","India","1 or 2","1 or 2 hours a day","11-20 yrs","0-14.9K",1.5,12,2,3,7,1]
["ID1210","2012-05-29T00:16:55","Rs. 900000",900000,"INR",16027.125018698311,44816.253361219002,{"$f":"OFFSET(F1348,0,Brains!$D$1,1,1)","v":44816.253361219002},"Manager F & A","Manager","India","India","1 or 2","1 or 2 hours a day","11-20 yrs","30-49.9K",1.5,13,2,3,7,3]
["ID1655","2012-06-04T09:49:44",155000,155000,"USD",155000,155000,{"$f":"OFFSET(F1349,0,Brains!$D$1,1,1)","v":155000},"Consulting Practice Manager","Manager","USA","USA","1 or 2","1 or 2 hours a day","11-20 yrs","150-249.9K",1.5,14,2,3,7,7]
["ID0916","2012-05-27T17:17:24","Â£65000",65000,"GBP",102451.58768437347,96439.16913946587,{"$f":"OFFSET(F1350,0,Brains!$D$1,1,1)","v":96439.16913946587},"Manager","Manager","UK","UK","1 or 2","1 or 2 hours a day","11-20 yrs","75-99.9K",1.5,15,2,3,7,5]
["ID1108","2012-05-28T16:35:19",57000,57000,"EUR",72412.768022521646,71603.362594403385,{"$f":"OFFSET(F1351,0,Brains!$D$1,1,1)","v":71603.362594403385},"Spare Part Coordinator","Manager","Norway","Norway","1 or 2","1 or 2 hours a day","11-20 yrs","50-74.9K",1.5,15,2,3,7,4]
["ID0777","2012-05-26T18:35:20","45000 $",45000,"USD",45000,45000,{"$f":"OFFSET(F1352,0,Brains!$D$1,1,1)","v":45000},"AGM","Manager","India","India","1 or 2","1 or 2 hours a day","11-20 yrs","30-49.9K",1.5,15,2,3,7,3]
["ID1120","2012-05-28T17:15:29","Â£28500",28500,"GBP",44921.080753917595,42284.866468842731,{"$f":"OFFSET(F1353,0,Brains!$D$1,1,1)","v":42284.866468842731},"Development (Project & Planning) Manager","Manager","UK","UK","1 or 2","1 or 2 hours a day","11-20 yrs","30-49.9K",1.5,15,2,3,7,3]
["ID1390","2012-05-29T21:50:45","Rs 250000",250000,"INR",4451.9791718606421,12448.959267005279,{"$f":"OFFSET(F1354,0,Brains!$D$1,1,1)","v":12448.959267005279},"Manager","Manager","India","India","1 or 2","1 or 2 hours a day","11-20 yrs","0-14.9K",1.5,15,2,3,7,1]
["ID1123","2012-05-28T17:22:19","252000 INR",252000,"INR",4487.5950052355274,12548.55094114132,{"$f":"OFFSET(F1355,0,Brains!$D$1,1,1)","v":12548.55094114132},"Inventory Manager","Manager","India","India","1 or 2","1 or 2 hours a day","11-20 yrs","0-14.9K",1.5,16,2,3,7,1]
["ID0845","2012-05-27T00:33:06","1200000 Rs",1200000,"INR",21369.500024931083,59755.004481625336,{"$f":"OFFSET(F1356,0,Brains!$D$1,1,1)","v":59755.004481625336},"project manager","Manager","India","India","1 or 2","1 or 2 hours a day","11-20 yrs","50-74.9K",1.5,18,2,3,7,4]
["ID0681","2012-05-26T13:03:58",100000,100000,"AUD",101990.96564026357,63613.231552162855,{"$f":"OFFSET(F1357,0,Brains!$D$1,1,1)","v":63613.231552162855},"principal developer","Manager","Australia","Australia","1 or 2","1 or 2 hours a day","11-20 yrs","50-74.9K",1.5,20,2,3,7,4]
["ID1424","2012-05-30T01:15:32",72000,72000,"USD",72000,72000,{"$f":"OFFSET(F1358,0,Brains!$D$1,1,1)","v":72000},"Manager","Manager","USA","USA","1 or 2","1 or 2 hours a day","11-20 yrs","50-74.9K",1.5,20,2,3,7,4]
["ID1107","2012-05-28T16:34:48","Â£40000",40000,"GBP",63047.130882691366,59347.181008902073,{"$f":"OFFSET(F1359,0,Brains!$D$1,1,1)","v":59347.181008902073},"Buyer","Manager","UK","UK","1 or 2","1 or 2 hours a day","11-20 yrs","50-74.9K",1.5,20,2,3,7,4]
["ID0577","2012-05-26T07:14:02",6000,6000,"USD",6000,6000,{"$f":"OFFSET(F1360,0,Brains!$D$1,1,1)","v":6000},"In Charge","Manager","Guyana","Guyana","1 or 2","1 or 2 hours a day","11-20 yrs","0-14.9K",1.5,20,2,3,7,1]
["ID0876","2012-05-27T10:13:27",87456,87456,"USD",87456,87456,{"$f":"OFFSET(F1361,0,Brains!$D$1,1,1)","v":87456},"qa team supervisor ","Manager","USA","USA","2 to 3","2 to 3 hours per day","11-20 yrs","75-99.9K",2.5,12,3,3,7,5]
["ID1076","2012-05-28T15:21:51","Â£50",50000,"GBP",78808.913603364199,74183.976261127595,{"$f":"OFFSET(F1362,0,Brains!$D$1,1,1)","v":74183.976261127595},"Production manager","Manager","UK","UK","2 to 3","2 to 3 hours per day","11-20 yrs","50-74.9K",2.5,12,3,3,7,4]
["ID1488","2012-05-30T20:19:51",64000,64000,"USD",64000,64000,{"$f":"OFFSET(F1363,0,Brains!$D$1,1,1)","v":64000},"Program Manager","Manager","USA","USA","2 to 3","2 to 3 hours per day","11-20 yrs","50-74.9K",2.5,12,3,3,7,4]
["ID0784","2012-05-26T19:22:53","AUS$36000",36000,"USD",36000,36000,{"$f":"OFFSET(F1364,0,Brains!$D$1,1,1)","v":36000},"Key Expert User","Manager","Australia","Australia","2 to 3","2 to 3 hours per day","11-20 yrs","30-49.9K",2.5,12,3,3,7,3]
["ID1127","2012-05-28T17:42:22","AED 120000",120000,"AED",32666.305522511171,22675.73696145125,{"$f":"OFFSET(F1365,0,Brains!$D$1,1,1)","v":22675.73696145125},"Finance Manager","Manager","UAE","UAE","2 to 3","2 to 3 hours per day","11-20 yrs","15-29.9K",2.5,12,3,3,7,2]
["ID1641","2012-06-03T12:09:27","10 lacs INR",1000000,"INR",17807.916687442568,49795.837068021116,{"$f":"OFFSET(F1366,0,Brains!$D$1,1,1)","v":49795.837068021116},"Category Manager","Manager","India","India","2 to 3","2 to 3 hours per day","11-20 yrs","30-49.9K",2.5,13,3,3,7,3]
["ID0735","2012-05-26T15:27:48","8 Lakhs",800000,"INR",14246.333349954055,39836.669654416888,{"$f":"OFFSET(F1367,0,Brains!$D$1,1,1)","v":39836.669654416888},"Manager","Manager","India","India","2 to 3","2 to 3 hours per day","11-20 yrs","30-49.9K",2.5,13,3,3,7,3]
["ID1027","2012-05-28T12:35:38","Net- 56000Rs, Gross - 61000Rs",612000,"INR",10898.445012714852,30475.052285628921,{"$f":"OFFSET(F1368,0,Brains!$D$1,1,1)","v":30475.052285628921},"Asst. Manager ","Manager","India","India","2 to 3","2 to 3 hours per day","11-20 yrs","30-49.9K",2.5,13,3,3,7,3]
["ID0868","2012-05-27T06:37:13",98000,98000,"USD",98000,98000,{"$f":"OFFSET(F1369,0,Brains!$D$1,1,1)","v":98000},"supply chain manager","Manager","indonesia","Indonesia","2 to 3","2 to 3 hours per day","11-20 yrs","75-99.9K",2.5,14,3,3,7,5]
["ID1504","2012-05-30T23:01:48",55000,55000,"USD",55000,55000,{"$f":"OFFSET(F1370,0,Brains!$D$1,1,1)","v":55000},"Supplier Manager","Manager","USA","USA","2 to 3","2 to 3 hours per day","11-20 yrs","50-74.9K",2.5,14,3,3,7,4]
["ID0579","2012-05-26T07:18:57",90000,90000,"USD",90000,90000,{"$f":"OFFSET(F1371,0,Brains!$D$1,1,1)","v":90000},"Manager","Manager","USA","USA","2 to 3","2 to 3 hours per day","11-20 yrs","75-99.9K",2.5,15,3,3,7,5]
["ID1543","2012-05-31T16:25:24",320000,320000,"SAR",85333.333333333328,96124.96245118654,{"$f":"OFFSET(F1372,0,Brains!$D$1,1,1)","v":96124.96245118654},"Merchandise Planning Manager","Manager","Saudi Arabia","Saudi Arabia","2 to 3","2 to 3 hours per day","11-20 yrs","75-99.9K",2.5,15,3,3,7,5]
["ID1775","2012-06-10T02:20:05",85000,85000,"USD",85000,85000,{"$f":"OFFSET(F1373,0,Brains!$D$1,1,1)","v":85000},"purchasing manager","Manager","USA","USA","2 to 3","2 to 3 hours per day","11-20 yrs","75-99.9K",2.5,15,3,3,7,5]
["ID1542","2012-05-31T16:25:23","60K â‚¬",60000,"EUR",76223.966339496474,75371.960625687774,{"$f":"OFFSET(F1374,0,Brains!$D$1,1,1)","v":75371.960625687774},"Trade Marketing","Manager","NL","Netherlands","2 to 3","2 to 3 hours per day","11-20 yrs","75-99.9K",2.5,15,3,3,7,5]
["ID1372","2012-05-29T19:54:38","Â£45000",45000,"GBP",70928.022243027779,66765.578635014841,{"$f":"OFFSET(F1375,0,Brains!$D$1,1,1)","v":66765.578635014841},"Management Accountant","Manager","UK","UK","2 to 3","2 to 3 hours per day","11-20 yrs","50-74.9K",2.5,15,3,3,7,4]
["ID1259","2012-05-29T07:52:56",65000,65000,"CAD",63918.498996971248,52041.633306645308,{"$f":"OFFSET(F1376,0,Brains!$D$1,1,1)","v":52041.633306645308},"it manager","Manager","Canada","Canada","2 to 3","2 to 3 hours per day","11-20 yrs","50-74.9K",2.5,15,3,3,7,4]
["ID0811","2012-05-26T22:02:53",5000,60000,"USD",60000,60000,{"$f":"OFFSET(F1377,0,Brains!$D$1,1,1)","v":60000},"Audit Manager","Manager","UAE","UAE","2 to 3","2 to 3 hours per day","11-20 yrs","50-74.9K",2.5,15,3,3,7,4]
["ID1464","2012-05-30T14:19:07","Rs.2,50,000.00",250000,"INR",4451.9791718606421,12448.959267005279,{"$f":"OFFSET(F1378,0,Brains!$D$1,1,1)","v":12448.959267005279},"Manager Commercial","Manager","India","India","2 to 3","2 to 3 hours per day","11-20 yrs","0-14.9K",2.5,15,3,3,7,1]
["ID1631","2012-06-02T22:38:56",60000,60000,"USD",60000,60000,{"$f":"OFFSET(F1379,0,Brains!$D$1,1,1)","v":60000},"Head of Business","Manager","Indonesia","Indonesia","2 to 3","2 to 3 hours per day","11-20 yrs","50-74.9K",2.5,16,3,3,7,4]
["ID0808","2012-05-26T21:43:54",48000,48000,"USD",48000,48000,{"$f":"OFFSET(F1380,0,Brains!$D$1,1,1)","v":48000},"Operations Support Coordinator","Manager","USA","USA","2 to 3","2 to 3 hours per day","11-20 yrs","30-49.9K",2.5,16,3,3,7,3]
["ID1265","2012-05-29T08:47:48",40000,40000,"USD",40000,40000,{"$f":"OFFSET(F1381,0,Brains!$D$1,1,1)","v":40000},"Senior Materials Handler","Manager","USA","USA","2 to 3","2 to 3 hours per day","11-20 yrs","30-49.9K",2.5,18,3,3,7,3]
["ID0836","2012-05-26T23:36:14","Rs. 6,00,000",600000,"INR",10684.750012465542,29877.502240812668,{"$f":"OFFSET(F1382,0,Brains!$D$1,1,1)","v":29877.502240812668},"Project Manager","Manager","India","India","2 to 3","2 to 3 hours per day","11-20 yrs","15-29.9K",2.5,18,3,3,7,2]
["ID1173","2012-05-28T22:41:26","8725 $",8725,"USD",8725,8725,{"$f":"OFFSET(F1383,0,Brains!$D$1,1,1)","v":8725},"Administration Officer","Manager","Pakistan","Pakistan","2 to 3","2 to 3 hours per day","11-20 yrs","0-14.9K",2.5,18,3,3,7,1]
["ID1147","2012-05-28T19:25:35",90000,90000,"EUR",114335.9495092447,113057.94093853167,{"$f":"OFFSET(F1384,0,Brains!$D$1,1,1)","v":113057.94093853167},"Management Information Manager","Manager","Continental Europe","CEE","2 to 3","2 to 3 hours per day","11-20 yrs","100-149.9K",2.5,20,3,3,7,6]
["ID0609","2012-05-26T09:52:22",100000,100000,"AUD",101990.96564026357,63613.231552162855,{"$f":"OFFSET(F1385,0,Brains!$D$1,1,1)","v":63613.231552162855},"Purchasing Manager","Manager","Australia","Australia","2 to 3","2 to 3 hours per day","11-20 yrs","50-74.9K",2.5,20,3,3,7,4]
["ID0602","2012-05-26T08:56:13","90 k",90000,"USD",90000,90000,{"$f":"OFFSET(F1386,0,Brains!$D$1,1,1)","v":90000},"Operations","Manager","USA","USA","2 to 3","2 to 3 hours per day","11-20 yrs","75-99.9K",2.5,20,3,3,7,5]
["ID1925","2012-06-20T13:05:17","60000 EUR",60000,"EUR",76223.966339496474,75371.960625687774,{"$f":"OFFSET(F1387,0,Brains!$D$1,1,1)","v":75371.960625687774},"Project Manager","Manager","Europe","Europe","2 to 3","2 to 3 hours per day","11-20 yrs","75-99.9K",2.5,20,3,3,7,5]
["ID1449","2012-05-30T12:12:38",67000,67000,"USD",67000,67000,{"$f":"OFFSET(F1388,0,Brains!$D$1,1,1)","v":67000},"accounting systems manager ","Manager","USA","USA","2 to 3","2 to 3 hours per day","11-20 yrs","50-74.9K",2.5,20,3,3,7,4]
["ID1375","2012-05-29T20:40:12","$60,000 USD",60000,"USD",60000,60000,{"$f":"OFFSET(F1389,0,Brains!$D$1,1,1)","v":60000},"project manager","Manager","USA","USA","2 to 3","2 to 3 hours per day","11-20 yrs","50-74.9K",2.5,20,3,3,7,4]
["ID0690","2012-05-26T13:19:42",50000,50000,"USD",50000,50000,{"$f":"OFFSET(F1390,0,Brains!$D$1,1,1)","v":50000},"AREA SALES MANAGER","Manager","India","India","2 to 3","2 to 3 hours per day","11-20 yrs","50-74.9K",2.5,20,3,3,7,4]
["ID0831","2012-05-26T23:05:15",40000,40000,"USD",40000,40000,{"$f":"OFFSET(F1391,0,Brains!$D$1,1,1)","v":40000},"High School Teacher","Manager","USA","USA","2 to 3","2 to 3 hours per day","11-20 yrs","30-49.9K",2.5,20,3,3,7,3]
["ID1279","2012-05-29T10:45:46","MYR89500",89500,"MYR",28353.650809742252,46134.020618556708,{"$f":"OFFSET(F1392,0,Brains!$D$1,1,1)","v":46134.020618556708},"Manager","Manager","Malaysia","Malaysia","2 to 3","2 to 3 hours per day","11-20 yrs","30-49.9K",2.5,20,3,3,7,3]
["ID1316","2012-05-29T15:10:24",13500,13500,"USD",13500,13500,{"$f":"OFFSET(F1393,0,Brains!$D$1,1,1)","v":13500},"Asst. Manager","Manager","India","India","2 to 3","2 to 3 hours per day","11-20 yrs","0-14.9K",2.5,20,3,3,7,1]
["ID1227","2012-05-29T01:44:03",100000,100000,"USD",100000,100000,{"$f":"OFFSET(F1394,0,Brains!$D$1,1,1)","v":100000},"Finance Manager","Manager","USA","USA","4 to 6","4 to 6 hours a day","11-20 yrs","100-149.9K",5,11,4,3,7,6]
["ID0646","2012-05-26T11:50:34","6,00,000",600000,"INR",10684.750012465542,29877.502240812668,{"$f":"OFFSET(F1395,0,Brains!$D$1,1,1)","v":29877.502240812668},"Organiser","Manager","India","India","4 to 6","4 to 6 hours a day","11-20 yrs","15-29.9K",5,11,4,3,7,2]
["ID1735","2012-06-07T16:53:54",10000,10000,"USD",10000,10000,{"$f":"OFFSET(F1396,0,Brains!$D$1,1,1)","v":10000},"AGM - Operations & Customer Support","Manager","India","India","4 to 6","4 to 6 hours a day","11-20 yrs","0-14.9K",5,11,4,3,7,1]
["ID0779","2012-05-26T18:41:31","Rs 40000",480000,"INR",8547.8000099724322,23902.001792650135,{"$f":"OFFSET(F1397,0,Brains!$D$1,1,1)","v":23902.001792650135},"Banker","Manager","India","India","4 to 6","4 to 6 hours a day","11-20 yrs","15-29.9K",5,11,4,3,7,2]
["ID1626","2012-06-02T19:14:35",140000,140000,"USD",140000,140000,{"$f":"OFFSET(F1398,0,Brains!$D$1,1,1)","v":140000},"sr manager","Manager","USA","USA","4 to 6","4 to 6 hours a day","11-20 yrs","100-149.9K",5,12,4,3,7,6]
["ID1215","2012-05-29T00:29:32",60000,60000,"USD",60000,60000,{"$f":"OFFSET(F1399,0,Brains!$D$1,1,1)","v":60000},"sample manager","Manager","USA","USA","4 to 6","4 to 6 hours a day","11-20 yrs","50-74.9K",5,12,4,3,7,4]
["ID1796","2012-06-11T21:52:14",56600,56600,"USD",56600,56600,{"$f":"OFFSET(F1400,0,Brains!$D$1,1,1)","v":56600},"ECommerce Manager","Manager","USA","USA","4 to 6","4 to 6 hours a day","11-20 yrs","50-74.9K",5,12,4,3,7,4]
["ID0670","2012-05-26T12:52:37",24000,24000,"USD",24000,24000,{"$f":"OFFSET(F1401,0,Brains!$D$1,1,1)","v":24000},"Management Accountant","Manager","Saudi Arabai","Saudi Arabia","4 to 6","4 to 6 hours a day","11-20 yrs","15-29.9K",5,12,4,3,7,2]
["ID1288","2012-05-29T12:17:07",18000,18000,"USD",18000,18000,{"$f":"OFFSET(F1402,0,Brains!$D$1,1,1)","v":18000},"Manager","Manager","India","India","4 to 6","4 to 6 hours a day","11-20 yrs","15-29.9K",5,12,4,3,7,2]
["ID1343","2012-05-29T17:36:13",18000,18000,"USD",18000,18000,{"$f":"OFFSET(F1403,0,Brains!$D$1,1,1)","v":18000},"liquidity manager","Manager","Ghana","Ghana","4 to 6","4 to 6 hours a day","11-20 yrs","15-29.9K",5,12,4,3,7,2]
["ID0630","2012-05-26T11:10:23","Rs60000",720000,"INR",12821.700014958649,35853.002688975197,{"$f":"OFFSET(F1404,0,Brains!$D$1,1,1)","v":35853.002688975197},"Quantity Surveyor","Manager","India","India","4 to 6","4 to 6 hours a day","11-20 yrs","30-49.9K",5,12,4,3,7,3]
["ID1877","2012-06-16T17:07:45","INR 50000",600000,"INR",10684.750012465542,29877.502240812668,{"$f":"OFFSET(F1405,0,Brains!$D$1,1,1)","v":29877.502240812668},"Manager- Customer Support","Manager","India","India","4 to 6","4 to 6 hours a day","11-20 yrs","15-29.9K",5,12,4,3,7,2]
["ID1155","2012-05-28T20:45:35",13.5,13500,"USD",13500,13500,{"$f":"OFFSET(F1406,0,Brains!$D$1,1,1)","v":13500},"Project manager","Manager","Montenegro","Montenegro","4 to 6","4 to 6 hours a day","11-20 yrs","0-14.9K",5,13,4,3,7,1]
["ID1719","2012-06-06T19:39:06",550000,550000,"INR",9794.354178093412,27387.710387411611,{"$f":"OFFSET(F1407,0,Brains!$D$1,1,1)","v":27387.710387411611},"Accounts manager","Manager","India","India","4 to 6","4 to 6 hours a day","11-20 yrs","15-29.9K",5,13,4,3,7,2]
["ID1387","2012-05-29T21:46:28","97,000 USD",97000,"USD",97000,97000,{"$f":"OFFSET(F1408,0,Brains!$D$1,1,1)","v":97000},"Sr. Manager of Finance","Manager","USA","USA","4 to 6","4 to 6 hours a day","11-20 yrs","75-99.9K",5,14,4,3,7,5]
["ID1134","2012-05-28T18:11:36","â‚¬ 45000",45000,"EUR",57167.974754622352,56528.970469265834,{"$f":"OFFSET(F1409,0,Brains!$D$1,1,1)","v":56528.970469265834},"Sales Planning","Manager","Spain","Spain","4 to 6","4 to 6 hours a day","11-20 yrs","50-74.9K",5,14,4,3,7,4]
["ID0976","2012-05-28T07:28:07","AUD$200,000",200000,"AUD",203981.93128052715,127226.46310432571,{"$f":"OFFSET(F1410,0,Brains!$D$1,1,1)","v":127226.46310432571},"Corporate Finance Manager","Manager","Australia","Australia","4 to 6","4 to 6 hours a day","11-20 yrs",{"$f":"IF(H1410<15000,\"0-14.9K\",IF(H1410<30000,\"15-29.9K\",IF(H1410<50000,\"30-49.9K\",IF(H1410<75000,\"50-74.9K\",IF(H1410<100000,\"75-99.9K\",IF(H1410<150000,\"100-149.9K\",IF(H1410<250000,\"150-249.9K\",\"250K+\")))))))","v":"100-149.9K"},5,15,4,3,7,{"$f":"IF(H1410<15000,1,IF(H1410<30000,2,IF(H1410<50000,3,IF(H1410<75000,4,IF(H1410<100000,5,IF(H1410<150000,6,IF(H1410<250000,7,8)))))))","v":6}]
["ID0586","2012-05-26T07:50:50",115000,115000,"USD",115000,115000,{"$f":"OFFSET(F1411,0,Brains!$D$1,1,1)","v":115000},"Mgr Op Excellence","Manager","USA","USA","4 to 6","4 to 6 hours a day","11-20 yrs","100-149.9K",5,15,4,3,7,6]
["ID1484","2012-05-30T19:04:44",109000,109000,"USD",109000,109000,{"$f":"OFFSET(F1412,0,Brains!$D$1,1,1)","v":109000},"Mgr Technology","Manager","USA","USA","4 to 6","4 to 6 hours a day","11-20 yrs","100-149.9K",5,15,4,3,7,6]
["ID0748","2012-05-26T16:16:39",65000,65000,"GBP",102451.58768437347,96439.16913946587,{"$f":"OFFSET(F1413,0,Brains!$D$1,1,1)","v":96439.16913946587},"compliance manager","Manager","UK","UK","4 to 6","4 to 6 hours a day","11-20 yrs","75-99.9K",5,15,4,3,7,5]
["ID0721","2012-05-26T14:51:02",85000,85000,"NZD",67794.987956419791,49275.362318840584,{"$f":"OFFSET(F1414,0,Brains!$D$1,1,1)","v":49275.362318840584},"Systems Manager","Manager","New Zealand","New Zealand","4 to 6","4 to 6 hours a day","11-20 yrs","30-49.9K",5,15,4,3,7,3]
["ID1724","2012-06-06T21:20:38",40000,40000,"GBP",63047.130882691366,59347.181008902073,{"$f":"OFFSET(F1415,0,Brains!$D$1,1,1)","v":59347.181008902073},"project manager","Manager","UK","UK","4 to 6","4 to 6 hours a day","11-20 yrs","50-74.9K",5,15,4,3,7,4]
["ID1560","2012-05-31T22:56:21","$59,000 USD",59000,"USD",59000,59000,{"$f":"OFFSET(F1416,0,Brains!$D$1,1,1)","v":59000},"Operations Manager","Manager","USA","USA","4 to 6","4 to 6 hours a day","11-20 yrs","50-74.9K",5,15,4,3,7,4]
["ID1231","2012-05-29T02:02:39","$40K",40000,"USD",40000,40000,{"$f":"OFFSET(F1417,0,Brains!$D$1,1,1)","v":40000},"SOX,SAP, Insurance Coordinator","Manager","Pakistan, Angola","Pakistan","4 to 6","4 to 6 hours a day","11-20 yrs","30-49.9K",5,15,4,3,7,3]
["ID1578","2012-06-01T05:37:32",240000,240000,"PHP",5689.2125418690484,9415.0876780040016,{"$f":"OFFSET(F1418,0,Brains!$D$1,1,1)","v":9415.0876780040016},"IT Coordinator","Manager","Philippines","Philippines","4 to 6","4 to 6 hours a day","11-20 yrs","0-14.9K",5,15,4,3,7,1]
["ID1762","2012-06-08T21:00:25",67000,67000,"USD",67000,67000,{"$f":"OFFSET(F1419,0,Brains!$D$1,1,1)","v":67000},"Manager","Manager","USA","USA","4 to 6","4 to 6 hours a day","11-20 yrs","50-74.9K",5,16,4,3,7,4]
["ID1789","2012-06-11T16:55:40","Â£26500",26500,"GBP",41768.724209783031,39317.507418397625,{"$f":"OFFSET(F1420,0,Brains!$D$1,1,1)","v":39317.507418397625},"Compliance Manager","Manager","UK","UK","4 to 6","4 to 6 hours a day","11-20 yrs","30-49.9K",5,16,4,3,7,3]
["ID1664","2012-06-04T19:11:18","Â£22k",22000,"GBP",34675.92198548025,32640.949554896142,{"$f":"OFFSET(F1421,0,Brains!$D$1,1,1)","v":32640.949554896142},"Supply/Demand Planner","Manager","UK","UK","4 to 6","4 to 6 hours a day","11-20 yrs","30-49.9K",5,17,4,3,7,3]
["ID1443","2012-05-30T10:11:19",96230,96230,"USD",96230,96230,{"$f":"OFFSET(F1422,0,Brains!$D$1,1,1)","v":96230},"Manager, Data Management","Manager","USA","USA","4 to 6","4 to 6 hours a day","11-20 yrs","75-99.9K",5,18,4,3,7,5]
["ID0569","2012-05-26T06:47:00","AUD $155,000",155000,"AUD",158085.99674240855,98600.508905852417,{"$f":"OFFSET(F1423,0,Brains!$D$1,1,1)","v":98600.508905852417},"Finance Manager Business Services","Manager","Australia","Australia","4 to 6","4 to 6 hours a day","11-20 yrs","75-99.9K",5,20,4,3,7,5]
["ID1240","2012-05-29T03:51:28",75000,75000,"GBP",118213.37040504631,111275.96439169139,{"$f":"OFFSET(F1424,0,Brains!$D$1,1,1)","v":111275.96439169139},"Finance Manager","Manager","UK","UK","4 to 6","4 to 6 hours a day","11-20 yrs","100-149.9K",5,20,4,3,7,6]
["ID1584","2012-06-01T07:22:36",100000,100000,"AUD",101990.96564026357,63613.231552162855,{"$f":"OFFSET(F1425,0,Brains!$D$1,1,1)","v":63613.231552162855},"Management Accountant","Manager","Australia","Australia","4 to 6","4 to 6 hours a day","11-20 yrs","50-74.9K",5,20,4,3,7,4]
["ID1358","2012-05-29T19:01:05",40000,40000,"EUR",50815.977559664309,50247.973750458514,{"$f":"OFFSET(F1426,0,Brains!$D$1,1,1)","v":50247.973750458514},"officer","Manager","Austria","Austria","4 to 6","4 to 6 hours a day","11-20 yrs","50-74.9K",5,20,4,3,7,4]
["ID0624","2012-05-26T11:03:06",50000,50000,"USD",50000,50000,{"$f":"OFFSET(F1427,0,Brains!$D$1,1,1)","v":50000},"Project coordinator","Manager","USA","USA","4 to 6","4 to 6 hours a day","11-20 yrs","50-74.9K",5,20,4,3,7,4]
["ID1765","2012-06-08T23:20:36",71500,71500,"USD",71500,71500,{"$f":"OFFSET(F1428,0,Brains!$D$1,1,1)","v":71500},"Pricing Manager","Manager","USA","USA","All 8","All the 8 hours baby, all the 8!","11-20 yrs","50-74.9K",8,11,5,3,7,4]
["ID0954","2012-05-28T01:47:29",135000,135000,"USD",135000,135000,{"$f":"OFFSET(F1429,0,Brains!$D$1,1,1)","v":135000},"Marketing Insights Manager","Manager","USA","USA","All 8","All the 8 hours baby, all the 8!","11-20 yrs","100-149.9K",8,15,5,3,7,6]
["ID1828","2012-06-13T04:40:03",33250,33250,"USD",33250,33250,{"$f":"OFFSET(F1430,0,Brains!$D$1,1,1)","v":33250},"Planning and Logistics Coordinator","Manager","USA","USA","All 8","All the 8 hours baby, all the 8!","11-20 yrs","30-49.9K",8,20,5,3,7,3]
["ID0619","2012-05-26T10:54:22",21000,21000,"USD",21000,21000,{"$f":"OFFSET(F1431,0,Brains!$D$1,1,1)","v":21000},"Manager","Manager","India","India","All 8","All the 8 hours baby, all the 8!","21-30 yrs","15-29.9K",8,23,5,4,7,2]
["ID1197","2012-05-28T23:25:32","82.000 Euro (pre-tax)",82000,"EUR",104172.75399731184,103008.34618843996,{"$f":"OFFSET(F1432,0,Brains!$D$1,1,1)","v":103008.34618843996},"Finance Project Manager","Manager","Netherlands","Netherlands","All 8","All the 8 hours baby, all the 8!","21-30 yrs","100-149.9K",8,25,5,4,7,6]
["ID0622","2012-05-26T11:01:56",700,8400,"USD",8400,8400,{"$f":"OFFSET(F1433,0,Brains!$D$1,1,1)","v":8400},"SYSTEM MANAGER","Manager","India","India","All 8","All the 8 hours baby, all the 8!","21-30 yrs","0-14.9K",8,26,5,4,7,1]
["ID1565","2012-06-01T00:02:34","Rs. 700000",700000,"INR",12465.541681209797,34857.085947614782,{"$f":"OFFSET(F1434,0,Brains!$D$1,1,1)","v":34857.085947614782},"Manager - Business Development","Manager","India","India","All 8","All the 8 hours baby, all the 8!","21-30 yrs","30-49.9K",8,30,5,4,7,3]
["ID1320","2012-05-29T15:36:42",139000,139000,"EUR",176585.52201983347,174611.70878284334,{"$f":"OFFSET(F1435,0,Brains!$D$1,1,1)","v":174611.70878284334},"NAF Support Manager","Manager","Germany","Germany","1 or 2","1 or 2 hours a day","21-30 yrs","150-249.9K",1.5,25,2,4,7,7]
["ID1401","2012-05-29T22:47:10",130000,130000,"USD",130000,130000,{"$f":"OFFSET(F1436,0,Brains!$D$1,1,1)","v":130000},"Manager","Manager","USA","USA","1 or 2","1 or 2 hours a day","21-30 yrs","100-149.9K",1.5,25,2,4,7,6]
["ID1725","2012-06-06T22:14:27","36000stg",36000,"GBP",56742.417794422225,53412.462908011868,{"$f":"OFFSET(F1437,0,Brains!$D$1,1,1)","v":53412.462908011868},"contracts officer","Manager","UK","UK","1 or 2","1 or 2 hours a day","21-30 yrs","50-74.9K",1.5,25,2,4,7,4]
["ID0599","2012-05-26T08:52:00",50000,50000,"USD",50000,50000,{"$f":"OFFSET(F1438,0,Brains!$D$1,1,1)","v":50000},"General manager","Manager","India","India","1 or 2","1 or 2 hours a day","21-30 yrs","50-74.9K",1.5,25,2,4,7,4]
["ID1161","2012-05-28T22:08:12","Rs.5,00,000",500000,"INR",8903.9583437212841,24897.918534010558,{"$f":"OFFSET(F1439,0,Brains!$D$1,1,1)","v":24897.918534010558},"Deputy Manager","Manager","India","India","1 or 2","1 or 2 hours a day","21-30 yrs","15-29.9K",1.5,25,2,4,7,2]
["ID1534","2012-05-31T10:37:38",105000,105000,"USD",105000,105000,{"$f":"OFFSET(F1440,0,Brains!$D$1,1,1)","v":105000},"Business Banker","Manager","USA","USA","1 or 2","1 or 2 hours a day","21-30 yrs","100-149.9K",1.5,30,2,4,7,6]
["ID1092","2012-05-28T15:59:46",40500,40500,"GBP",63835.220018725006,60089.020771513351,{"$f":"OFFSET(F1441,0,Brains!$D$1,1,1)","v":60089.020771513351},"Policy, Performance and Research Officer","Manager","UK","UK","2 to 3","2 to 3 hours per day","21-30 yrs","50-74.9K",2.5,25,3,4,7,4]
["ID1439","2012-05-30T04:13:50",61000,61000,"USD",61000,61000,{"$f":"OFFSET(F1442,0,Brains!$D$1,1,1)","v":61000},"Accounting manager","Manager","USA","USA","2 to 3","2 to 3 hours per day","21-30 yrs","50-74.9K",2.5,25,3,4,7,4]
["ID1894","2012-06-18T17:51:52","Rs. 350000",350000,"INR",6232.7708406048987,17428.542973807391,{"$f":"OFFSET(F1443,0,Brains!$D$1,1,1)","v":17428.542973807391},"manager purchase","Manager","India","India","2 to 3","2 to 3 hours per day","21-30 yrs","15-29.9K",2.5,27,3,4,7,2]
["ID1319","2012-05-29T15:36:25","6lakhs",600000,"INR",10684.750012465542,29877.502240812668,{"$f":"OFFSET(F1444,0,Brains!$D$1,1,1)","v":29877.502240812668},"General Manager","Manager","India","India","2 to 3","2 to 3 hours per day","21-30 yrs","15-29.9K",2.5,28,3,4,7,2]
["ID1278","2012-05-29T10:43:49",500000,500000,"INR",8903.9583437212841,24897.918534010558,{"$f":"OFFSET(F1445,0,Brains!$D$1,1,1)","v":24897.918534010558},"Asstt. Manager","Manager","India","India","2 to 3","2 to 3 hours per day","21-30 yrs","15-29.9K",2.5,29,3,4,7,2]
["ID1393","2012-05-29T22:02:31",150000,150000,"USD",150000,150000,{"$f":"OFFSET(F1446,0,Brains!$D$1,1,1)","v":150000},"VP, Business Management","Manager","USA","USA","2 to 3","2 to 3 hours per day","21-30 yrs","150-249.9K",2.5,30,3,4,7,7]
["ID1088","2012-05-28T15:48:23","50000 US $ per year",50000,"USD",50000,50000,{"$f":"OFFSET(F1447,0,Brains!$D$1,1,1)","v":50000},"Sr. Manager MIS","Manager","India","India","2 to 3","2 to 3 hours per day","21-30 yrs","50-74.9K",2.5,30,3,4,7,4]
["ID1413","2012-05-29T23:44:26",88000,88000,"USD",88000,88000,{"$f":"OFFSET(F1448,0,Brains!$D$1,1,1)","v":88000},"Manager, Financial Planning & Analysis","Manager","USA","USA","4 to 6","4 to 6 hours a day","21-30 yrs","75-99.9K",5,21,4,4,7,5]
["ID1187","2012-05-28T22:59:16",2000,24000,"USD",24000,24000,{"$f":"OFFSET(F1449,0,Brains!$D$1,1,1)","v":24000},"Administration Manager","Manager","Argentina","Argentina","4 to 6","4 to 6 hours a day","21-30 yrs","15-29.9K",5,21,4,4,7,2]
["ID1179","2012-05-28T22:49:15","4.5 laks",450000,"INR",8013.5625093491553,22408.126680609501,{"$f":"OFFSET(F1450,0,Brains!$D$1,1,1)","v":22408.126680609501},"Production Manager","Manager","India","India","4 to 6","4 to 6 hours a day","21-30 yrs","15-29.9K",5,21,4,4,7,2]
["ID1130","2012-05-28T17:53:43","Rs. 900000",900000,"INR",16027.125018698311,44816.253361219002,{"$f":"OFFSET(F1451,0,Brains!$D$1,1,1)","v":44816.253361219002},"officer","Manager","India","India","4 to 6","4 to 6 hours a day","21-30 yrs","30-49.9K",5,22,4,4,7,3]
["ID1662","2012-06-04T18:03:21",42000,42000,"GBP",66199.48742682593,62314.540059347179,{"$f":"OFFSET(F1452,0,Brains!$D$1,1,1)","v":62314.540059347179},"Management Accountant","Manager","UK","UK","4 to 6","4 to 6 hours a day","21-30 yrs","50-74.9K",5,23,4,4,7,4]
["ID0693","2012-05-26T13:24:14",7000,7000,"USD",7000,7000,{"$f":"OFFSET(F1453,0,Brains!$D$1,1,1)","v":7000},"Business Executive","Manager","India","India","4 to 6","4 to 6 hours a day","21-30 yrs","0-14.9K",5,23,4,4,7,1]
["ID1002","2012-05-28T10:21:58","NZD 180000",180000,"NZD",143565.85684888897,104347.82608695653,{"$f":"OFFSET(F1454,0,Brains!$D$1,1,1)","v":104347.82608695653},"Commercial Manager","Manager","New Zealand","New Zealand","4 to 6","4 to 6 hours a day","21-30 yrs","100-149.9K",5,25,4,4,7,6]
["ID1364","2012-05-29T19:12:19",125000,125000,"USD",125000,125000,{"$f":"OFFSET(F1455,0,Brains!$D$1,1,1)","v":125000},"Finance Manager","Manager","USA","USA","4 to 6","4 to 6 hours a day","21-30 yrs","100-149.9K",5,25,4,4,7,6]
["ID1213","2012-05-29T00:26:21","DKK 625000",625000,"DKK",106815.148267971,71954.869905595202,{"$f":"OFFSET(F1456,0,Brains!$D$1,1,1)","v":71954.869905595202},"Manager Business Controlling","Manager","Denmark","Denmark","4 to 6","4 to 6 hours a day","21-30 yrs","50-74.9K",5,25,4,4,7,4]
["ID1564","2012-05-31T23:48:36","USD90,000",90000,"USD",90000,90000,{"$f":"OFFSET(F1457,0,Brains!$D$1,1,1)","v":90000},"Operationsl Regional Manager","Manager","USA","USA","4 to 6","4 to 6 hours a day","21-30 yrs","75-99.9K",5,25,4,4,7,5]
["ID0964","2012-05-28T05:20:41",80000,80000,"AUD",81592.772512210868,50890.585241730281,{"$f":"OFFSET(F1458,0,Brains!$D$1,1,1)","v":50890.585241730281},"Billing manager","Manager","Australia","Australia","4 to 6","4 to 6 hours a day","21-30 yrs","50-74.9K",5,25,4,4,7,4]
["ID0574","2012-05-26T06:57:09","Â£28800",28800,"GBP",45393.934235537781,42729.970326409493,{"$f":"OFFSET(F1459,0,Brains!$D$1,1,1)","v":42729.970326409493},"Finance Manager","Manager","UK","UK","4 to 6","4 to 6 hours a day","21-30 yrs","30-49.9K",5,27,4,4,7,3]
["ID1369","2012-05-29T19:47:18",57500,57500,"USD",57500,57500,{"$f":"OFFSET(F1460,0,Brains!$D$1,1,1)","v":57500},"Planning Supervisor","Manager","USA","USA","4 to 6","4 to 6 hours a day","21-30 yrs","50-74.9K",5,30,4,4,7,4]
["ID1418","2012-05-30T00:34:53",107000,107000,"USD",107000,107000,{"$f":"OFFSET(F1461,0,Brains!$D$1,1,1)","v":107000},"Tax Manager","Manager","USA","USA","All 8","All the 8 hours baby, all the 8!","21-30 yrs","100-149.9K",8,29,5,4,7,6]
["ID0987","2012-05-28T08:35:32","A$107000",107000,"AUD",109130.33323508203,68066.157760814254,{"$f":"OFFSET(F1462,0,Brains!$D$1,1,1)","v":68066.157760814254},"Management Accountant","Manager","Australia","Australia","4 to 6","4 to 6 hours a day","31-40 yrs","50-74.9K",5,35,4,5,7,4]
["ID1389","2012-05-29T21:50:30",39000,39000,"USD",39000,39000,{"$f":"OFFSET(F1463,0,Brains!$D$1,1,1)","v":39000},"I.T Manager","Manager","South Africa","South Africa","All 8","All the 8 hours baby, all the 8!","6-10 yrs","30-49.9K",8,6,5,2,7,3]
["ID1722","2012-06-06T20:41:35",22000,22000,"USD",22000,22000,{"$f":"OFFSET(F1464,0,Brains!$D$1,1,1)","v":22000},"Manager (MIS)","Manager","India","India","All 8","All the 8 hours baby, all the 8!","6-10 yrs","15-29.9K",8,6,5,2,7,2]
["ID1457","2012-05-30T13:36:42",1000000,1000000,"INR",17807.916687442568,49795.837068021116,{"$f":"OFFSET(F1465,0,Brains!$D$1,1,1)","v":49795.837068021116},"project management","Manager","India","India","All 8","All the 8 hours baby, all the 8!","6-10 yrs","30-49.9K",8,6,5,2,7,3]
["ID0915","2012-05-27T17:16:55","486000 INR",486000,"INR",8654.6475100970874,24200.77681505826,{"$f":"OFFSET(F1466,0,Brains!$D$1,1,1)","v":24200.77681505826},"Assistant manager","Manager","India","India","All 8","All the 8 hours baby, all the 8!","6-10 yrs","15-29.9K",8,6,5,2,7,2]
["ID0751","2012-05-26T16:26:35","INR 30000",360000,"INR",6410.8500074793246,17926.501344487599,{"$f":"OFFSET(F1467,0,Brains!$D$1,1,1)","v":17926.501344487599},"Project Lead","Manager","India","India","All 8","All the 8 hours baby, all the 8!","6-10 yrs","15-29.9K",8,6,5,2,7,2]
["ID1281","2012-05-29T10:51:02","Rs.3.6 Lakhs pa",360000,"INR",6410.8500074793246,17926.501344487599,{"$f":"OFFSET(F1468,0,Brains!$D$1,1,1)","v":17926.501344487599},"Team Leader WFM","Manager","India","India","All 8","All the 8 hours baby, all the 8!","6-10 yrs","15-29.9K",8,6,5,2,7,2]
["ID0939","2012-05-27T23:43:21",290,3480,"USD",3480,3480,{"$f":"OFFSET(F1469,0,Brains!$D$1,1,1)","v":3480},"Reconciliation Manager in Textile Mill","Manager","Pakistan","Pakistan","All 8","All the 8 hours baby, all the 8!","6-10 yrs","0-14.9K",8,6,5,2,7,1]
["ID1835","2012-06-13T19:33:58","36000 British pounds",36000,"GBP",56742.417794422225,53412.462908011868,{"$f":"OFFSET(F1470,0,Brains!$D$1,1,1)","v":53412.462908011868},"Senior officer data reporting","Manager","UK","UK","All 8","All the 8 hours baby, all the 8!","6-10 yrs","50-74.9K",8,7,5,2,7,4]
["ID1322","2012-05-29T15:38:40","43000 EUR",43000,"EUR",54627.175876639136,54016.571781742903,{"$f":"OFFSET(F1471,0,Brains!$D$1,1,1)","v":54016.571781742903},"Project manager of IT infrastructure","Manager","France","France","All 8","All the 8 hours baby, all the 8!","6-10 yrs","50-74.9K",8,7,5,2,7,4]
["ID1329","2012-05-29T16:18:59","6.6 Lacs",660000,"INR",11753.225013712095,32865.252464893936,{"$f":"OFFSET(F1472,0,Brains!$D$1,1,1)","v":32865.252464893936},"AM business Intelligence","Manager","India","India","All 8","All the 8 hours baby, all the 8!","6-10 yrs","30-49.9K",8,7,5,2,7,3]
["ID0719","2012-05-26T14:41:00","Rs 15000",180000,"INR",3205.4250037396623,8963.2506722437993,{"$f":"OFFSET(F1473,0,Brains!$D$1,1,1)","v":8963.2506722437993},"Import & Export Documentation Executive","Manager","India","India","All 8","All the 8 hours baby, all the 8!","6-10 yrs","0-14.9K",8,7,5,2,7,1]
["ID0672","2012-05-26T12:54:15",8738,8738,"USD",8738,8738,{"$f":"OFFSET(F1474,0,Brains!$D$1,1,1)","v":8738},"Sales Coordinator","Manager","India","India","All 8","All the 8 hours baby, all the 8!","6-10 yrs",{"$f":"IF(H1474<15000,\"0-14.9K\",IF(H1474<30000,\"15-29.9K\",IF(H1474<50000,\"30-49.9K\",IF(H1474<75000,\"50-74.9K\",IF(H1474<100000,\"75-99.9K\",IF(H1474<150000,\"100-149.9K\",IF(H1474<250000,\"150-249.9K\",\"250K+\")))))))","v":"0-14.9K"},8,7.3,5,2,7,{"$f":"IF(H1474<15000,1,IF(H1474<30000,2,IF(H1474<50000,3,IF(H1474<75000,4,IF(H1474<100000,5,IF(H1474<150000,6,IF(H1474<250000,7,8)))))))","v":1}]
["ID1544","2012-05-31T16:30:09",48360,48360,"GBP",76223.981237173866,71750.741839762602,{"$f":"OFFSET(F1475,0,Brains!$D$1,1,1)","v":71750.741839762602},"pricing manager","Manager","UK","UK","All 8","All the 8 hours baby, all the 8!","6-10 yrs","50-74.9K",8,8,5,2,7,4]
["ID1549","2012-05-31T18:35:30",24864,24864,"USD",24864,24864,{"$f":"OFFSET(F1476,0,Brains!$D$1,1,1)","v":24864},"Brand manager","Manager","Libya","Libya","All 8","All the 8 hours baby, all the 8!","6-10 yrs","15-29.9K",8,8,5,2,7,2]
["ID0936","2012-05-27T23:03:21",1000000,1000000,"INR",17807.916687442568,49795.837068021116,{"$f":"OFFSET(F1477,0,Brains!$D$1,1,1)","v":49795.837068021116},"business","Manager","India","India","All 8","All the 8 hours baby, all the 8!","6-10 yrs","30-49.9K",8,8,5,2,7,3]
["ID1004","2012-05-28T10:27:45","Rs.10,00,000",1000000,"INR",17807.916687442568,49795.837068021116,{"$f":"OFFSET(F1478,0,Brains!$D$1,1,1)","v":49795.837068021116},"Credit Manager - Loans","Manager","India","India","All 8","All the 8 hours baby, all the 8!","6-10 yrs","30-49.9K",8,8,5,2,7,3]
["ID1815","2012-06-12T20:11:24",8900,1281600,"PKR",13603.016099449767,31347.993053347356,{"$f":"OFFSET(F1479,0,Brains!$D$1,1,1)","v":31347.993053347356},"Manager MIS & Analytics","Manager","pakistan","Pakistan","All 8","All the 8 hours baby, all the 8!","6-10 yrs","30-49.9K",8,8,5,2,7,3]
["ID1866","2012-06-15T20:00:26",11000,11000,"USD",11000,11000,{"$f":"OFFSET(F1480,0,Brains!$D$1,1,1)","v":11000},"AM","Manager","India","India","All 8","All the 8 hours baby, all the 8!","6-10 yrs","0-14.9K",8,8,5,2,7,1]
["ID0667","2012-05-26T12:46:26",5800,5800,"USD",5800,5800,{"$f":"OFFSET(F1481,0,Brains!$D$1,1,1)","v":5800},"Asst. Manager(Commercial)","Manager","India","India","All 8","All the 8 hours baby, all the 8!","6-10 yrs","0-14.9K",8,8,5,2,7,1]
["ID0653","2012-05-26T12:19:53",4000,4000,"USD",4000,4000,{"$f":"OFFSET(F1482,0,Brains!$D$1,1,1)","v":4000},"Coordinator","Manager","India","India","All 8","All the 8 hours baby, all the 8!","6-10 yrs","0-14.9K",8,8,5,2,7,1]
["ID1046","2012-05-28T13:42:35","2,00,000 INR",200000,"INR",3561.5833374885137,9959.167413604222,{"$f":"OFFSET(F1483,0,Brains!$D$1,1,1)","v":9959.167413604222},"Monitoring & evaluation officer","Manager","India","India","All 8","All the 8 hours baby, all the 8!","6-10 yrs","0-14.9K",8,8,5,2,7,1]
["ID1071","2012-05-28T14:53:44","1600000Rs",1600000,"INR",28492.66669990811,79673.339308833776,{"$f":"OFFSET(F1484,0,Brains!$D$1,1,1)","v":79673.339308833776},"Manager Fin","Manager","India","India","All 8","All the 8 hours baby, all the 8!","6-10 yrs","75-99.9K",8,9,5,2,7,5]
["ID1779","2012-06-10T14:58:39",1300000,1300000,"INR",23150.291693675339,64734.588188427442,{"$f":"OFFSET(F1485,0,Brains!$D$1,1,1)","v":64734.588188427442},"Manager","Manager","India","India","All 8","All the 8 hours baby, all the 8!","6-10 yrs","50-74.9K",8,9,5,2,7,4]
["ID0907","2012-05-27T15:44:52","Rs 600000/-",600000,"INR",10684.750012465542,29877.502240812668,{"$f":"OFFSET(F1486,0,Brains!$D$1,1,1)","v":29877.502240812668},"Manager","Manager","India","India","All 8","All the 8 hours baby, all the 8!","6-10 yrs","15-29.9K",8,9,5,2,7,2]
["ID1640","2012-06-03T10:10:43",6545,6545,"USD",6545,6545,{"$f":"OFFSET(F1487,0,Brains!$D$1,1,1)","v":6545},"Operations","Manager","India","India","All 8","All the 8 hours baby, all the 8!","6-10 yrs","0-14.9K",8,9,5,2,7,1]
["ID1283","2012-05-29T11:00:32",85000,85000,"USD",85000,85000,{"$f":"OFFSET(F1488,0,Brains!$D$1,1,1)","v":85000},"manager operation","Manager","srilanka","Sri Lanka","All 8","All the 8 hours baby, all the 8!","6-10 yrs","75-99.9K",8,10,5,2,7,5]
["ID1135","2012-05-28T18:30:51","Rs 2400000",2400000,"INR",42739.000049862167,119510.00896325067,{"$f":"OFFSET(F1489,0,Brains!$D$1,1,1)","v":119510.00896325067},"GM Finance","Manager","India","India","All 8","All the 8 hours baby, all the 8!","6-10 yrs","100-149.9K",8,10,5,2,7,6]
["ID0862","2012-05-27T04:05:28",35000,35000,"USD",35000,35000,{"$f":"OFFSET(F1490,0,Brains!$D$1,1,1)","v":35000},"Purchasing Manager","Manager","Uruguay","Uruguay","All 8","All the 8 hours baby, all the 8!","6-10 yrs","30-49.9K",8,10,5,2,7,3]
["ID1864","2012-06-15T17:36:10","INR 1000000",1000000,"INR",17807.916687442568,49795.837068021116,{"$f":"OFFSET(F1491,0,Brains!$D$1,1,1)","v":49795.837068021116},"Sr.Manager","Manager","India","India","All 8","All the 8 hours baby, all the 8!","6-10 yrs","30-49.9K",8,10,5,2,7,3]
["ID0718","2012-05-26T14:35:48","Inr 60000",720000,"INR",12821.700014958649,35853.002688975197,{"$f":"OFFSET(F1492,0,Brains!$D$1,1,1)","v":35853.002688975197},"Asstt manager","Manager","India","India","All 8","All the 8 hours baby, all the 8!","6-10 yrs","30-49.9K",8,10,5,2,7,3]
["ID1303","2012-05-29T13:53:59",80000,80000,"USD",80000,80000,{"$f":"OFFSET(F1493,0,Brains!$D$1,1,1)","v":80000},"Manager","Manager","USA","USA","1 or 2","1 or 2 hours a day","6-10 yrs","75-99.9K",1.5,6,2,2,7,5]
["ID1171","2012-05-28T22:41:01","R$ 54000",54000,"BRL",26691.183012544854,28723.404255319147,{"$f":"OFFSET(F1494,0,Brains!$D$1,1,1)","v":28723.404255319147},"Logistics Coordinator","Manager","Brazil","Brazil","1 or 2","1 or 2 hours a day","6-10 yrs","15-29.9K",1.5,7,2,2,7,2]
["ID1341","2012-05-29T17:17:46","Rs.6,00,000",600000,"INR",10684.750012465542,29877.502240812668,{"$f":"OFFSET(F1495,0,Brains!$D$1,1,1)","v":29877.502240812668},"Assistant Manager","Manager","India","India","1 or 2","1 or 2 hours a day","6-10 yrs","15-29.9K",1.5,7,2,2,7,2]
["ID1901","2012-06-19T07:59:00",120000,120000,"AUD",122389.15876831629,76335.877862595429,{"$f":"OFFSET(F1496,0,Brains!$D$1,1,1)","v":76335.877862595429},"Manager","Manager","Australia","Australia","1 or 2","1 or 2 hours a day","6-10 yrs","75-99.9K",1.5,8,2,2,7,5]
["ID1405","2012-05-29T23:06:00",40000,40000,"USD",40000,40000,{"$f":"OFFSET(F1497,0,Brains!$D$1,1,1)","v":40000},"Transportation Planner","Manager","USA","USA","1 or 2","1 or 2 hours a day","6-10 yrs","30-49.9K",1.5,8,2,2,7,3]
["ID1428","2012-05-30T01:48:18",75000,75000,"USD",75000,75000,{"$f":"OFFSET(F1498,0,Brains!$D$1,1,1)","v":75000},"HR Cordinator","Manager","USA","USA","1 or 2","1 or 2 hours a day","6-10 yrs","75-99.9K",1.5,9,2,2,7,5]
["ID0839","2012-05-26T23:58:53","900000 Rs",900000,"INR",16027.125018698311,44816.253361219002,{"$f":"OFFSET(F1499,0,Brains!$D$1,1,1)","v":44816.253361219002},"Deputy Manager","Manager","India","India","1 or 2","1 or 2 hours a day","6-10 yrs","30-49.9K",1.5,9,2,2,7,3]
["ID0585","2012-05-26T07:48:29",102000,102000,"AUD",104030.78495306884,64885.496183206109,{"$f":"OFFSET(F1500,0,Brains!$D$1,1,1)","v":64885.496183206109},"coordinator lismore regional airport","Manager","Australia","Australia","1 or 2","1 or 2 hours a day","6-10 yrs","50-74.9K",1.5,10,2,2,7,4]
["ID0627","2012-05-26T11:05:58",95000,95000,"USD",95000,95000,{"$f":"OFFSET(F1501,0,Brains!$D$1,1,1)","v":95000},"Program Manager","Manager","USA","USA","1 or 2","1 or 2 hours a day","6-10 yrs","75-99.9K",1.5,10,2,2,7,5]
["ID0604","2012-05-26T09:28:32",50000,50000,"USD",50000,50000,{"$f":"OFFSET(F1502,0,Brains!$D$1,1,1)","v":50000},"Product manager","Manager","India","India","1 or 2","1 or 2 hours a day","6-10 yrs","50-74.9K",1.5,10,2,2,7,4]
["ID1471","2012-05-30T16:48:32",1700,20400,"USD",20400,20400,{"$f":"OFFSET(F1503,0,Brains!$D$1,1,1)","v":20400},"M & E Officer","Manager","Myanmar [Burma]","Myanmar","1 or 2","1 or 2 hours a day","6-10 yrs","15-29.9K",1.5,10,2,2,7,2]
["ID1764","2012-06-08T22:48:39","CHF140000",140000,"CHF",148102.22862117883,85158.150851581508,{"$f":"OFFSET(F1504,0,Brains!$D$1,1,1)","v":85158.150851581508},"Projektleiter","Manager","Switzerland","Switzerland","2 to 3","2 to 3 hours per day","6-10 yrs","75-99.9K",2.5,6,3,2,7,5]
["ID1707","2012-06-06T03:14:56",73000,73000,"USD",73000,73000,{"$f":"OFFSET(F1505,0,Brains!$D$1,1,1)","v":73000},"process coordinator","Manager","USA","USA","2 to 3","2 to 3 hours per day","6-10 yrs","50-74.9K",2.5,6,3,2,7,4]
["ID0674","2012-05-26T12:55:09",4700,56400,"USD",56400,56400,{"$f":"OFFSET(F1506,0,Brains!$D$1,1,1)","v":56400},"Finance Manager","Manager","UAE","UAE","2 to 3","2 to 3 hours per day","6-10 yrs","50-74.9K",2.5,6,3,2,7,4]
["ID0722","2012-05-26T14:57:39",31250,31250,"USD",31250,31250,{"$f":"OFFSET(F1507,0,Brains!$D$1,1,1)","v":31250},"Program management","Manager","India","India","2 to 3","2 to 3 hours per day","6-10 yrs","30-49.9K",2.5,6,3,2,7,3]
["ID1834","2012-06-13T19:20:25",900000,900000,"INR",16027.125018698311,44816.253361219002,{"$f":"OFFSET(F1508,0,Brains!$D$1,1,1)","v":44816.253361219002},"Lead ","Manager","India","India","2 to 3","2 to 3 hours per day","6-10 yrs","30-49.9K",2.5,6,3,2,7,3]
["ID1003","2012-05-28T10:25:51","Rs.5,45,000",545000,"INR",9705.3145946561999,27138.731202071507,{"$f":"OFFSET(F1509,0,Brains!$D$1,1,1)","v":27138.731202071507},"Assistant Manager","Manager","India","India","2 to 3","2 to 3 hours per day","6-10 yrs","15-29.9K",2.5,6,3,2,7,2]
["ID0720","2012-05-26T14:46:55",375000,375000,"INR",6677.9687577909626,18673.438900507917,{"$f":"OFFSET(F1510,0,Brains!$D$1,1,1)","v":18673.438900507917},"Team Lead","Manager","India","India","2 to 3","2 to 3 hours per day","6-10 yrs","15-29.9K",2.5,6,3,2,7,2]
["ID0750","2012-05-26T16:25:53",6000,6000,"USD",6000,6000,{"$f":"OFFSET(F1511,0,Brains!$D$1,1,1)","v":6000},"Merchandiser","Manager","India","India","2 to 3","2 to 3 hours per day","6-10 yrs","0-14.9K",2.5,6,3,2,7,1]
["ID0688","2012-05-26T13:18:03","inr 11.5",1150000,"INR",20479.104190558952,57265.212628224283,{"$f":"OFFSET(F1512,0,Brains!$D$1,1,1)","v":57265.212628224283},"manager portfolio monitoring","Manager","India","India","2 to 3","2 to 3 hours per day","6-10 yrs","50-74.9K",2.5,7,3,2,7,4]
["ID1007","2012-05-28T10:38:53",700000,700000,"INR",12465.541681209797,34857.085947614782,{"$f":"OFFSET(F1513,0,Brains!$D$1,1,1)","v":34857.085947614782},"Asst Manager - Quality","Manager","India","India","2 to 3","2 to 3 hours per day","6-10 yrs","30-49.9K",2.5,7,3,2,7,3]
["ID0687","2012-05-26T13:17:36","Rs. 144000",144000,"INR",2564.3400029917298,7170.6005377950405,{"$f":"OFFSET(F1514,0,Brains!$D$1,1,1)","v":7170.6005377950405},"Team Leader","Manager","India","India","2 to 3","2 to 3 hours per day","6-10 yrs","0-14.9K",2.5,7,3,2,7,1]
["ID0983","2012-05-28T07:59:49",110000,110000,"AUD",112190.06220428993,69974.554707379139,{"$f":"OFFSET(F1515,0,Brains!$D$1,1,1)","v":69974.554707379139},"Sustainability Strategy Advisor","Manager","Australia","Australia","2 to 3","2 to 3 hours per day","6-10 yrs","50-74.9K",2.5,8,3,2,7,4]
["ID1865","2012-06-15T18:13:12",112000,112000,"USD",112000,112000,{"$f":"OFFSET(F1516,0,Brains!$D$1,1,1)","v":112000},"manager","Manager","USA","USA","2 to 3","2 to 3 hours per day","6-10 yrs","100-149.9K",2.5,8,3,2,7,6]
["ID0895","2012-05-27T14:22:11","INR 23 L",2300000,"INR",40958.208381117904,114530.42525644857,{"$f":"OFFSET(F1517,0,Brains!$D$1,1,1)","v":114530.42525644857},"Manager - Business Planning & Reporting","Manager","India","India","2 to 3","2 to 3 hours per day","6-10 yrs","100-149.9K",2.5,8,3,2,7,6]
["ID0736","2012-05-26T15:30:23","6 Lac Rs",600000,"INR",10684.750012465542,29877.502240812668,{"$f":"OFFSET(F1518,0,Brains!$D$1,1,1)","v":29877.502240812668},"ERP Co-Ordinator","Manager","India","India","2 to 3","2 to 3 hours per day","6-10 yrs","15-29.9K",2.5,8,3,2,7,2]
["ID1533","2012-05-31T10:33:07","10000 US$",10000,"USD",10000,10000,{"$f":"OFFSET(F1519,0,Brains!$D$1,1,1)","v":10000},"Project management","Manager","Vietnam","Vietnam","2 to 3","2 to 3 hours per day","6-10 yrs","0-14.9K",2.5,8,3,2,7,1]
["ID0666","2012-05-26T12:36:53","Rs 480000",480000,"INR",8547.8000099724322,23902.001792650135,{"$f":"OFFSET(F1520,0,Brains!$D$1,1,1)","v":23902.001792650135},"PMO","Manager","India","India","2 to 3","2 to 3 hours per day","6-10 yrs","15-29.9K",2.5,8,3,2,7,2]
["ID1588","2012-06-01T10:57:59","30000 Rs",360000,"INR",6410.8500074793246,17926.501344487599,{"$f":"OFFSET(F1521,0,Brains!$D$1,1,1)","v":17926.501344487599},"team leader ","Manager","India","India","2 to 3","2 to 3 hours per day","6-10 yrs","15-29.9K",2.5,8,3,2,7,2]
["ID1752","2012-06-08T13:38:45","9,50,000",950000,"INR",16917.52085307044,47306.045214620055,{"$f":"OFFSET(F1522,0,Brains!$D$1,1,1)","v":47306.045214620055},"Associate Manager, Drug Safety Operations","Manager","India","India","2 to 3","2 to 3 hours per day","6-10 yrs","30-49.9K",2.5,9,3,2,7,3]
["ID1881","2012-06-16T18:33:25","Rs. 700000",700000,"INR",12465.541681209797,34857.085947614782,{"$f":"OFFSET(F1523,0,Brains!$D$1,1,1)","v":34857.085947614782},"Revenue Focus Manager","Manager","India","India","2 to 3","2 to 3 hours per day","6-10 yrs","30-49.9K",2.5,9,3,2,7,3]
["ID0655","2012-05-26T12:23:14",10500000,10500000,"INR",186983.12521814698,522856.2892142217,{"$f":"OFFSET(F1524,0,Brains!$D$1,1,1)","v":522856.2892142217},"MANAGER","Manager","India","India","2 to 3","2 to 3 hours per day","6-10 yrs","250K+",2.5,10,3,2,7,8]
["ID1417","2012-05-30T00:25:43",120000,120000,"USD",120000,120000,{"$f":"OFFSET(F1525,0,Brains!$D$1,1,1)","v":120000},"Finance Manager","Manager","USA","USA","2 to 3","2 to 3 hours per day","6-10 yrs","100-149.9K",2.5,10,3,2,7,6]
["ID1115","2012-05-28T17:02:43",75000,75000,"GBP",118213.37040504631,111275.96439169139,{"$f":"OFFSET(F1526,0,Brains!$D$1,1,1)","v":111275.96439169139},"Management Consultant","Manager","UK","UK","2 to 3","2 to 3 hours per day","6-10 yrs","100-149.9K",2.5,10,3,2,7,6]
["ID1434","2012-05-30T02:22:59",111000,111000,"USD",111000,111000,{"$f":"OFFSET(F1527,0,Brains!$D$1,1,1)","v":111000},"Project Manager - Finance","Manager","USA","USA","2 to 3","2 to 3 hours per day","6-10 yrs","100-149.9K",2.5,10,3,2,7,6]
["ID0852","2012-05-27T02:33:22",100000,100000,"CAD",98336.152303032693,80064.051240992791,{"$f":"OFFSET(F1528,0,Brains!$D$1,1,1)","v":80064.051240992791},"Marketing Manager","Manager","Canada","Canada","2 to 3","2 to 3 hours per day","6-10 yrs","75-99.9K",2.5,10,3,2,7,5]
["ID1519","2012-05-31T03:07:09",89000,89000,"USD",89000,89000,{"$f":"OFFSET(F1529,0,Brains!$D$1,1,1)","v":89000},"Finance Manager","Manager","USA","USA","2 to 3","2 to 3 hours per day","6-10 yrs","75-99.9K",2.5,10,3,2,7,5]
["ID1098","2012-05-28T16:07:51",48000,48000,"GBP",75656.557059229643,71216.617210682496,{"$f":"OFFSET(F1530,0,Brains!$D$1,1,1)","v":71216.617210682496},"Business Operations Co-ordinator","Manager","UK","UK","2 to 3","2 to 3 hours per day","6-10 yrs","50-74.9K",2.5,10,3,2,7,4]
["ID1191","2012-05-28T23:13:24",60000,60000,"USD",60000,60000,{"$f":"OFFSET(F1531,0,Brains!$D$1,1,1)","v":60000},"Quality Management","Manager","USA","USA","2 to 3","2 to 3 hours per day","6-10 yrs","50-74.9K",2.5,10,3,2,7,4]
["ID1897","2012-06-19T01:49:49","60k usd",60000,"USD",60000,60000,{"$f":"OFFSET(F1532,0,Brains!$D$1,1,1)","v":60000},"buyer","Manager","Canada","Canada","2 to 3","2 to 3 hours per day","6-10 yrs","50-74.9K",2.5,10,3,2,7,4]
["ID1053","2012-05-28T14:12:50",43500,43500,"EUR",55262.375596134938,54644.67145362364,{"$f":"OFFSET(F1533,0,Brains!$D$1,1,1)","v":54644.67145362364},"RRHH","Manager","SPAIN","Spain","2 to 3","2 to 3 hours per day","6-10 yrs","50-74.9K",2.5,10,3,2,7,4]
["ID0801","2012-05-26T21:10:20",48500,48500,"USD",48500,48500,{"$f":"OFFSET(F1534,0,Brains!$D$1,1,1)","v":48500},"Loss Prevention Finance Coordinator","Manager","USA","USA","2 to 3","2 to 3 hours per day","6-10 yrs","30-49.9K",2.5,10,3,2,7,3]
["ID0617","2012-05-26T10:43:53",1800000,1800000,"INR",32054.250037396621,89632.506722438004,{"$f":"OFFSET(F1535,0,Brains!$D$1,1,1)","v":89632.506722438004},"AGM Finance","Manager","India","India","2 to 3","2 to 3 hours per day","6-10 yrs","75-99.9K",2.5,10,3,2,7,5]
["ID1284","2012-05-29T11:35:53","Indian Rs 10 Lakhs",1000000,"INR",17807.916687442568,49795.837068021116,{"$f":"OFFSET(F1536,0,Brains!$D$1,1,1)","v":49795.837068021116},"Manager","Manager","India","India","2 to 3","2 to 3 hours per day","6-10 yrs","30-49.9K",2.5,10,3,2,7,3]
["ID1833","2012-06-13T18:25:00","INR 10 lacs p.a.",1000000,"INR",17807.916687442568,49795.837068021116,{"$f":"OFFSET(F1537,0,Brains!$D$1,1,1)","v":49795.837068021116},"Mnanager- Customer Project finance & recovery","Manager","India","India","2 to 3","2 to 3 hours per day","6-10 yrs","30-49.9K",2.5,10,3,2,7,3]
["ID0871","2012-05-27T08:07:40","125 $",125000,"USD",125000,125000,{"$f":"OFFSET(F1538,0,Brains!$D$1,1,1)","v":125000},"Project controls manager","Manager","Norway","Norway","4 to 6","4 to 6 hours a day","6-10 yrs",{"$f":"IF(H1538<15000,\"0-14.9K\",IF(H1538<30000,\"15-29.9K\",IF(H1538<50000,\"30-49.9K\",IF(H1538<75000,\"50-74.9K\",IF(H1538<100000,\"75-99.9K\",IF(H1538<150000,\"100-149.9K\",IF(H1538<250000,\"150-249.9K\",\"250K+\")))))))","v":"100-149.9K"},5,6,4,2,7,{"$f":"IF(H1538<15000,1,IF(H1538<30000,2,IF(H1538<50000,3,IF(H1538<75000,4,IF(H1538<100000,5,IF(H1538<150000,6,IF(H1538<250000,7,8)))))))","v":6}]
["ID0573","2012-05-26T06:54:40",90000,90000,"USD",90000,90000,{"$f":"OFFSET(F1539,0,Brains!$D$1,1,1)","v":90000},"Sales Operations Supervisor","Manager","USA","USA","4 to 6","4 to 6 hours a day","6-10 yrs","75-99.9K",5,6,4,2,7,5]
["ID1684","2012-06-05T10:43:34",110000,110000,"NZD",87734.690296543267,63768.115942028991,{"$f":"OFFSET(F1540,0,Brains!$D$1,1,1)","v":63768.115942028991},"Enterprise Portfolio Manager","Manager","New Zealand","New Zealand","4 to 6","4 to 6 hours a day","6-10 yrs","50-74.9K",5,6,4,2,7,4]
["ID1889","2012-06-17T16:01:50",60000,60000,"EUR",76223.966339496474,75371.960625687774,{"$f":"OFFSET(F1541,0,Brains!$D$1,1,1)","v":75371.960625687774},"pm","Manager","Germany","Germany","4 to 6","4 to 6 hours a day","6-10 yrs","75-99.9K",5,6,4,2,7,5]
["ID1758","2012-06-08T18:48:12",28995,28995,"USD",28995,28995,{"$f":"OFFSET(F1542,0,Brains!$D$1,1,1)","v":28995},"Senior Executive","Manager","India","India","4 to 6","4 to 6 hours a day","6-10 yrs","15-29.9K",5,6,4,2,7,2]
["ID0905","2012-05-27T15:32:10",10000,10000,"USD",10000,10000,{"$f":"OFFSET(F1543,0,Brains!$D$1,1,1)","v":10000},"Planner","Manager","India","India","4 to 6","4 to 6 hours a day","6-10 yrs","0-14.9K",5,6,4,2,7,1]
["ID0807","2012-05-26T21:40:49","Rs. 450000",450000,"INR",8013.5625093491553,22408.126680609501,{"$f":"OFFSET(F1544,0,Brains!$D$1,1,1)","v":22408.126680609501},"Sr. Executive","Manager","India","India","4 to 6","4 to 6 hours a day","6-10 yrs","15-29.9K",5,6,4,2,7,2]
["ID1463","2012-05-30T14:09:10","4 Lakhs INR p.a",400000,"INR",7123.1666749770275,19918.334827208444,{"$f":"OFFSET(F1545,0,Brains!$D$1,1,1)","v":19918.334827208444},"Reporting Manager","Manager","India","India","4 to 6","4 to 6 hours a day","6-10 yrs","15-29.9K",5,6,4,2,7,2]
["ID1160","2012-05-28T21:55:25",500,6000,"USD",6000,6000,{"$f":"OFFSET(F1546,0,Brains!$D$1,1,1)","v":6000},"AM Ops","Manager","India","India","4 to 6","4 to 6 hours a day","6-10 yrs","0-14.9K",5,6,4,2,7,1]
["ID0726","2012-05-26T15:01:41","Rs. 250000",250000,"INR",4451.9791718606421,12448.959267005279,{"$f":"OFFSET(F1547,0,Brains!$D$1,1,1)","v":12448.959267005279},"Asst. Manager","Manager","India","India","4 to 6","4 to 6 hours a day","6-10 yrs","0-14.9K",5,6,4,2,7,1]
["ID1748","2012-06-08T04:51:45",80000,80000,"USD",80000,80000,{"$f":"OFFSET(F1548,0,Brains!$D$1,1,1)","v":80000},"Sales / Finance Manager","Manager","USA","USA","4 to 6","4 to 6 hours a day","6-10 yrs","75-99.9K",5,7,4,2,7,5]
["ID0984","2012-05-28T08:03:10","AUD$70,000",70000,"AUD",71393.675948184507,44529.262086513998,{"$f":"OFFSET(F1549,0,Brains!$D$1,1,1)","v":44529.262086513998},"Business Development","Manager","Australia","Australia","4 to 6","4 to 6 hours a day","6-10 yrs","30-49.9K",5,7,4,2,7,3]
["ID1784","2012-06-10T21:52:30","Â£31185",31185,"GBP",49153.119414418252,46268.54599406528,{"$f":"OFFSET(F1550,0,Brains!$D$1,1,1)","v":46268.54599406528},"Data Team Leader","Manager","UK","UK","4 to 6","4 to 6 hours a day","6-10 yrs","30-49.9K",5,7,4,2,7,3]
["ID1836","2012-06-13T19:40:16",1200000,1200000,"INR",21369.500024931083,59755.004481625336,{"$f":"OFFSET(F1551,0,Brains!$D$1,1,1)","v":59755.004481625336},"AM","Manager","India","India","4 to 6","4 to 6 hours a day","6-10 yrs","50-74.9K",5,7,4,2,7,4]
["ID0700","2012-05-26T13:42:58",800000,800000,"INR",14246.333349954055,39836.669654416888,{"$f":"OFFSET(F1552,0,Brains!$D$1,1,1)","v":39836.669654416888},"Manager","Manager","India","India","4 to 6","4 to 6 hours a day","6-10 yrs","30-49.9K",5,7,4,2,7,3]
["ID0782","2012-05-26T19:07:55",636000,636000,"INR",11325.835013213473,31670.152375261427,{"$f":"OFFSET(F1553,0,Brains!$D$1,1,1)","v":31670.152375261427},"Program Manager","Manager","India","India","4 to 6","4 to 6 hours a day","6-10 yrs","30-49.9K",5,7,4,2,7,3]
["ID1094","2012-05-28T16:03:18",7960,7960,"USD",7960,7960,{"$f":"OFFSET(F1554,0,Brains!$D$1,1,1)","v":7960},"Team Leader","Manager","India","India","4 to 6","4 to 6 hours a day","6-10 yrs","0-14.9K",5,7,4,2,7,1]
["ID0788","2012-05-26T19:43:36","INR 400000",400000,"INR",7123.1666749770275,19918.334827208444,{"$f":"OFFSET(F1555,0,Brains!$D$1,1,1)","v":19918.334827208444},"Asst.Manager","Manager","India","India","4 to 6","4 to 6 hours a day","6-10 yrs","15-29.9K",5,7,4,2,7,2]
["ID0637","2012-05-26T11:37:26",80000,80000,"USD",80000,80000,{"$f":"OFFSET(F1556,0,Brains!$D$1,1,1)","v":80000},"program coordinator - automotive","Manager","USA","USA","4 to 6","4 to 6 hours a day","6-10 yrs","75-99.9K",5,8,4,2,7,5]
["ID1275","2012-05-29T10:08:21",70000,70000,"USD",70000,70000,{"$f":"OFFSET(F1557,0,Brains!$D$1,1,1)","v":70000},"Project Manager","Manager","USA","USA","4 to 6","4 to 6 hours a day","6-10 yrs","50-74.9K",5,8,4,2,7,4]
["ID0921","2012-05-27T19:41:55",20500,20500,"EUR",26043.18849932796,25752.08654710999,{"$f":"OFFSET(F1558,0,Brains!$D$1,1,1)","v":25752.08654710999},"C&B Manager","Manager","Poland","Poland","4 to 6","4 to 6 hours a day","6-10 yrs","15-29.9K",5,8,4,2,7,2]
["ID1224","2012-05-29T01:22:59","INR 1000000",1000000,"INR",17807.916687442568,49795.837068021116,{"$f":"OFFSET(F1559,0,Brains!$D$1,1,1)","v":49795.837068021116},"Asst Manager","Manager","India","India","4 to 6","4 to 6 hours a day","6-10 yrs","30-49.9K",5,8.5,4,2,7,3]
["ID1196","2012-05-28T23:21:02","KES 4.3 million",4300000,"KENYA",51497.005988023957,92227.179135209342,{"$f":"OFFSET(F1560,0,Brains!$D$1,1,1)","v":92227.179135209342},"Finance Manager","Manager","Kenya","Kenya","4 to 6","4 to 6 hours a day","6-10 yrs","75-99.9K",5,9,4,2,7,5]
["ID1318","2012-05-29T15:24:45",1200000,1200000,"INR",21369.500024931083,59755.004481625336,{"$f":"OFFSET(F1561,0,Brains!$D$1,1,1)","v":59755.004481625336},"Manager - Corporate strategy and Planning","Manager","India","India","4 to 6","4 to 6 hours a day","6-10 yrs","50-74.9K",5,9,4,2,7,4]
["ID0680","2012-05-26T13:03:32",720000,720000,"PHP",17067.637625607145,28245.263034012001,{"$f":"OFFSET(F1562,0,Brains!$D$1,1,1)","v":28245.263034012001},"System Manager","Manager","Philippines","Philippines","4 to 6","4 to 6 hours a day","6-10 yrs","15-29.9K",5,9,4,2,7,2]
["ID1398","2012-05-29T22:24:28",136000,136000,"USD",136000,136000,{"$f":"OFFSET(F1563,0,Brains!$D$1,1,1)","v":136000},"Manager FP and A","Manager","USA","USA","4 to 6","4 to 6 hours a day","6-10 yrs","100-149.9K",5,10,4,2,7,6]
["ID1267","2012-05-29T09:15:09",82000,82000,"USD",82000,82000,{"$f":"OFFSET(F1564,0,Brains!$D$1,1,1)","v":82000},"Manager - Marketing Analytics","Manager","USA","USA","4 to 6","4 to 6 hours a day","6-10 yrs","75-99.9K",5,10,4,2,7,5]
["ID1371","2012-05-29T19:52:35","$80,000 USD",80000,"USD",80000,80000,{"$f":"OFFSET(F1565,0,Brains!$D$1,1,1)","v":80000},"Manager of Data Analytics","Manager","USA","USA","4 to 6","4 to 6 hours a day","6-10 yrs","75-99.9K",5,10,4,2,7,5]
["ID1869","2012-06-15T22:36:45",72000,72000,"USD",72000,72000,{"$f":"OFFSET(F1566,0,Brains!$D$1,1,1)","v":72000},"HR Supervisor","Manager","USA","USA","4 to 6","4 to 6 hours a day","6-10 yrs","50-74.9K",5,10,4,2,7,4]
["ID1306","2012-05-29T13:59:14",68000,68000,"AUD",69353.856635379227,43256.997455470737,{"$f":"OFFSET(F1567,0,Brains!$D$1,1,1)","v":43256.997455470737},"Project Support Officer","Manager","Australia","Australia","4 to 6","4 to 6 hours a day","6-10 yrs","30-49.9K",5,10,4,2,7,3]
["ID0734","2012-05-26T15:24:32",5000,60000,"USD",60000,60000,{"$f":"OFFSET(F1568,0,Brains!$D$1,1,1)","v":60000},"Manager","Manager","Russia","Russia","4 to 6","4 to 6 hours a day","6-10 yrs","50-74.9K",5,10,4,2,7,4]
["ID1148","2012-05-28T19:32:15","Â£23000",23000,"GBP",36252.100257547536,34124.629080118691,{"$f":"OFFSET(F1569,0,Brains!$D$1,1,1)","v":34124.629080118691},"Data Management Officer","Manager","UK","UK","4 to 6","4 to 6 hours a day","6-10 yrs","30-49.9K",5,10,4,2,7,3]
["ID1598","2012-06-01T19:46:33","21000EUR",21000,"EUR",26678.388218823762,26380.186218990722,{"$f":"OFFSET(F1570,0,Brains!$D$1,1,1)","v":26380.186218990722},"Coordenador PeÃ§as Grupo","Manager","Portugal","Portugal","4 to 6","4 to 6 hours a day","6-10 yrs","15-29.9K",5,10,4,2,7,2]
["ID1908","2012-06-19T20:35:35",25000,25000,"USD",25000,25000,{"$f":"OFFSET(F1571,0,Brains!$D$1,1,1)","v":25000},"Team Lead","Manager","India","India","4 to 6","4 to 6 hours a day","6-10 yrs","15-29.9K",5,10,4,2,7,2]
["ID1861","2012-06-15T16:36:47",1400000,1400000,"INR",24931.083362419595,69714.171895229563,{"$f":"OFFSET(F1572,0,Brains!$D$1,1,1)","v":69714.171895229563},"Manager - Controlling","Manager","India","India","4 to 6","4 to 6 hours a day","6-10 yrs","50-74.9K",5,10,4,2,7,4]
["ID0943","2012-05-27T23:52:48","usd 2000 per month",24000,"USD",24000,24000,{"$f":"OFFSET(F1573,0,Brains!$D$1,1,1)","v":24000},"sr manager","Manager","India","India","4 to 6","4 to 6 hours a day","6-10 yrs","15-29.9K",5,10,4,2,7,2]
["ID1291","2012-05-29T12:28:41",15000,15000,"USD",15000,15000,{"$f":"OFFSET(F1574,0,Brains!$D$1,1,1)","v":15000},"Monitoring & Evaluation officer","Manager","Myanmar","Myanmar","4 to 6","4 to 6 hours a day","6-10 yrs","15-29.9K",5,10,4,2,7,2]
["ID0611","2012-05-26T10:01:28",380000,380000,"INR",6767.0083412281756,18922.418085848021,{"$f":"OFFSET(F1575,0,Brains!$D$1,1,1)","v":18922.418085848021},"Incharge","Manager","India","India","4 to 6","4 to 6 hours a day","6-10 yrs","15-29.9K",5,10,4,2,7,2]
["ID1778","2012-06-10T12:31:48",125000,125000,"USD",125000,125000,{"$f":"OFFSET(F1576,0,Brains!$D$1,1,1)","v":125000},"project manager","Manager","USA","USA","All 8","All the 8 hours baby, all the 8!","6-10 yrs","100-149.9K",8,10,5,2,7,6]
["ID1669","2012-06-04T23:18:41",85000,85000,"USD",85000,85000,{"$f":"OFFSET(F1577,0,Brains!$D$1,1,1)","v":85000},"Sr Manager","Manager","USA","USA","All 8","All the 8 hours baby, all the 8!","6-10 yrs","75-99.9K",8,10,5,2,7,5]
["ID1766","2012-06-08T23:46:11",67000,67000,"USD",67000,67000,{"$f":"OFFSET(F1578,0,Brains!$D$1,1,1)","v":67000},"Manager","Manager","USA","USA","Excel??","Excel ?!? What Excel?","6-10 yrs","50-74.9K",0,6,1,2,7,4]
["ID1455","2012-05-30T13:25:12",20000,20000,"USD",20000,20000,{"$f":"OFFSET(F1579,0,Brains!$D$1,1,1)","v":20000},"manager","Manager","India","India","Excel??","Excel ?!? What Excel?","6-10 yrs","15-29.9K",0,10,1,2,7,2]
["ID0503","2012-05-26T04:01:59",58000,58000,"GBP",91418.339779902482,86053.412462908003,{"$f":"OFFSET(F1580,0,Brains!$D$1,1,1)","v":86053.412462908003},"Business Modeller","Manager","UK","UK","All 8","All the 8 hours baby, all the 8!",null,"75-99.9K",8,null,5,null,7,5]
["ID0063","2012-05-25T07:15:12",61000,61000,"USD",61000,61000,{"$f":"OFFSET(F1581,0,Brains!$D$1,1,1)","v":61000},"Coordinator Of Costa and Buget","Manager","Brasil","Brazil","All 8","All the 8 hours baby, all the 8!",null,"50-74.9K",8,null,5,null,7,4]
["ID0031","2012-05-25T04:55:48",41000,41000,"USD",41000,41000,{"$f":"OFFSET(F1582,0,Brains!$D$1,1,1)","v":41000},"Chief of the department of public budget analisis and forecasting","Manager","Russia","Russia","All 8","All the 8 hours baby, all the 8!",null,"30-49.9K",8,null,5,null,7,3]
["ID0074","2012-05-25T23:01:20",2785,33420,"USD",33420,33420,{"$f":"OFFSET(F1583,0,Brains!$D$1,1,1)","v":33420},"Process Flow Coordinator","Manager","United Arab Emirates","UAE","All 8","All the 8 hours baby, all the 8!",null,"30-49.9K",8,null,5,null,7,3]
["ID0053","2012-05-25T06:09:44","2000 Euros",24000,"EUR",30489.586535798586,30148.784250275108,{"$f":"OFFSET(F1584,0,Brains!$D$1,1,1)","v":30148.784250275108},"PPC Manager","Manager","Germany","Germany","All 8","All the 8 hours baby, all the 8!",null,"30-49.9K",8,null,5,null,7,3]
["ID0179","2012-05-26T00:49:48",18500,18500,"GBP",29159.298033244755,27448.071216617209,{"$f":"OFFSET(F1585,0,Brains!$D$1,1,1)","v":27448.071216617209},"Trainee Management Accountant","Manager","UK","UK","All 8","All the 8 hours baby, all the 8!",null,"15-29.9K",8,null,5,null,7,2]
["ID0119","2012-05-26T00:41:38",2000,24000,"USD",24000,24000,{"$f":"OFFSET(F1586,0,Brains!$D$1,1,1)","v":24000},"Researcher","Manager","Colombia","Colombia","All 8","All the 8 hours baby, all the 8!",null,"15-29.9K",8,null,5,null,7,2]
["ID0411","2012-05-26T02:13:57",19200,19200,"USD",19200,19200,{"$f":"OFFSET(F1587,0,Brains!$D$1,1,1)","v":19200},"Department Manager","Manager","Romania","Romania","All 8","All the 8 hours baby, all the 8!",null,"15-29.9K",8,null,5,null,7,2]
["ID0188","2012-05-26T00:50:43",13636.36,13636,"USD",13636,13636,{"$f":"OFFSET(F1588,0,Brains!$D$1,1,1)","v":13636},"Process Manager","Manager","India","India","All 8","All the 8 hours baby, all the 8!",null,"0-14.9K",8,null,5,null,7,1]
["ID0342","2012-05-26T01:37:33",13000,13000,"USD",13000,13000,{"$f":"OFFSET(F1589,0,Brains!$D$1,1,1)","v":13000},"operation-manager","Manager","India","India","All 8","All the 8 hours baby, all the 8!",null,"0-14.9K",8,null,5,null,7,1]
["ID0544","2012-05-26T05:29:55",450000,450000,"INR",8013.5625093491553,22408.126680609501,{"$f":"OFFSET(F1590,0,Brains!$D$1,1,1)","v":22408.126680609501},"deputy manager","Manager","India","India","All 8","All the 8 hours baby, all the 8!",null,"15-29.9K",8,null,5,null,7,2]
["ID0427","2012-05-26T02:25:10","20000 RS",240000,"INR",4273.9000049862161,11951.000896325068,{"$f":"OFFSET(F1591,0,Brains!$D$1,1,1)","v":11951.000896325068},"WFM Team Lead","Manager","India","India","All 8","All the 8 hours baby, all the 8!",null,"0-14.9K",8,null,5,null,7,1]
["ID0197","2012-05-26T00:52:30",233000,233000,"INR",4149.2445881741187,11602.430036848918,{"$f":"OFFSET(F1592,0,Brains!$D$1,1,1)","v":11602.430036848918},"Asst. Manager (MIS)","Manager","India","India","All 8","All the 8 hours baby, all the 8!",null,"0-14.9K",8,null,5,null,7,1]
["ID0211","2012-05-26T00:54:28",400000,400000,"USD",400000,400000,{"$f":"OFFSET(F1593,0,Brains!$D$1,1,1)","v":400000},"program manager","Manager","USA","USA","1 or 2","1 or 2 hours a day",null,"250K+",1.5,null,2,null,7,8]
["ID0007","2012-05-25T03:33:51",145000,145000,"EUR",184207.91865378313,182148.90484541212,{"$f":"OFFSET(F1594,0,Brains!$D$1,1,1)","v":182148.90484541212},"senior project manager","Manager","Germany","Germany","1 or 2","1 or 2 hours a day",null,"150-249.9K",1.5,null,2,null,7,7]
["ID0419","2012-05-26T02:18:03","Â£66000",66000,"GBP",104027.76595644075,97922.848664688427,{"$f":"OFFSET(F1595,0,Brains!$D$1,1,1)","v":97922.848664688427},"IT Project Manager, EMEA","Manager","UK","UK","1 or 2","1 or 2 hours a day",null,"75-99.9K",1.5,null,2,null,7,5]
["ID0097","2012-05-26T00:40:31","91,000 USD",91000,"USD",91000,91000,{"$f":"OFFSET(F1596,0,Brains!$D$1,1,1)","v":91000},"Channel Marketing Manager","Manager","USA","USA","1 or 2","1 or 2 hours a day",null,"75-99.9K",1.5,null,2,null,7,5]
["ID0458","2012-05-26T03:03:09",80000,80000,"USD",80000,80000,{"$f":"OFFSET(F1597,0,Brains!$D$1,1,1)","v":80000},"operations tech","Manager","USA","USA","1 or 2","1 or 2 hours a day",null,"75-99.9K",1.5,null,2,null,7,5]
["ID0466","2012-05-26T03:09:49","CDN $70,000",70000,"CAD",68835.306612122877,56044.83586869495,{"$f":"OFFSET(F1598,0,Brains!$D$1,1,1)","v":56044.83586869495},"Program Manager","Manager","Canada","Canada","1 or 2","1 or 2 hours a day",null,"50-74.9K",1.5,null,2,null,7,4]
["ID0162","2012-05-26T00:46:25",58,58000,"USD",58000,58000,{"$f":"OFFSET(F1599,0,Brains!$D$1,1,1)","v":58000},"Team Lead - Computer Discounts","Manager","Canada","Canada","1 or 2","1 or 2 hours a day",null,"50-74.9K",1.5,null,2,null,7,4]
["ID0020","2012-05-25T04:19:22",50000,50000,"USD",50000,50000,{"$f":"OFFSET(F1600,0,Brains!$D$1,1,1)","v":50000},"GM","Manager","India","India","1 or 2","1 or 2 hours a day",null,"50-74.9K",1.5,null,2,null,7,4]
["ID0127","2012-05-26T00:42:10","US $44,000",44000,"USD",44000,44000,{"$f":"OFFSET(F1601,0,Brains!$D$1,1,1)","v":44000},"School Tech Coordinator","Manager","USA","USA","1 or 2","1 or 2 hours a day",null,"30-49.9K",1.5,null,2,null,7,3]
["ID0205","2012-05-26T00:53:46","INR18Lacs or US$36000",1800000,"INR",32054.250037396621,89632.506722438004,{"$f":"OFFSET(F1602,0,Brains!$D$1,1,1)","v":89632.506722438004},"Chief Manager","Manager","India","India","1 or 2","1 or 2 hours a day",null,{"$f":"IF(H1602<15000,\"0-14.9K\",IF(H1602<30000,\"15-29.9K\",IF(H1602<50000,\"30-49.9K\",IF(H1602<75000,\"50-74.9K\",IF(H1602<100000,\"75-99.9K\",IF(H1602<150000,\"100-149.9K\",IF(H1602<250000,\"150-249.9K\",\"250K+\")))))))","v":"75-99.9K"},1.5,null,2,null,7,{"$f":"IF(H1602<15000,1,IF(H1602<30000,2,IF(H1602<50000,3,IF(H1602<75000,4,IF(H1602<100000,5,IF(H1602<150000,6,IF(H1602<250000,7,8)))))))","v":5}]
["ID0057","2012-05-25T06:27:29","Â£18000",18000,"GBP",28371.208897211112,26706.231454005934,{"$f":"OFFSET(F1603,0,Brains!$D$1,1,1)","v":26706.231454005934},"Building Design and Performance Researcher","Manager","UK","UK","1 or 2","1 or 2 hours a day",null,"15-29.9K",1.5,null,2,null,7,2]
["ID0252","2012-05-26T01:05:14",25000,25000,"USD",25000,25000,{"$f":"OFFSET(F1604,0,Brains!$D$1,1,1)","v":25000},"Team Lead","Manager","India","India","1 or 2","1 or 2 hours a day",null,"15-29.9K",1.5,null,2,null,7,2]
["ID0313","2012-05-26T01:25:06",1400000,1400000,"INR",24931.083362419595,69714.171895229563,{"$f":"OFFSET(F1605,0,Brains!$D$1,1,1)","v":69714.171895229563},"Marketing","Manager","India","India","1 or 2","1 or 2 hours a day",null,"50-74.9K",1.5,null,2,null,7,4]
["ID0454","2012-05-26T02:57:47",900000,900000,"INR",16027.125018698311,44816.253361219002,{"$f":"OFFSET(F1606,0,Brains!$D$1,1,1)","v":44816.253361219002},"Regional Manager","Manager","India","India","1 or 2","1 or 2 hours a day",null,"30-49.9K",1.5,null,2,null,7,3]
["ID0386","2012-05-26T02:00:04","Rs 6.2 lakhs",620000,"INR",11040.908346214392,30873.418982173091,{"$f":"OFFSET(F1607,0,Brains!$D$1,1,1)","v":30873.418982173091},"assistant manager (finance)","Manager","India","India","1 or 2","1 or 2 hours a day",null,"30-49.9K",1.5,null,2,null,7,3]
["ID0372","2012-05-26T01:50:59","480000 Rs.",480000,"INR",8547.8000099724322,23902.001792650135,{"$f":"OFFSET(F1608,0,Brains!$D$1,1,1)","v":23902.001792650135},"System Manager","Manager","India","India","1 or 2","1 or 2 hours a day",null,"15-29.9K",1.5,null,2,null,7,2]
["ID0160","2012-05-26T00:45:53",420000,420000,"INR",7479.3250087258784,20914.251568568867,{"$f":"OFFSET(F1609,0,Brains!$D$1,1,1)","v":20914.251568568867},"managerial","Manager","India","India","1 or 2","1 or 2 hours a day",null,"15-29.9K",1.5,null,2,null,7,2]
["ID0037","2012-05-25T05:07:31",150000,150000,"USD",150000,150000,{"$f":"OFFSET(F1610,0,Brains!$D$1,1,1)","v":150000},"Portfolio Manager","Manager","USA","USA","2 to 3","2 to 3 hours per day",null,"150-249.9K",2.5,null,3,null,7,7]
["ID0485","2012-05-26T03:27:56","Zar 1080000",1080000,"ZAR",131675.52225194403,190409.02679830749,{"$f":"OFFSET(F1611,0,Brains!$D$1,1,1)","v":190409.02679830749},"Finance manager","Manager","South africa","South Africa","2 to 3","2 to 3 hours per day",null,"150-249.9K",2.5,null,3,null,7,7]
["ID0370","2012-05-26T01:50:30",130000,130000,"USD",130000,130000,{"$f":"OFFSET(F1612,0,Brains!$D$1,1,1)","v":130000},"Project Manager","Manager","USA","USA","2 to 3","2 to 3 hours per day",null,"100-149.9K",2.5,null,3,null,7,6]
["ID0461","2012-05-26T03:06:16",125000,125000,"USD",125000,125000,{"$f":"OFFSET(F1613,0,Brains!$D$1,1,1)","v":125000},"Prod Mgr","Manager","USA","USA","2 to 3","2 to 3 hours per day",null,"100-149.9K",2.5,null,3,null,7,6]
["ID0535","2012-05-26T05:18:12","120k",120000,"USD",120000,120000,{"$f":"OFFSET(F1614,0,Brains!$D$1,1,1)","v":120000},"manager","Manager","nz","New Zealand","2 to 3","2 to 3 hours per day",null,"100-149.9K",2.5,null,3,null,7,6]
["ID0134","2012-05-26T00:43:03",70000,70000,"GBP",110332.47904470989,103857.56676557862,{"$f":"OFFSET(F1615,0,Brains!$D$1,1,1)","v":103857.56676557862},"Project Manager","Manager","UK","UK","2 to 3","2 to 3 hours per day",null,"100-149.9K",2.5,null,3,null,7,6]
["ID0331","2012-05-26T01:31:58",108000,108000,"USD",108000,108000,{"$f":"OFFSET(F1616,0,Brains!$D$1,1,1)","v":108000},"Database Architect","Manager","USA","USA","2 to 3","2 to 3 hours per day",null,"100-149.9K",2.5,null,3,null,7,6]
["ID0166","2012-05-26T00:47:50",107000,107000,"CAD",105219.68296424497,85668.534827862284,{"$f":"OFFSET(F1617,0,Brains!$D$1,1,1)","v":85668.534827862284},"Manager, Asset Optimization","Manager","Canada","Canada","2 to 3","2 to 3 hours per day",null,"75-99.9K",2.5,null,3,null,7,5]
["ID0239","2012-05-26T01:02:10",100000,100000,"CAD",98336.152303032693,80064.051240992791,{"$f":"OFFSET(F1618,0,Brains!$D$1,1,1)","v":80064.051240992791},"retail buyer","Manager","Canada","Canada","2 to 3","2 to 3 hours per day",null,"75-99.9K",2.5,null,3,null,7,5]
["ID0200","2012-05-26T00:53:00",90000,90000,"USD",90000,90000,{"$f":"OFFSET(F1619,0,Brains!$D$1,1,1)","v":90000},"Project Manager","Manager","USA","USA","2 to 3","2 to 3 hours per day",null,"75-99.9K",2.5,null,3,null,7,5]
["ID0530","2012-05-26T05:00:21",82300,82300,"USD",82300,82300,{"$f":"OFFSET(F1620,0,Brains!$D$1,1,1)","v":82300},"Manager - Finance","Manager","USA","USA","2 to 3","2 to 3 hours per day",null,"75-99.9K",2.5,null,3,null,7,5]
["ID0189","2012-05-26T00:50:43",80000,80000,"USD",80000,80000,{"$f":"OFFSET(F1621,0,Brains!$D$1,1,1)","v":80000},"Project Manager (Process Owner)","Manager","USA","USA","2 to 3","2 to 3 hours per day",null,"75-99.9K",2.5,null,3,null,7,5]
["ID0278","2012-05-26T01:11:54",80000,80000,"USD",80000,80000,{"$f":"OFFSET(F1622,0,Brains!$D$1,1,1)","v":80000},"Enterprise Performance Metrics Manager","Manager","USA","USA","2 to 3","2 to 3 hours per day",null,"75-99.9K",2.5,null,3,null,7,5]
["ID0515","2012-05-26T04:25:24",76000,76000,"USD",76000,76000,{"$f":"OFFSET(F1623,0,Brains!$D$1,1,1)","v":76000},"Accounting Manager","Manager","USA","USA","2 to 3","2 to 3 hours per day",null,"75-99.9K",2.5,null,3,null,7,5]
["ID0523","2012-05-26T04:40:36",72600,72600,"USD",72600,72600,{"$f":"OFFSET(F1624,0,Brains!$D$1,1,1)","v":72600},"Accounting Operations Manager","Manager","USA","USA","2 to 3","2 to 3 hours per day",null,"50-74.9K",2.5,null,3,null,7,4]
["ID0235","2012-05-26T01:01:03",45000,45000,"GBP",70928.022243027779,66765.578635014841,{"$f":"OFFSET(F1625,0,Brains!$D$1,1,1)","v":66765.578635014841},"Procurement manager","Manager","UK","UK","2 to 3","2 to 3 hours per day",null,"50-74.9K",2.5,null,3,null,7,4]
["ID0245","2012-05-26T01:03:28",70000,70000,"USD",70000,70000,{"$f":"OFFSET(F1626,0,Brains!$D$1,1,1)","v":70000},"Manager Pricing","Manager","USA","USA","2 to 3","2 to 3 hours per day",null,"50-74.9K",2.5,null,3,null,7,4]
["ID0359","2012-05-26T01:43:48",68000,68000,"USD",68000,68000,{"$f":"OFFSET(F1627,0,Brains!$D$1,1,1)","v":68000},"Project Manager","Manager","USA","USA","2 to 3","2 to 3 hours per day",null,"50-74.9K",2.5,null,3,null,7,4]
["ID0229","2012-05-26T00:58:22",43000,43000,"GBP",67775.665698893223,63798.219584569728,{"$f":"OFFSET(F1628,0,Brains!$D$1,1,1)","v":63798.219584569728},"ServiceDesk Supervisor","Manager","UK","UK","2 to 3","2 to 3 hours per day",null,"50-74.9K",2.5,null,3,null,7,4]
["ID0333","2012-05-26T01:32:14","CAD 65000",65000,"CAD",63918.498996971248,52041.633306645308,{"$f":"OFFSET(F1629,0,Brains!$D$1,1,1)","v":52041.633306645308},"Product developer","Manager","CANADA","Canada","2 to 3","2 to 3 hours per day",null,"50-74.9K",2.5,null,3,null,7,4]
["ID0408","2012-05-26T02:10:35",63586.95,63586,"USD",63586,63586,{"$f":"OFFSET(F1630,0,Brains!$D$1,1,1)","v":63586},"Senior Purchasing Officer","Manager","United Arab Emriate","UAE","2 to 3","2 to 3 hours per day",null,"50-74.9K",2.5,null,3,null,7,4]
["ID0559","2012-05-26T05:52:47",50000,50000,"EUR",63519.971949580387,62809.967188073148,{"$f":"OFFSET(F1631,0,Brains!$D$1,1,1)","v":62809.967188073148},"Proyect Manager","Manager","Panama","Panama","2 to 3","2 to 3 hours per day",null,"50-74.9K",2.5,null,3,null,7,4]
["ID0058","2012-05-25T06:49:25",49000,49000,"EUR",62249.572510588783,61553.767844311682,{"$f":"OFFSET(F1632,0,Brains!$D$1,1,1)","v":61553.767844311682},"Project leader","Manager","France","France","2 to 3","2 to 3 hours per day",null,"50-74.9K",2.5,null,3,null,7,4]
["ID0529","2012-05-26T04:50:47",36500,36500,"GBP",57530.506930455871,54154.302670623147,{"$f":"OFFSET(F1633,0,Brains!$D$1,1,1)","v":54154.302670623147},"Production Manager","Manager","UK","UK","2 to 3","2 to 3 hours per day",null,"50-74.9K",2.5,null,3,null,7,4]
["ID0355","2012-05-26T01:42:07",56000,56000,"USD",56000,56000,{"$f":"OFFSET(F1634,0,Brains!$D$1,1,1)","v":56000},"asset manager","Manager","USA","USA","2 to 3","2 to 3 hours per day",null,"50-74.9K",2.5,null,3,null,7,4]
["ID0163","2012-05-26T00:46:29",55000,55000,"USD",55000,55000,{"$f":"OFFSET(F1635,0,Brains!$D$1,1,1)","v":55000},"Change Architect","Manager","USA","USA","2 to 3","2 to 3 hours per day",null,"50-74.9K",2.5,null,3,null,7,4]
["ID0350","2012-05-26T01:40:28",53000,53000,"USD",53000,53000,{"$f":"OFFSET(F1636,0,Brains!$D$1,1,1)","v":53000},"General Manager","Manager","USA","USA","2 to 3","2 to 3 hours per day",null,"50-74.9K",2.5,null,3,null,7,4]
["ID0447","2012-05-26T02:49:24",51000,51000,"USD",51000,51000,{"$f":"OFFSET(F1637,0,Brains!$D$1,1,1)","v":51000},"Direct marketing manager","Manager","USA","USA","2 to 3","2 to 3 hours per day",null,"50-74.9K",2.5,null,3,null,7,4]
["ID0080","2012-05-25T23:31:16",50000,50000,"USD",50000,50000,{"$f":"OFFSET(F1638,0,Brains!$D$1,1,1)","v":50000},"Exceler","Manager","USA","USA","2 to 3","2 to 3 hours per day",null,"50-74.9K",2.5,null,3,null,7,4]
["ID0392","2012-05-26T02:01:07",50000,50000,"USD",50000,50000,{"$f":"OFFSET(F1639,0,Brains!$D$1,1,1)","v":50000},"IR Manager","Manager","USA","USA","2 to 3","2 to 3 hours per day",null,"50-74.9K",2.5,null,3,null,7,4]
["ID0115","2012-05-26T00:41:30",4000,48000,"USD",48000,48000,{"$f":"OFFSET(F1640,0,Brains!$D$1,1,1)","v":48000},"Asst.Manager Finance","Manager","UAE","UAE","2 to 3","2 to 3 hours per day",null,"30-49.9K",2.5,null,3,null,7,3]
["ID0388","2012-05-26T02:00:14",47000,47000,"USD",47000,47000,{"$f":"OFFSET(F1641,0,Brains!$D$1,1,1)","v":47000},"Trainer ","Manager","USA","USA","2 to 3","2 to 3 hours per day",null,"30-49.9K",2.5,null,3,null,7,3]
["ID0473","2012-05-26T03:15:30","Â£28500",28500,"GBP",44921.080753917595,42284.866468842731,{"$f":"OFFSET(F1642,0,Brains!$D$1,1,1)","v":42284.866468842731},"Data Quality & Analysis Manager","Manager","UK","UK","2 to 3","2 to 3 hours per day",null,"30-49.9K",2.5,null,3,null,7,3]
["ID0387","2012-05-26T02:00:10","Â£28000",28000,"GBP",44132.991617883956,41543.026706231452,{"$f":"OFFSET(F1643,0,Brains!$D$1,1,1)","v":41543.026706231452},"Central Services Manager","Manager","UK","UK","2 to 3","2 to 3 hours per day",null,"30-49.9K",2.5,null,3,null,7,3]
["ID0373","2012-05-26T01:51:24",41932,41932,"USD",41932,41932,{"$f":"OFFSET(F1644,0,Brains!$D$1,1,1)","v":41932},"Buyer","Manager","USA","USA","2 to 3","2 to 3 hours per day",null,"30-49.9K",2.5,null,3,null,7,3]
["ID0025","2012-05-25T04:43:51","40000 us",40000,"USD",40000,40000,{"$f":"OFFSET(F1645,0,Brains!$D$1,1,1)","v":40000},"sales and marketing","Manager","USA","USA","2 to 3","2 to 3 hours per day",null,"30-49.9K",2.5,null,3,null,7,3]
["ID0401","2012-05-26T02:05:58",40000,40000,"USD",40000,40000,{"$f":"OFFSET(F1646,0,Brains!$D$1,1,1)","v":40000},"Accounting Manager","Manager","USA","USA","2 to 3","2 to 3 hours per day",null,"30-49.9K",2.5,null,3,null,7,3]
["ID0092","2012-05-26T00:39:38",36000,36000,"USD",36000,36000,{"$f":"OFFSET(F1647,0,Brains!$D$1,1,1)","v":36000},"Graphic Design Manager","Manager","USA","USA","2 to 3","2 to 3 hours per day",null,"30-49.9K",2.5,null,3,null,7,3]
["ID0151","2012-05-26T00:44:40",35000,35000,"USD",35000,35000,{"$f":"OFFSET(F1648,0,Brains!$D$1,1,1)","v":35000},"Program Services Coordinator","Manager","USA","USA","2 to 3","2 to 3 hours per day",null,"30-49.9K",2.5,null,3,null,7,3]
["ID0261","2012-05-26T01:07:42",1920000,1920000,"INR",34191.200039889729,95608.00717060054,{"$f":"OFFSET(F1649,0,Brains!$D$1,1,1)","v":95608.00717060054},"Project Manager","Manager","India","India","2 to 3","2 to 3 hours per day",null,"75-99.9K",2.5,null,3,null,7,5]
["ID0428","2012-05-26T02:27:50","US $30,000.00 ",30000,"USD",30000,30000,{"$f":"OFFSET(F1650,0,Brains!$D$1,1,1)","v":30000},"Supervisor","Manager","USA","USA","2 to 3","2 to 3 hours per day",null,"30-49.9K",2.5,null,3,null,7,3]
["ID0096","2012-05-26T00:40:27",24000,24000,"USD",24000,24000,{"$f":"OFFSET(F1651,0,Brains!$D$1,1,1)","v":24000},"Paraeducator","Manager","USA","USA","2 to 3","2 to 3 hours per day",null,"15-29.9K",2.5,null,3,null,7,2]
["ID0379","2012-05-26T01:57:40",1500,18000,"EUR",22867.189901848938,22611.588187706333,{"$f":"OFFSET(F1652,0,Brains!$D$1,1,1)","v":22611.588187706333},"marketing and sales ","Manager","Portugal","Portugal","2 to 3","2 to 3 hours per day",null,"15-29.9K",2.5,null,3,null,7,2]
["ID0238","2012-05-26T01:02:07",1200000,1200000,"INR",21369.500024931083,59755.004481625336,{"$f":"OFFSET(F1653,0,Brains!$D$1,1,1)","v":59755.004481625336},"Branch head -sales","Manager","India","India","2 to 3","2 to 3 hours per day",null,"50-74.9K",2.5,null,3,null,7,4]
["ID0285","2012-05-26T01:15:25",15000,15000,"USD",15000,15000,{"$f":"OFFSET(F1654,0,Brains!$D$1,1,1)","v":15000},"moneymaker","Manager","USA","USA","2 to 3","2 to 3 hours per day",null,"15-29.9K",2.5,null,3,null,7,2]
["ID0046","2012-05-25T05:46:47",800000,800000,"INR",14246.333349954055,39836.669654416888,{"$f":"OFFSET(F1655,0,Brains!$D$1,1,1)","v":39836.669654416888},"Team Lead","Manager","India","India","2 to 3","2 to 3 hours per day",null,"30-49.9K",2.5,null,3,null,7,3]
["ID0136","2012-05-26T00:43:08",800000,800000,"INR",14246.333349954055,39836.669654416888,{"$f":"OFFSET(F1656,0,Brains!$D$1,1,1)","v":39836.669654416888},"Manager : Accounts","Manager","India","India","2 to 3","2 to 3 hours per day",null,"30-49.9K",2.5,null,3,null,7,3]
["ID0500","2012-05-26T03:53:29","Rs. 7,20,000/-",720000,"INR",12821.700014958649,35853.002688975197,{"$f":"OFFSET(F1657,0,Brains!$D$1,1,1)","v":35853.002688975197},"Manager Finance","Manager","India","India","2 to 3","2 to 3 hours per day",null,"30-49.9K",2.5,null,3,null,7,3]
["ID0019","2012-05-25T04:16:32",550000,550000,"INR",9794.354178093412,27387.710387411611,{"$f":"OFFSET(F1658,0,Brains!$D$1,1,1)","v":27387.710387411611},"AGM","Manager","India","India","2 to 3","2 to 3 hours per day",null,"15-29.9K",2.5,null,3,null,7,2]
["ID0377","2012-05-26T01:54:47","Rs. 500000",500000,"INR",8903.9583437212841,24897.918534010558,{"$f":"OFFSET(F1659,0,Brains!$D$1,1,1)","v":24897.918534010558},"Owner","Manager","India","India","2 to 3","2 to 3 hours per day",null,"15-29.9K",2.5,null,3,null,7,2]
["ID0510","2012-05-26T04:16:16","Rs 500000",500000,"INR",8903.9583437212841,24897.918534010558,{"$f":"OFFSET(F1660,0,Brains!$D$1,1,1)","v":24897.918534010558},"duty manager","Manager","India","India","2 to 3","2 to 3 hours per day",null,"15-29.9K",2.5,null,3,null,7,2]
["ID0337","2012-05-26T01:33:45",150000,150000,"USD",150000,150000,{"$f":"OFFSET(F1661,0,Brains!$D$1,1,1)","v":150000},"project manager, project finance consultant","Manager","Israel","Israel","4 to 6","4 to 6 hours a day",null,"150-249.9K",5,null,4,null,7,7]
["ID0248","2012-05-26T01:03:54",140000,140000,"USD",140000,140000,{"$f":"OFFSET(F1662,0,Brains!$D$1,1,1)","v":140000},"Manager","Manager","USA","USA","4 to 6","4 to 6 hours a day",null,"100-149.9K",5,null,4,null,7,6]
["ID0257","2012-05-26T01:06:31",130000,130000,"USD",130000,130000,{"$f":"OFFSET(F1663,0,Brains!$D$1,1,1)","v":130000},"Senior Project Manager","Manager","USA","USA","4 to 6","4 to 6 hours a day",null,"100-149.9K",5,null,4,null,7,6]
["ID0314","2012-05-26T01:25:30",125000,125000,"USD",125000,125000,{"$f":"OFFSET(F1664,0,Brains!$D$1,1,1)","v":125000},"Finance, Manager ","Manager","USA","USA","4 to 6","4 to 6 hours a day",null,"100-149.9K",5,null,4,null,7,6]
["ID0084","2012-05-26T00:05:45",120000,120000,"USD",120000,120000,{"$f":"OFFSET(F1665,0,Brains!$D$1,1,1)","v":120000},"Manager, Forecasts & Budgets","Manager","USA","USA","4 to 6","4 to 6 hours a day",null,"100-149.9K",5,null,4,null,7,6]
["ID0538","2012-05-26T05:23:20","73,000 GBP",73000,"GBP",115061.01386091174,108308.60534124629,{"$f":"OFFSET(F1666,0,Brains!$D$1,1,1)","v":108308.60534124629},"Finance Manager","Manager","UK","UK","4 to 6","4 to 6 hours a day",null,{"$f":"IF(H1666<15000,\"0-14.9K\",IF(H1666<30000,\"15-29.9K\",IF(H1666<50000,\"30-49.9K\",IF(H1666<75000,\"50-74.9K\",IF(H1666<100000,\"75-99.9K\",IF(H1666<150000,\"100-149.9K\",IF(H1666<250000,\"150-249.9K\",\"250K+\")))))))","v":"100-149.9K"},5,null,4,null,7,{"$f":"IF(H1666<15000,1,IF(H1666<30000,2,IF(H1666<50000,3,IF(H1666<75000,4,IF(H1666<100000,5,IF(H1666<150000,6,IF(H1666<250000,7,8)))))))","v":6}]
["ID0496","2012-05-26T03:48:42","USD 108,000",108000,"USD",108000,108000,{"$f":"OFFSET(F1667,0,Brains!$D$1,1,1)","v":108000},"Manager","Manager","Norway","Norway","4 to 6","4 to 6 hours a day",null,"100-149.9K",5,null,4,null,7,6]
["ID0017","2012-05-25T04:10:11",107000,107000,"USD",107000,107000,{"$f":"OFFSET(F1668,0,Brains!$D$1,1,1)","v":107000},"Business Development","Manager","Switzerland","Switzerland","4 to 6","4 to 6 hours a day",null,"100-149.9K",5,null,4,null,7,6]
["ID0073","2012-05-25T22:59:05","$AUD100000",100000,"AUD",101990.96564026357,63613.231552162855,{"$f":"OFFSET(F1669,0,Brains!$D$1,1,1)","v":63613.231552162855},"technical trainer","Manager","Australia","Australia","4 to 6","4 to 6 hours a day",null,"50-74.9K",5,null,4,null,7,4]
["ID0070","2012-05-25T07:47:00",100000,100000,"USD",100000,100000,{"$f":"OFFSET(F1670,0,Brains!$D$1,1,1)","v":100000},"Mngr MI","Manager","RSA","South Africa","4 to 6","4 to 6 hours a day",null,"100-149.9K",5,null,4,null,7,6]
["ID0329","2012-05-26T01:31:26",92000,92000,"USD",92000,92000,{"$f":"OFFSET(F1671,0,Brains!$D$1,1,1)","v":92000},"Sales Analytics Manager","Manager","USA","USA","4 to 6","4 to 6 hours a day",null,"75-99.9K",5,null,4,null,7,5]
["ID0244","2012-05-26T01:03:07",90000,90000,"USD",90000,90000,{"$f":"OFFSET(F1672,0,Brains!$D$1,1,1)","v":90000},"Manager Business Control","Manager","USA","USA","4 to 6","4 to 6 hours a day",null,"75-99.9K",5,null,4,null,7,5]
["ID0367","2012-05-26T01:49:56",89000,89000,"USD",89000,89000,{"$f":"OFFSET(F1673,0,Brains!$D$1,1,1)","v":89000},"Quality Assurance Officer","Manager","USA","USA","4 to 6","4 to 6 hours a day",null,"75-99.9K",5,null,4,null,7,5]
["ID0147","2012-05-26T00:44:18",88000,88000,"USD",88000,88000,{"$f":"OFFSET(F1674,0,Brains!$D$1,1,1)","v":88000},"project manager - metrics","Manager","USA","USA","4 to 6","4 to 6 hours a day",null,"75-99.9K",5,null,4,null,7,5]
["ID0522","2012-05-26T04:39:11",87550,87550,"CAD",86093.301341305123,70096.076861489186,{"$f":"OFFSET(F1675,0,Brains!$D$1,1,1)","v":70096.076861489186},"Manager","Manager","Canada","Canada","4 to 6","4 to 6 hours a day",null,"50-74.9K",5,null,4,null,7,4]
["ID0468","2012-05-26T03:11:44",87000,87000,"CAD",85552.452503638444,69655.724579663729,{"$f":"OFFSET(F1676,0,Brains!$D$1,1,1)","v":69655.724579663729},"Business Manager","Manager","Canada","Canada","4 to 6","4 to 6 hours a day",null,"50-74.9K",5,null,4,null,7,4]
["ID0065","2012-05-25T07:20:08",85000,85000,"USD",85000,85000,{"$f":"OFFSET(F1677,0,Brains!$D$1,1,1)","v":85000},"Manager","Manager","USA","USA","4 to 6","4 to 6 hours a day",null,"75-99.9K",5,null,4,null,7,5]
["ID0453","2012-05-26T02:57:32",78000,78000,"USD",78000,78000,{"$f":"OFFSET(F1678,0,Brains!$D$1,1,1)","v":78000},"FinanceManager","Manager","Somalia","Somalia","4 to 6","4 to 6 hours a day",null,"75-99.9K",5,null,4,null,7,5]
["ID0183","2012-05-26T00:50:15",70000,70000,"USD",70000,70000,{"$f":"OFFSET(F1679,0,Brains!$D$1,1,1)","v":70000},"Project Speciast","Manager","USA","USA","4 to 6","4 to 6 hours a day",null,"50-74.9K",5,null,4,null,7,4]
["ID0396","2012-05-26T02:03:45",70000,70000,"USD",70000,70000,{"$f":"OFFSET(F1680,0,Brains!$D$1,1,1)","v":70000},"Management Ananlyst","Manager","USA","USA","4 to 6","4 to 6 hours a day",null,"50-74.9K",5,null,4,null,7,4]
["ID0137","2012-05-26T00:43:17",70000,70000,"CAD",68835.306612122877,56044.83586869495,{"$f":"OFFSET(F1681,0,Brains!$D$1,1,1)","v":56044.83586869495},"project manager","Manager","canada","Canada","4 to 6","4 to 6 hours a day",null,"50-74.9K",5,null,4,null,7,4]
["ID0366","2012-05-26T01:49:55",43000,43000,"GBP",67775.665698893223,63798.219584569728,{"$f":"OFFSET(F1682,0,Brains!$D$1,1,1)","v":63798.219584569728},"Commercial Manager","Manager","UK","UK","4 to 6","4 to 6 hours a day",null,"50-74.9K",5,null,4,null,7,4]
["ID0246","2012-05-26T01:03:34",65000,65000,"CAD",63918.498996971248,52041.633306645308,{"$f":"OFFSET(F1683,0,Brains!$D$1,1,1)","v":52041.633306645308},"Insurance Manager","Manager","Canada","Canada","4 to 6","4 to 6 hours a day",null,"50-74.9K",5,null,4,null,7,4]
["ID0431","2012-05-26T02:33:00",60000,60000,"USD",60000,60000,{"$f":"OFFSET(F1684,0,Brains!$D$1,1,1)","v":60000},"Planner","Manager","USA","USA","4 to 6","4 to 6 hours a day",null,"50-74.9K",5,null,4,null,7,4]
["ID0113","2012-05-26T00:41:27","$58,000 USD",58000,"USD",58000,58000,{"$f":"OFFSET(F1685,0,Brains!$D$1,1,1)","v":58000},"Operations Programs Support","Manager","USA","USA","4 to 6","4 to 6 hours a day",null,"50-74.9K",5,null,4,null,7,4]
["ID0049","2012-05-25T06:04:42","â‚¬ 45",45000,"EUR",57167.974754622352,56528.970469265834,{"$f":"OFFSET(F1686,0,Brains!$D$1,1,1)","v":56528.970469265834},"Online Traffic Manager / Web Analist","Manager","The Netherlands","Netherlands","4 to 6","4 to 6 hours a day",null,"50-74.9K",5,null,4,null,7,4]
["ID0099","2012-05-26T00:40:40",57000,57000,"USD",57000,57000,{"$f":"OFFSET(F1687,0,Brains!$D$1,1,1)","v":57000},"Production Scheduler","Manager","USA","USA","4 to 6","4 to 6 hours a day",null,"50-74.9K",5,null,4,null,7,4]
["ID0518","2012-05-26T04:33:03","57000 USD",57000,"USD",57000,57000,{"$f":"OFFSET(F1688,0,Brains!$D$1,1,1)","v":57000},"project finance manager","Manager","israel","Israel","4 to 6","4 to 6 hours a day",null,"50-74.9K",5,null,4,null,7,4]
["ID0445","2012-05-26T02:46:56","INR 30,00,000",3000000,"INR",53423.750062327701,149387.51120406334,{"$f":"OFFSET(F1689,0,Brains!$D$1,1,1)","v":149387.51120406334},"Management Consultant","Manager","India","India","4 to 6","4 to 6 hours a day",null,"100-149.9K",5,null,4,null,7,6]
["ID0499","2012-05-26T03:52:24",33000,33000,"GBP",52013.882978220376,48961.424332344213,{"$f":"OFFSET(F1690,0,Brains!$D$1,1,1)","v":48961.424332344213},"LOGISTIC MANAGER","Manager","UK","UK","4 to 6","4 to 6 hours a day",null,"30-49.9K",5,null,4,null,7,3]
["ID0104","2012-05-26T00:40:50",52000,52000,"USD",52000,52000,{"$f":"OFFSET(F1691,0,Brains!$D$1,1,1)","v":52000},"sr. project coordinator","Manager","USA","USA","4 to 6","4 to 6 hours a day",null,"50-74.9K",5,null,4,null,7,4]
["ID0460","2012-05-26T03:04:06","52,000 Cdn",52000,"CAD",51134.799197576998,41633.306645316246,{"$f":"OFFSET(F1692,0,Brains!$D$1,1,1)","v":41633.306645316246},"Office Manager","Manager","Canada","Canada","4 to 6","4 to 6 hours a day",null,"30-49.9K",5,null,4,null,7,3]
["ID0203","2012-05-26T00:53:37",51000,51000,"USD",51000,51000,{"$f":"OFFSET(F1693,0,Brains!$D$1,1,1)","v":51000},"Service Line Coordinator","Manager","USA","USA","4 to 6","4 to 6 hours a day",null,"50-74.9K",5,null,4,null,7,4]
["ID0159","2012-05-26T00:45:51","Â£32250",32250,"GBP",50831.74927416991,47848.6646884273,{"$f":"OFFSET(F1694,0,Brains!$D$1,1,1)","v":47848.6646884273},"project Support","Manager","UK","UK","4 to 6","4 to 6 hours a day",null,"30-49.9K",5,null,4,null,7,3]
["ID0210","2012-05-26T00:54:27",50000,50000,"USD",50000,50000,{"$f":"OFFSET(F1695,0,Brains!$D$1,1,1)","v":50000},"Buyer","Manager","USA","USA","4 to 6","4 to 6 hours a day",null,"50-74.9K",5,null,4,null,7,4]
["ID0227","2012-05-26T00:58:06",50000,50000,"USD",50000,50000,{"$f":"OFFSET(F1696,0,Brains!$D$1,1,1)","v":50000},"Project Manager","Manager","USA","USA","4 to 6","4 to 6 hours a day",null,"50-74.9K",5,null,4,null,7,4]
["ID0550","2012-05-26T05:35:00",50000,50000,"USD",50000,50000,{"$f":"OFFSET(F1697,0,Brains!$D$1,1,1)","v":50000},"Quality Compliance Manager","Manager","USA","USA","4 to 6","4 to 6 hours a day",null,"50-74.9K",5,null,4,null,7,4]
["ID0138","2012-05-26T00:43:25",50000,50000,"CAD",49168.076151516347,40032.025620496395,{"$f":"OFFSET(F1698,0,Brains!$D$1,1,1)","v":40032.025620496395},"Inventory manger","Manager","Canada","Canada","4 to 6","4 to 6 hours a day",null,"30-49.9K",5,null,4,null,7,3]
["ID0082","2012-05-25T23:49:27","Â£30000",30000,"GBP",47285.348162018527,44510.385756676558,{"$f":"OFFSET(F1699,0,Brains!$D$1,1,1)","v":44510.385756676558},"Database Manager","Manager","UK","UK","4 to 6","4 to 6 hours a day",null,"30-49.9K",5,null,4,null,7,3]
["ID0400","2012-05-26T02:05:49",47000,47000,"USD",47000,47000,{"$f":"OFFSET(F1700,0,Brains!$D$1,1,1)","v":47000},"Sr Management Analytst 2","Manager","USA","USA","4 to 6","4 to 6 hours a day",null,"30-49.9K",5,null,4,null,7,3]
["ID0109","2012-05-26T00:41:06",35000,35000,"EUR",44463.980364706273,43966.9770316512,{"$f":"OFFSET(F1701,0,Brains!$D$1,1,1)","v":43966.9770316512},"Project manager","Manager","Greece","Greece","4 to 6","4 to 6 hours a day",null,"30-49.9K",5,null,4,null,7,3]
["ID0494","2012-05-26T03:37:46",28164,28164,"GBP",44391.484854502989,41786.35014836795,{"$f":"OFFSET(F1702,0,Brains!$D$1,1,1)","v":41786.35014836795},"Administration Officer","Manager","UK","UK","4 to 6","4 to 6 hours a day",null,"30-49.9K",5,null,4,null,7,3]
["ID0293","2012-05-26T01:18:58",3600,43200,"USD",43200,43200,{"$f":"OFFSET(F1703,0,Brains!$D$1,1,1)","v":43200},"Projects Planner","Manager","Saudi Arabia","Saudi Arabia","4 to 6","4 to 6 hours a day",null,"30-49.9K",5,null,4,null,7,3]
["ID0218","2012-05-26T00:56:37",41600,41600,"USD",41600,41600,{"$f":"OFFSET(F1704,0,Brains!$D$1,1,1)","v":41600},"Project Manager","Manager","USA","USA","4 to 6","4 to 6 hours a day",null,"30-49.9K",5,null,4,null,7,3]
["ID0028","2012-05-25T04:48:33",2700,32400,"EUR",41160.941823328096,40700.8587378714,{"$f":"OFFSET(F1705,0,Brains!$D$1,1,1)","v":40700.8587378714},"Project Leader","Manager","Belgium","Belgium","4 to 6","4 to 6 hours a day",null,"30-49.9K",5,null,4,null,7,3]
["ID0310","2012-05-26T01:23:57",40000,40000,"USD",40000,40000,{"$f":"OFFSET(F1706,0,Brains!$D$1,1,1)","v":40000},"Royalties Coordinator","Manager","USA","USA","4 to 6","4 to 6 hours a day",null,"30-49.9K",5,null,4,null,7,3]
["ID0322","2012-05-26T01:27:52",40000,40000,"USD",40000,40000,{"$f":"OFFSET(F1707,0,Brains!$D$1,1,1)","v":40000},"Dp manager","Manager","Hungary","Hungary","4 to 6","4 to 6 hours a day",null,"30-49.9K",5,null,4,null,7,3]
["ID0341","2012-05-26T01:35:35",29000,29000,"USD",29000,29000,{"$f":"OFFSET(F1708,0,Brains!$D$1,1,1)","v":29000},"Assistant Outside Plant Project Manager","Manager","USA","USA","4 to 6","4 to 6 hours a day",null,"15-29.9K",5,null,4,null,7,2]
["ID0362","2012-05-26T01:45:58",25000,25000,"USD",25000,25000,{"$f":"OFFSET(F1709,0,Brains!$D$1,1,1)","v":25000},"Manager","Manager","India","India","4 to 6","4 to 6 hours a day",null,"15-29.9K",5,null,4,null,7,2]
["ID0165","2012-05-26T00:47:45","Rs. 1300000",1300000,"INR",23150.291693675339,64734.588188427442,{"$f":"OFFSET(F1710,0,Brains!$D$1,1,1)","v":64734.588188427442},"Manager","Manager","India","India","4 to 6","4 to 6 hours a day",null,"50-74.9K",5,null,4,null,7,4]
["ID0502","2012-05-26T04:01:45","23000 USD",23000,"USD",23000,23000,{"$f":"OFFSET(F1711,0,Brains!$D$1,1,1)","v":23000},"IT solutions coordinator","Manager","Hungary","Hungary","4 to 6","4 to 6 hours a day",null,"15-29.9K",5,null,4,null,7,2]
["ID0330","2012-05-26T01:31:42","22000 usd",22000,"USD",22000,22000,{"$f":"OFFSET(F1712,0,Brains!$D$1,1,1)","v":22000},"Product Manager Sr","Manager","Mexico","Mexico","4 to 6","4 to 6 hours a day",null,"15-29.9K",5,null,4,null,7,2]
["ID0250","2012-05-26T01:04:17",20000,20000,"USD",20000,20000,{"$f":"OFFSET(F1713,0,Brains!$D$1,1,1)","v":20000},"category manager","Manager","India","India","4 to 6","4 to 6 hours a day",null,"15-29.9K",5,null,4,null,7,2]
["ID0175","2012-05-26T00:48:57","Rd. 11 lakhs",1100000,"INR",19588.708356186824,54775.420774823222,{"$f":"OFFSET(F1714,0,Brains!$D$1,1,1)","v":54775.420774823222},"Asst manager investor relations and business analytics","Manager","India","India","4 to 6","4 to 6 hours a day",null,"50-74.9K",5,null,4,null,7,4]
["ID0443","2012-05-26T02:43:21",1100000,1100000,"INR",19588.708356186824,54775.420774823222,{"$f":"OFFSET(F1715,0,Brains!$D$1,1,1)","v":54775.420774823222},"manager - MIS & operations planning","Manager","India","India","4 to 6","4 to 6 hours a day",null,"50-74.9K",5,null,4,null,7,4]
["ID0023","2012-05-25T04:31:41",1000000,1000000,"INR",17807.916687442568,49795.837068021116,{"$f":"OFFSET(F1716,0,Brains!$D$1,1,1)","v":49795.837068021116},"Manager","Manager","India","India","4 to 6","4 to 6 hours a day",null,"30-49.9K",5,null,4,null,7,3]
["ID0321","2012-05-26T01:27:44","INR 1000000",1000000,"INR",17807.916687442568,49795.837068021116,{"$f":"OFFSET(F1717,0,Brains!$D$1,1,1)","v":49795.837068021116},"Manager","Manager","India","India","4 to 6","4 to 6 hours a day",null,"30-49.9K",5,null,4,null,7,3]
["ID0521","2012-05-26T04:36:43",15000,15000,"USD",15000,15000,{"$f":"OFFSET(F1718,0,Brains!$D$1,1,1)","v":15000},"Asst.Manager","Manager","India","India","4 to 6","4 to 6 hours a day",null,"15-29.9K",5,null,4,null,7,2]
["ID0021","2012-05-25T04:24:01",13500,13500,"USD",13500,13500,{"$f":"OFFSET(F1719,0,Brains!$D$1,1,1)","v":13500},"DSE Co-ordinator","Manager","India","India","4 to 6","4 to 6 hours a day",null,"0-14.9K",5,null,4,null,7,1]
["ID0030","2012-05-25T04:55:35","Rs 600000",600000,"INR",10684.750012465542,29877.502240812668,{"$f":"OFFSET(F1720,0,Brains!$D$1,1,1)","v":29877.502240812668},"strategy manager","Manager","India","India","4 to 6","4 to 6 hours a day",null,"15-29.9K",5,null,4,null,7,2]
["ID0508","2012-05-26T04:13:54","Rs 6L",600000,"INR",10684.750012465542,29877.502240812668,{"$f":"OFFSET(F1721,0,Brains!$D$1,1,1)","v":29877.502240812668},"Business Co ordinator","Manager","India","India","4 to 6","4 to 6 hours a day",null,"15-29.9K",5,null,4,null,7,2]
["ID0526","2012-05-26T04:48:35",600000,600000,"INR",10684.750012465542,29877.502240812668,{"$f":"OFFSET(F1722,0,Brains!$D$1,1,1)","v":29877.502240812668},"Project Manager","Manager","India","India","4 to 6","4 to 6 hours a day",null,"15-29.9K",5,null,4,null,7,2]
["ID0276","2012-05-26T01:10:56","35,000 Philippine Peso",420000,"PHP",9956.1219482708348,16476.403436507,{"$f":"OFFSET(F1723,0,Brains!$D$1,1,1)","v":16476.403436507},"Global Problem Management - IT","Manager","Philippines","Philippines","4 to 6","4 to 6 hours a day",null,"15-29.9K",5,null,4,null,7,2]
["ID0221","2012-05-26T00:57:21","INR 500000",500000,"INR",8903.9583437212841,24897.918534010558,{"$f":"OFFSET(F1724,0,Brains!$D$1,1,1)","v":24897.918534010558},"Project Manager","Manager","India","India","4 to 6","4 to 6 hours a day",null,"15-29.9K",5,null,4,null,7,2]
["ID0225","2012-05-26T00:58:03",480000,480000,"INR",8547.8000099724322,23902.001792650135,{"$f":"OFFSET(F1725,0,Brains!$D$1,1,1)","v":23902.001792650135},"Cash Officer","Manager","India","India","4 to 6","4 to 6 hours a day",null,"15-29.9K",5,null,4,null,7,2]
["ID0509","2012-05-26T04:14:27",8400,8400,"USD",8400,8400,{"$f":"OFFSET(F1726,0,Brains!$D$1,1,1)","v":8400},"Manager","Manager","India","India","4 to 6","4 to 6 hours a day",null,"0-14.9K",5,null,4,null,7,1]
["ID0040","2012-05-25T05:13:50","Rs. 400000",400000,"INR",7123.1666749770275,19918.334827208444,{"$f":"OFFSET(F1727,0,Brains!$D$1,1,1)","v":19918.334827208444},"Coordination","Manager","India","India","4 to 6","4 to 6 hours a day",null,"15-29.9K",5,null,4,null,7,2]
["ID0442","2012-05-26T02:42:20","Rs. 300000",300000,"INR",5342.3750062327708,14938.751120406334,{"$f":"OFFSET(F1728,0,Brains!$D$1,1,1)","v":14938.751120406334},"Web Portal Manager","Manager","India","India","4 to 6","4 to 6 hours a day",null,"0-14.9K",5,null,4,null,7,1]
["ID0297","2012-05-26T01:19:37","Rs.1.8 lakhs ",180000,"INR",3205.4250037396623,8963.2506722437993,{"$f":"OFFSET(F1729,0,Brains!$D$1,1,1)","v":8963.2506722437993},"Administrative Officer","Manager","India","India","4 to 6","4 to 6 hours a day",null,"0-14.9K",5,null,4,null,7,1]
["ID0339","2012-05-26T01:35:02",135000,135000,"USD",135000,135000,{"$f":"OFFSET(F1730,0,Brains!$D$1,1,1)","v":135000},"Manager of Trade Investment & Analysis","Manager","USA","USA","All 8","All the 8 hours baby, all the 8!",null,{"$f":"IF(H1730<15000,\"0-14.9K\",IF(H1730<30000,\"15-29.9K\",IF(H1730<50000,\"30-49.9K\",IF(H1730<75000,\"50-74.9K\",IF(H1730<100000,\"75-99.9K\",IF(H1730<150000,\"100-149.9K\",IF(H1730<250000,\"150-249.9K\",\"250K+\")))))))","v":"100-149.9K"},8,null,5,null,7,{"$f":"IF(H1730<15000,1,IF(H1730<30000,2,IF(H1730<50000,3,IF(H1730<75000,4,IF(H1730<100000,5,IF(H1730<150000,6,IF(H1730<250000,7,8)))))))","v":6}]
["ID0126","2012-05-26T00:42:08",128000,128000,"USD",128000,128000,{"$f":"OFFSET(F1731,0,Brains!$D$1,1,1)","v":128000},"Actuary","Manager","USA","USA","All 8","All the 8 hours baby, all the 8!",null,"100-149.9K",8,null,5,null,7,6]
["ID0204","2012-05-26T00:53:42",100000,100000,"USD",100000,100000,{"$f":"OFFSET(F1732,0,Brains!$D$1,1,1)","v":100000},"Strategic Sourcing Manager","Manager","USA","USA","All 8","All the 8 hours baby, all the 8!",null,"100-149.9K",8,null,5,null,7,6]
["ID0269","2012-05-26T01:09:01",76000,76000,"USD",76000,76000,{"$f":"OFFSET(F1733,0,Brains!$D$1,1,1)","v":76000},"Demand Planning Mgr","Manager","USA","USA","All 8","All the 8 hours baby, all the 8!",null,"75-99.9K",8,null,5,null,7,5]
["ID0072","2012-05-25T22:52:28",75000,75000,"USD",75000,75000,{"$f":"OFFSET(F1734,0,Brains!$D$1,1,1)","v":75000},"Consumer Research Program Manager","Manager","USA","USA","All 8","All the 8 hours baby, all the 8!",null,"75-99.9K",8,null,5,null,7,5]
["ID0289","2012-05-26T01:17:56",68000,68000,"USD",68000,68000,{"$f":"OFFSET(F1735,0,Brains!$D$1,1,1)","v":68000},"management accountant","Manager","USA","USA","All 8","All the 8 hours baby, all the 8!",null,"50-74.9K",8,null,5,null,7,4]
["ID0512","2012-05-26T04:18:15",65000,65000,"USD",65000,65000,{"$f":"OFFSET(F1736,0,Brains!$D$1,1,1)","v":65000},"Retail Store Manager","Manager","USA","USA","All 8","All the 8 hours baby, all the 8!",null,"50-74.9K",8,null,5,null,7,4]
["ID0298","2012-05-26T01:20:01",60000,60000,"USD",60000,60000,{"$f":"OFFSET(F1737,0,Brains!$D$1,1,1)","v":60000},"IS Manager","Manager","USA","USA","All 8","All the 8 hours baby, all the 8!",null,"50-74.9K",8,null,5,null,7,4]
["ID0465","2012-05-26T03:09:43",60000,60000,"USD",60000,60000,{"$f":"OFFSET(F1738,0,Brains!$D$1,1,1)","v":60000},"Business intelligence manager","Manager","USA","USA","All 8","All the 8 hours baby, all the 8!",null,"50-74.9K",8,null,5,null,7,4]
["ID0417","2012-05-26T02:17:18",56000,56000,"USD",56000,56000,{"$f":"OFFSET(F1739,0,Brains!$D$1,1,1)","v":56000},"financial management consultant","Manager","USA","USA","All 8","All the 8 hours baby, all the 8!",null,"50-74.9K",8,null,5,null,7,4]
["ID0266","2012-05-26T01:08:35",54000,54000,"USD",54000,54000,{"$f":"OFFSET(F1740,0,Brains!$D$1,1,1)","v":54000},"Anaylst","Manager","USA","USA","All 8","All the 8 hours baby, all the 8!",null,"50-74.9K",8,null,5,null,7,4]
["ID0369","2012-05-26T01:50:28",47500,47500,"USD",47500,47500,{"$f":"OFFSET(F1741,0,Brains!$D$1,1,1)","v":47500},"Supervisor, Contracts, Rebates, Chargebacks and Returns","Manager","USA","USA","All 8","All the 8 hours baby, all the 8!",null,"30-49.9K",8,null,5,null,7,3]
["ID0395","2012-05-26T02:03:35",45880,45880,"USD",45880,45880,{"$f":"OFFSET(F1742,0,Brains!$D$1,1,1)","v":45880},"Campus Budget Officer","Manager","USA","USA","All 8","All the 8 hours baby, all the 8!",null,"30-49.9K",8,null,5,null,7,3]
["ID0214","2012-05-26T00:54:56",41000,41000,"USD",41000,41000,{"$f":"OFFSET(F1743,0,Brains!$D$1,1,1)","v":41000},"Operations Expert","Manager","USA","USA","All 8","All the 8 hours baby, all the 8!",null,"30-49.9K",8,null,5,null,7,3]
["ID1929","2012-06-21T03:46:23",21000,21000,"USD",21000,21000,{"$f":"OFFSET(F1744,0,Brains!$D$1,1,1)","v":21000},"eorl","Misc.","India","India","All 8","All the 8 hours baby, all the 8!","0-5 yrs","15-29.9K",8,5,5,1,8,2]
["ID1807","2012-06-12T08:36:15",87000,87000,"USD",87000,87000,{"$f":"OFFSET(F1745,0,Brains!$D$1,1,1)","v":87000},"Ð˜Ð¨ Ð¤Ñ‚Ñ„Ð´Ð½Ñ‹Ðµ","Misc.","USA","USA","4 to 6","4 to 6 hours a day","0-5 yrs","75-99.9K",5,3,4,1,8,5]
["ID1912","2012-06-19T22:42:55",5000,5000,"USD",5000,5000,{"$f":"OFFSET(F1746,0,Brains!$D$1,1,1)","v":5000},"abc","Misc.","India","India","4 to 6","4 to 6 hours a day","0-5 yrs","0-14.9K",5,3,4,1,8,1]
["ID1773","2012-06-10T00:50:26","1.40 lac",140000,"INR",2493.1083362419595,6971.4171895229556,{"$f":"OFFSET(F1747,0,Brains!$D$1,1,1)","v":6971.4171895229556},"magic","Misc.","India","India","4 to 6","4 to 6 hours a day","0-5 yrs","0-14.9K",5,5,4,1,8,1]
["ID1880","2012-06-16T18:31:59",2342342,2342342,"INR",41712.231189497601,116638.88058958271,{"$f":"OFFSET(F1748,0,Brains!$D$1,1,1)","v":116638.88058958271},"3r23regedf","Misc.","India","India","2 to 3","2 to 3 hours per day","11-20 yrs","100-149.9K",2.5,12,3,3,8,6]
["ID1788","2012-06-11T10:04:43",74461,74461,"USD",74461,74461,{"$f":"OFFSET(F1749,0,Brains!$D$1,1,1)","v":74461},"Scientist III","Misc.","USA","USA","1 or 2","1 or 2 hours a day","6-10 yrs","50-74.9K",1.5,9,2,2,8,4]
["ID0045","2012-05-25T05:45:01",90000,90000,"USD",90000,90000,{"$f":"OFFSET(F1750,0,Brains!$D$1,1,1)","v":90000},"Scientist","Misc.","USA","USA","1 or 2","1 or 2 hours a day",null,"75-99.9K",1.5,null,2,null,8,5]
["ID0786","2012-05-26T19:29:34",16000,16000,"USD",16000,16000,{"$f":"OFFSET(F1751,0,Brains!$D$1,1,1)","v":16000},"Mis executiv","Reporting","India","India","All 8","All the 8 hours baby, all the 8!","0-5 yrs","15-29.9K",8,1,5,1,9,2]
["ID1133","2012-05-28T18:05:16","Â£15000",15000,"GBP",23642.674081009263,22255.192878338279,{"$f":"OFFSET(F1752,0,Brains!$D$1,1,1)","v":22255.192878338279},"MI Specialist","Reporting","UK","UK","All 8","All the 8 hours baby, all the 8!","0-5 yrs","15-29.9K",8,2,5,1,9,2]
["ID0658","2012-05-26T12:26:33",15000,15000,"USD",15000,15000,{"$f":"OFFSET(F1753,0,Brains!$D$1,1,1)","v":15000},"MIS Executive","Reporting","India","India","All 8","All the 8 hours baby, all the 8!","0-5 yrs","15-29.9K",8,2,5,1,9,2]
["ID1657","2012-06-04T12:22:05",10000,10000,"USD",10000,10000,{"$f":"OFFSET(F1754,0,Brains!$D$1,1,1)","v":10000},"MIS Executive","Reporting","India","India","All 8","All the 8 hours baby, all the 8!","0-5 yrs","0-14.9K",8,2,5,1,9,1]
["ID1330","2012-05-29T16:26:15","17000 Rs",204000,"INR",3632.815004238284,10158.350761876307,{"$f":"OFFSET(F1755,0,Brains!$D$1,1,1)","v":10158.350761876307},"MIS Associate","Reporting","India","India","All 8","All the 8 hours baby, all the 8!","0-5 yrs","0-14.9K",8,2,5,1,9,1]
["ID0776","2012-05-26T18:29:06",13500,13500,"USD",13500,13500,{"$f":"OFFSET(F1756,0,Brains!$D$1,1,1)","v":13500},"MIS","Reporting","India","India","All 8","All the 8 hours baby, all the 8!","0-5 yrs","0-14.9K",8,2.5,5,1,9,1]
["ID1648","2012-06-03T16:48:54",12000,12000,"USD",12000,12000,{"$f":"OFFSET(F1757,0,Brains!$D$1,1,1)","v":12000},"MIS ","Reporting","India","India","All 8","All the 8 hours baby, all the 8!","0-5 yrs","0-14.9K",8,3,5,1,9,1]
["ID0668","2012-05-26T12:48:19","230000 INR",230000,"INR",4095.8208381117906,11453.042525644856,{"$f":"OFFSET(F1758,0,Brains!$D$1,1,1)","v":11453.042525644856},"MIS Executive","Reporting","India","India","All 8","All the 8 hours baby, all the 8!","0-5 yrs","0-14.9K",8,3,5,1,9,1]
["ID0665","2012-05-26T12:35:42","INR 2 l;acks",200000,"INR",3561.5833374885137,9959.167413604222,{"$f":"OFFSET(F1759,0,Brains!$D$1,1,1)","v":9959.167413604222},"MIS EXECUTIVE","Reporting","India","India","All 8","All the 8 hours baby, all the 8!","0-5 yrs","0-14.9K",8,3,5,1,9,1]
["ID0621","2012-05-26T10:59:39","1 lakh 60 thousand INR/Year",160000,"INR",2849.2666699908109,7967.3339308833783,{"$f":"OFFSET(F1760,0,Brains!$D$1,1,1)","v":7967.3339308833783},"MIS Executive","Reporting","India","India","All 8","All the 8 hours baby, all the 8!","0-5 yrs","0-14.9K",8,3,5,1,9,1]
["ID1721","2012-06-06T20:07:43","1.5 LINR",150000,"INR",2671.1875031163854,7469.375560203167,{"$f":"OFFSET(F1761,0,Brains!$D$1,1,1)","v":7469.375560203167},"MIS Executive","Reporting","India","India","All 8","All the 8 hours baby, all the 8!","0-5 yrs","0-14.9K",8,3,5,1,9,1]
["ID1078","2012-05-28T15:29:24","INR 2.5 Lakh",250000,"INR",4451.9791718606421,12448.959267005279,{"$f":"OFFSET(F1762,0,Brains!$D$1,1,1)","v":12448.959267005279},"SR. MIS ","Reporting","India","India","All 8","All the 8 hours baby, all the 8!","0-5 yrs","0-14.9K",8,3.5,5,1,9,1]
["ID1036","2012-05-28T13:05:39",210000,210000,"INR",3739.6625043629392,10457.125784284433,{"$f":"OFFSET(F1763,0,Brains!$D$1,1,1)","v":10457.125784284433},"MIS executive","Reporting","India","India","All 8","All the 8 hours baby, all the 8!","0-5 yrs","0-14.9K",8,3.5,5,1,9,1]
["ID1686","2012-06-05T17:59:39","INR 450000",450000,"INR",8013.5625093491553,22408.126680609501,{"$f":"OFFSET(F1764,0,Brains!$D$1,1,1)","v":22408.126680609501},"Sr Executive - MIS","Reporting","India","India","All 8","All the 8 hours baby, all the 8!","0-5 yrs","15-29.9K",8,4,5,1,9,2]
["ID0724","2012-05-26T14:58:24","Rs.4lk ",400000,"INR",7123.1666749770275,19918.334827208444,{"$f":"OFFSET(F1765,0,Brains!$D$1,1,1)","v":19918.334827208444},"sr. mis executive","Reporting","India","India","All 8","All the 8 hours baby, all the 8!","0-5 yrs","15-29.9K",8,4,5,1,9,2]
["ID0696","2012-05-26T13:29:35","250000 rupees",250000,"INR",4451.9791718606421,12448.959267005279,{"$f":"OFFSET(F1766,0,Brains!$D$1,1,1)","v":12448.959267005279},"MIS executive","Reporting","India","India","All 8","All the 8 hours baby, all the 8!","0-5 yrs","0-14.9K",8,4,5,1,9,1]
["ID0629","2012-05-26T11:09:27",4200,4200,"USD",4200,4200,{"$f":"OFFSET(F1767,0,Brains!$D$1,1,1)","v":4200},"MIS Executive","Reporting","India","India","All 8","All the 8 hours baby, all the 8!","0-5 yrs","0-14.9K",8,4,5,1,9,1]
["ID0647","2012-05-26T11:55:17",4000,4000,"USD",4000,4000,{"$f":"OFFSET(F1768,0,Brains!$D$1,1,1)","v":4000},"MIS Executive","Reporting","India","India","All 8","All the 8 hours baby, all the 8!","0-5 yrs","0-14.9K",8,4,5,1,9,1]
["ID1047","2012-05-28T13:43:01",1.8,180000,"INR",3205.4250037396623,8963.2506722437993,{"$f":"OFFSET(F1769,0,Brains!$D$1,1,1)","v":8963.2506722437993},"MIS EXCUTIVE","Reporting","India","India","All 8","All the 8 hours baby, all the 8!","0-5 yrs","0-14.9K",8,4,5,1,9,1]
["ID0676","2012-05-26T12:59:41",325000,325000,"INR",5787.5729234188348,16183.647047106861,{"$f":"OFFSET(F1770,0,Brains!$D$1,1,1)","v":16183.647047106861},"MIS Executive","Reporting","India","India","All 8","All the 8 hours baby, all the 8!","0-5 yrs","15-29.9K",8,4.5,5,1,9,2]
["ID1074","2012-05-28T15:12:38",7000,7000,"USD",7000,7000,{"$f":"OFFSET(F1771,0,Brains!$D$1,1,1)","v":7000},"MIS Executive","Reporting","India","India","All 8","All the 8 hours baby, all the 8!","0-5 yrs","0-14.9K",8,5,5,1,9,1]
["ID1732","2012-06-07T14:06:38","6000 US",6000,"USD",6000,6000,{"$f":"OFFSET(F1772,0,Brains!$D$1,1,1)","v":6000},"Reporting Coordinator","Reporting","Armenia","Armenia","All 8","All the 8 hours baby, all the 8!","0-5 yrs","0-14.9K",8,5,5,1,9,1]
["ID1142","2012-05-28T19:05:22","200000 rupees",200000,"INR",3561.5833374885137,9959.167413604222,{"$f":"OFFSET(F1773,0,Brains!$D$1,1,1)","v":9959.167413604222},"MIS Sr. Executive","Reporting","India","India","All 8","All the 8 hours baby, all the 8!","0-5 yrs","0-14.9K",8,5,5,1,9,1]
["ID0758","2012-05-26T17:02:46","Rs. 225000",225000,"INR",4006.7812546745777,11204.06334030475,{"$f":"OFFSET(F1774,0,Brains!$D$1,1,1)","v":11204.06334030475},"MIS Executive","Reporting","India","India","All 8","All the 8 hours baby, all the 8!","0-5 yrs","0-14.9K",8,5.5,5,1,9,1]
["ID1326","2012-05-29T15:53:14",10000,10000,"USD",10000,10000,{"$f":"OFFSET(F1775,0,Brains!$D$1,1,1)","v":10000},"MIS","Reporting","India","India","1 or 2","1 or 2 hours a day","0-5 yrs","0-14.9K",1.5,0.5,2,1,9,1]
["ID0651","2012-05-26T12:17:01",480000,480000,"INR",8547.8000099724322,23902.001792650135,{"$f":"OFFSET(F1776,0,Brains!$D$1,1,1)","v":23902.001792650135},"BI Consultant","Reporting","India","India","1 or 2","1 or 2 hours a day","0-5 yrs","15-29.9K",1.5,3,2,1,9,2]
["ID1311","2012-05-29T14:55:29","210000 per annum",210000,"INR",3739.6625043629392,10457.125784284433,{"$f":"OFFSET(F1777,0,Brains!$D$1,1,1)","v":10457.125784284433},"MIS cum Purchase Executive","Reporting","India","India","1 or 2","1 or 2 hours a day","0-5 yrs","0-14.9K",1.5,4.5,2,1,9,1]
["ID0716","2012-05-26T14:23:48",500000,500000,"INR",8903.9583437212841,24897.918534010558,{"$f":"OFFSET(F1778,0,Brains!$D$1,1,1)","v":24897.918534010558},"mis ","Reporting","India","India","2 to 3","2 to 3 hours per day","0-5 yrs","15-29.9K",2.5,1,3,1,9,2]
["ID1038","2012-05-28T13:10:02",28000,28000,"USD",28000,28000,{"$f":"OFFSET(F1779,0,Brains!$D$1,1,1)","v":28000},"BI","Reporting","India","India","2 to 3","2 to 3 hours per day","0-5 yrs","15-29.9K",2.5,3,3,1,9,2]
["ID1090","2012-05-28T15:49:54","Rs. 250000",250000,"INR",4451.9791718606421,12448.959267005279,{"$f":"OFFSET(F1780,0,Brains!$D$1,1,1)","v":12448.959267005279},"MIS Executive","Reporting","India","India","2 to 3","2 to 3 hours per day","0-5 yrs","0-14.9K",2.5,3,3,1,9,1]
["ID1313","2012-05-29T15:02:56","2 LPA",200000,"INR",3561.5833374885137,9959.167413604222,{"$f":"OFFSET(F1781,0,Brains!$D$1,1,1)","v":9959.167413604222},"MIS","Reporting","India","India","2 to 3","2 to 3 hours per day","0-5 yrs","0-14.9K",2.5,3,3,1,9,1]
["ID1289","2012-05-29T12:19:39","3,00,000.00",300000,"INR",5342.3750062327708,14938.751120406334,{"$f":"OFFSET(F1782,0,Brains!$D$1,1,1)","v":14938.751120406334},"MIS OFFICER","Reporting","India","India","2 to 3","2 to 3 hours per day","0-5 yrs","0-14.9K",2.5,5,3,1,9,1]
["ID1625","2012-06-02T18:47:32",7000,7000,"USD",7000,7000,{"$f":"OFFSET(F1783,0,Brains!$D$1,1,1)","v":7000},"M.I.S","Reporting","India","India","4 to 6","4 to 6 hours a day","0-5 yrs","0-14.9K",5,1,4,1,9,1]
["ID0644","2012-05-26T11:47:38","25000 INR",300000,"INR",5342.3750062327708,14938.751120406334,{"$f":"OFFSET(F1784,0,Brains!$D$1,1,1)","v":14938.751120406334},"MIS","Reporting","India","India","4 to 6","4 to 6 hours a day","0-5 yrs","0-14.9K",5,1,4,1,9,1]
["ID0846","2012-05-27T00:53:20","2 lac",200000,"INR",3561.5833374885137,9959.167413604222,{"$f":"OFFSET(F1785,0,Brains!$D$1,1,1)","v":9959.167413604222},"Bio-Statiscian","Reporting","India","India","4 to 6","4 to 6 hours a day","0-5 yrs","0-14.9K",5,1,4,1,9,1]
["ID1562","2012-05-31T23:09:08","Â£25000",25000,"GBP",39404.456801682099,37091.988130563797,{"$f":"OFFSET(F1786,0,Brains!$D$1,1,1)","v":37091.988130563797},"Reporting Team Lead","Reporting","UK","UK","4 to 6","4 to 6 hours a day","0-5 yrs","30-49.9K",5,2,4,1,9,3]
["ID0842","2012-05-27T00:12:53",30000,30000,"USD",30000,30000,{"$f":"OFFSET(F1787,0,Brains!$D$1,1,1)","v":30000},"MIS Executive","Reporting","India","India","4 to 6","4 to 6 hours a day","0-5 yrs","30-49.9K",5,2,4,1,9,3]
["ID1753","2012-06-08T13:55:44","15000inr",180000,"INR",3205.4250037396623,8963.2506722437993,{"$f":"OFFSET(F1788,0,Brains!$D$1,1,1)","v":8963.2506722437993},"mis","Reporting","India","India","4 to 6","4 to 6 hours a day","0-5 yrs","0-14.9K",5,2,4,1,9,1]
["ID0809","2012-05-26T21:56:36",170000,170000,"INR",3027.3458368652364,8465.2923015635897,{"$f":"OFFSET(F1789,0,Brains!$D$1,1,1)","v":8465.2923015635897},"Sr. Executive MIS","Reporting","India","India","4 to 6","4 to 6 hours a day","0-5 yrs","0-14.9K",5,2,4,1,9,1]
["ID1903","2012-06-19T15:15:38",250000,250000,"INR",4451.9791718606421,12448.959267005279,{"$f":"OFFSET(F1790,0,Brains!$D$1,1,1)","v":12448.959267005279},"MIS EXECUTIVE","Reporting","India","India","4 to 6","4 to 6 hours a day","0-5 yrs","0-14.9K",5,3,4,1,9,1]
["ID1066","2012-05-28T14:45:04","2LAKHS",200000,"INR",3561.5833374885137,9959.167413604222,{"$f":"OFFSET(F1791,0,Brains!$D$1,1,1)","v":9959.167413604222},"MIS Executive","Reporting","India","India","4 to 6","4 to 6 hours a day","0-5 yrs","0-14.9K",5,3,4,1,9,1]
["ID1904","2012-06-19T17:01:38","52,224.00ETB",52224,"ETB",2953.8461538461538,7454.1821296031976,{"$f":"OFFSET(F1792,0,Brains!$D$1,1,1)","v":7454.1821296031976},"Project Costing &Dashboard reporting","Reporting","Ethiopia","Ethiopia","4 to 6","4 to 6 hours a day","0-5 yrs","0-14.9K",5,3,4,1,9,1]
["ID1820","2012-06-13T00:20:14","4.5 Laks",450000,"INR",8013.5625093491553,22408.126680609501,{"$f":"OFFSET(F1793,0,Brains!$D$1,1,1)","v":22408.126680609501},"MIS Executive","Reporting","India","India","4 to 6","4 to 6 hours a day","0-5 yrs","15-29.9K",5,4,4,1,9,2]
["ID1665","2012-06-04T19:46:09","2600 $",31200,"USD",31200,31200,{"$f":"OFFSET(F1794,0,Brains!$D$1,1,1)","v":31200},"Economist","Reporting","ISRAEL","Israel","All 8","All the 8 hours baby, all the 8!","11-20 yrs",{"$f":"IF(H1794<15000,\"0-14.9K\",IF(H1794<30000,\"15-29.9K\",IF(H1794<50000,\"30-49.9K\",IF(H1794<75000,\"50-74.9K\",IF(H1794<100000,\"75-99.9K\",IF(H1794<150000,\"100-149.9K\",IF(H1794<250000,\"150-249.9K\",\"250K+\")))))))","v":"30-49.9K"},8,11,5,3,9,{"$f":"IF(H1794<15000,1,IF(H1794<30000,2,IF(H1794<50000,3,IF(H1794<75000,4,IF(H1794<100000,5,IF(H1794<150000,6,IF(H1794<250000,7,8)))))))","v":3}]
["ID1668","2012-06-04T23:00:10",92000,92000,"USD",92000,92000,{"$f":"OFFSET(F1795,0,Brains!$D$1,1,1)","v":92000},"BI director","Reporting","USA","USA","2 to 3","2 to 3 hours per day","11-20 yrs","75-99.9K",2.5,12,3,3,9,5]
["ID0800","2012-05-26T21:07:14","Â£29000",29000,"GBP",45709.169889951241,43026.706231454002,{"$f":"OFFSET(F1796,0,Brains!$D$1,1,1)","v":43026.706231454002},"Reporting Assistant","Reporting","UK","UK","2 to 3","2 to 3 hours per day","11-20 yrs","30-49.9K",2.5,15,3,3,9,3]
["ID0940","2012-05-27T23:46:03",18060,18060,"USD",18060,18060,{"$f":"OFFSET(F1797,0,Brains!$D$1,1,1)","v":18060},"Reporting Supervisor","Reporting","Philippines","Philippines","4 to 6","4 to 6 hours a day","11-20 yrs","15-29.9K",5,12,4,3,9,2]
["ID1404","2012-05-29T22:56:24","37K",37000,"USD",37000,37000,{"$f":"OFFSET(F1798,0,Brains!$D$1,1,1)","v":37000},"Credentialing Coordinator & Productivity Reports \"Guru\"","Reporting","USA","USA","2 to 3","2 to 3 hours per day","21-30 yrs","30-49.9K",2.5,30,3,4,9,3]
["ID1019","2012-05-28T12:09:37","usd 20.000",20000,"USD",20000,20000,{"$f":"OFFSET(F1799,0,Brains!$D$1,1,1)","v":20000},"Head of Financial Reporting","Reporting","Paraguay","Paraguay","All 8","All the 8 hours baby, all the 8!","6-10 yrs","15-29.9K",8,6,5,2,9,2]
["ID1602","2012-06-01T20:27:23",10000,10000,"USD",10000,10000,{"$f":"OFFSET(F1800,0,Brains!$D$1,1,1)","v":10000},"MIS","Reporting","India","India","All 8","All the 8 hours baby, all the 8!","6-10 yrs","0-14.9K",8,6,5,2,9,1]
["ID1917","2012-06-20T01:43:12",700,8400,"USD",8400,8400,{"$f":"OFFSET(F1801,0,Brains!$D$1,1,1)","v":8400},"Sr. Executive MIS","Reporting","India","India","All 8","All the 8 hours baby, all the 8!","6-10 yrs","0-14.9K",8,6,5,2,9,1]
["ID1914","2012-06-20T00:27:54","Rs23000/month",276000,"INR",4914.9850057341491,13743.651030773826,{"$f":"OFFSET(F1802,0,Brains!$D$1,1,1)","v":13743.651030773826},"MIS specialist","Reporting","India","India","All 8","All the 8 hours baby, all the 8!","6-10 yrs","0-14.9K",8,6,5,2,9,1]
["ID0625","2012-05-26T11:03:48",4000,4000,"USD",4000,4000,{"$f":"OFFSET(F1803,0,Brains!$D$1,1,1)","v":4000},"MIS Executive","Reporting","India","India","All 8","All the 8 hours baby, all the 8!","6-10 yrs","0-14.9K",8,6,5,2,9,1]
["ID0783","2012-05-26T19:13:39","180000 PKR",180000,"PKR",1910.5359690238436,4402.8080131105835,{"$f":"OFFSET(F1804,0,Brains!$D$1,1,1)","v":4402.8080131105835},"S&D Reporting & Analysis Team Leader","Reporting","Pakistan","Pakistan","All 8","All the 8 hours baby, all the 8!","6-10 yrs","0-14.9K",8,7,5,2,9,1]
["ID0795","2012-05-26T20:50:07",96000,96000,"USD",96000,96000,{"$f":"OFFSET(F1805,0,Brains!$D$1,1,1)","v":96000},"MIS Executive","Reporting","India","India","All 8","All the 8 hours baby, all the 8!","6-10 yrs","75-99.9K",8,8,5,2,9,5]
["ID1128","2012-05-28T17:42:51",19000,19000,"USD",19000,19000,{"$f":"OFFSET(F1806,0,Brains!$D$1,1,1)","v":19000},"MI Specialist","Reporting","UK","UK","All 8","All the 8 hours baby, all the 8!","6-10 yrs","15-29.9K",8,8,5,2,9,2]
["ID1067","2012-05-28T14:46:42",5100,5100,"USD",5100,5100,{"$f":"OFFSET(F1807,0,Brains!$D$1,1,1)","v":5100},"MIS Executive","Reporting","India","India","All 8","All the 8 hours baby, all the 8!","6-10 yrs","0-14.9K",8,8,5,2,9,1]
["ID1503","2012-05-30T22:59:44","278000 PA",278000,"INR",4950.6008391090336,13843.24270490987,{"$f":"OFFSET(F1808,0,Brains!$D$1,1,1)","v":13843.24270490987},"MIS Executive","Reporting","India","India","All 8","All the 8 hours baby, all the 8!","6-10 yrs","0-14.9K",8,8,5,2,9,1]
["ID0924","2012-05-27T20:51:55",180000,180000,"INR",3205.4250037396623,8963.2506722437993,{"$f":"OFFSET(F1809,0,Brains!$D$1,1,1)","v":8963.2506722437993},"MIS TEAM MEMBER","Reporting","India","India","All 8","All the 8 hours baby, all the 8!","6-10 yrs","0-14.9K",8,8,5,2,9,1]
["ID1585","2012-06-01T08:06:34","5.65 lac per annum",5650000,"INR",100614.72928405051,281346.47943431931,{"$f":"OFFSET(F1810,0,Brains!$D$1,1,1)","v":281346.47943431931},"MIS","Reporting","India","India","2 to 3","2 to 3 hours per day","6-10 yrs","250K+",2.5,6,3,2,9,8]
["ID0694","2012-05-26T13:24:36",380000,380000,"INR",6767.0083412281756,18922.418085848021,{"$f":"OFFSET(F1811,0,Brains!$D$1,1,1)","v":18922.418085848021},"Team Lead Mis","Reporting","India","India","2 to 3","2 to 3 hours per day","6-10 yrs","15-29.9K",2.5,6,3,2,9,2]
["ID1347","2012-05-29T18:00:19",6600,6600,"USD",6600,6600,{"$f":"OFFSET(F1812,0,Brains!$D$1,1,1)","v":6600},"MIS HR,HRIS","Reporting","India","India","2 to 3","2 to 3 hours per day","6-10 yrs","0-14.9K",2.5,6.4,3,2,9,1]
["ID1051","2012-05-28T14:11:34","55000 usd",55000,"USD",55000,55000,{"$f":"OFFSET(F1813,0,Brains!$D$1,1,1)","v":55000},"Economist","Reporting","Israel","Israel","4 to 6","4 to 6 hours a day","6-10 yrs","50-74.9K",5,6,4,2,9,4]
["ID1225","2012-05-29T01:31:39","700000 INR",700000,"INR",12465.541681209797,34857.085947614782,{"$f":"OFFSET(F1814,0,Brains!$D$1,1,1)","v":34857.085947614782},"Lead Executive MIS","Reporting","India","India","4 to 6","4 to 6 hours a day","6-10 yrs","30-49.9K",5,6,4,2,9,3]
["ID1077","2012-05-28T15:27:59",560,6720,"USD",6720,6720,{"$f":"OFFSET(F1815,0,Brains!$D$1,1,1)","v":6720},"MIS Executive","Reporting","India","India","4 to 6","4 to 6 hours a day","6-10 yrs","0-14.9K",5,6,4,2,9,1]
["ID1193","2012-05-28T23:17:12","US$ 7,200",7200,"USD",7200,7200,{"$f":"OFFSET(F1816,0,Brains!$D$1,1,1)","v":7200},"Supervisor MIS","Reporting","India","India","4 to 6","4 to 6 hours a day","6-10 yrs","0-14.9K",5,7,4,2,9,1]
["ID0985","2012-05-28T08:22:44","USD 85000.00",85000,"USD",85000,85000,{"$f":"OFFSET(F1817,0,Brains!$D$1,1,1)","v":85000},"Reporting and DB Analyist","Reporting","Australia","Australia","4 to 6","4 to 6 hours a day","6-10 yrs","75-99.9K",5,8,4,2,9,5]
["ID1044","2012-05-28T13:41:33",476000,476000,"INR",8476.5683432226633,23702.818444378048,{"$f":"OFFSET(F1818,0,Brains!$D$1,1,1)","v":23702.818444378048},"Report Specialist","Reporting","India","India","4 to 6","4 to 6 hours a day","6-10 yrs","15-29.9K",5,8,4,2,9,2]
["ID1131","2012-05-28T18:02:44","4,00,000",400000,"INR",7123.1666749770275,19918.334827208444,{"$f":"OFFSET(F1819,0,Brains!$D$1,1,1)","v":19918.334827208444},"Sr. Team Lead - MIS","Reporting","India","India","4 to 6","4 to 6 hours a day","6-10 yrs","15-29.9K",5,9,4,2,9,2]
["ID1583","2012-06-01T06:53:52",85000,85000,"USD",85000,85000,{"$f":"OFFSET(F1820,0,Brains!$D$1,1,1)","v":85000},"Sr Report Developer","Reporting","USA","USA","4 to 6","4 to 6 hours a day","6-10 yrs","75-99.9K",5,10,4,2,9,5]
["ID1505","2012-05-30T23:26:00",32000,32000,"USD",32000,32000,{"$f":"OFFSET(F1821,0,Brains!$D$1,1,1)","v":32000},"Reports Writer","Reporting","USA","USA","4 to 6","4 to 6 hours a day","6-10 yrs","30-49.9K",5,10,4,2,9,3]
["ID0309","2012-05-26T01:23:50",200000,200000,"EUR",254079.88779832155,251239.86875229259,{"$f":"OFFSET(F1822,0,Brains!$D$1,1,1)","v":251239.86875229259},"consultant bi","Reporting","The netherlands","Netherlands","All 8","All the 8 hours baby, all the 8!",null,"250K+",8,null,5,null,9,8]
["ID0018","2012-05-25T04:10:44",45000,45000,"USD",45000,45000,{"$f":"OFFSET(F1823,0,Brains!$D$1,1,1)","v":45000},"Excel Report Writer","Reporting","South Africa","South Africa","All 8","All the 8 hours baby, all the 8!",null,"30-49.9K",8,null,5,null,9,3]
["ID0288","2012-05-26T01:17:50",22000,22000,"USD",22000,22000,{"$f":"OFFSET(F1824,0,Brains!$D$1,1,1)","v":22000},"MIS","Reporting","India","India","All 8","All the 8 hours baby, all the 8!",null,"15-29.9K",8,null,5,null,9,2]
["ID0492","2012-05-26T03:34:15",6000,6000,"USD",6000,6000,{"$f":"OFFSET(F1825,0,Brains!$D$1,1,1)","v":6000},"MIS","Reporting","India","India","All 8","All the 8 hours baby, all the 8!",null,"0-14.9K",8,null,5,null,9,1]
["ID0429","2012-05-26T02:29:37","30000 $",30000,"USD",30000,30000,{"$f":"OFFSET(F1826,0,Brains!$D$1,1,1)","v":30000},"BI Developer","Reporting","Romania","Romania","1 or 2","1 or 2 hours a day",null,"30-49.9K",1.5,null,2,null,9,3]
["ID0385","2012-05-26T01:59:48",15000,15000,"USD",15000,15000,{"$f":"OFFSET(F1827,0,Brains!$D$1,1,1)","v":15000},"Economist","Reporting","Ukraine","Ukraine","2 to 3","2 to 3 hours per day",null,"15-29.9K",2.5,null,3,null,9,2]
["ID0391","2012-05-26T02:00:54",12000,12000,"USD",12000,12000,{"$f":"OFFSET(F1828,0,Brains!$D$1,1,1)","v":12000},"MIS Officer","Reporting","South Africa","South Africa","4 to 6","4 to 6 hours a day",null,"0-14.9K",5,null,4,null,9,1]
["ID0328","2012-05-26T01:30:56","PhP 456,000",456000,"PHP",10809.503829551191,17888.666588207601,{"$f":"OFFSET(F1829,0,Brains!$D$1,1,1)","v":17888.666588207601},"Reporting Shared Services Oferring Lead","Reporting","Philippines","Philippines","4 to 6","4 to 6 hours a day",null,"15-29.9K",5,null,4,null,9,2]
["ID0141","2012-05-26T00:43:36","28000rs",336000,"INR",5983.4600069807029,16731.401254855093,{"$f":"OFFSET(F1830,0,Brains!$D$1,1,1)","v":16731.401254855093},"MIS Team Leader","Reporting","India","India","4 to 6","4 to 6 hours a day",null,"15-29.9K",5,null,4,null,9,2]
["ID0448","2012-05-26T02:50:16","5000 $",5000,"USD",5000,5000,{"$f":"OFFSET(F1831,0,Brains!$D$1,1,1)","v":5000},"mis","Reporting","India","India","4 to 6","4 to 6 hours a day",null,"0-14.9K",5,null,4,null,9,1]
["ID0347","2012-05-26T01:39:37","3.8 k",3800,"USD",3800,3800,{"$f":"OFFSET(F1832,0,Brains!$D$1,1,1)","v":3800},"MIS EXCUTIVE","Reporting","India","India","4 to 6","4 to 6 hours a day",null,"0-14.9K",5,null,4,null,9,1]
["ID0549","2012-05-26T05:33:43",45000,45000,"USD",45000,45000,{"$f":"OFFSET(F1833,0,Brains!$D$1,1,1)","v":45000},"Reports Coordinator","Reporting","USA","USA","All 8","All the 8 hours baby, all the 8!",null,"30-49.9K",8,null,5,null,9,3]
["ID1509","2012-05-31T00:46:55","4.00 lac",4000000,"INR",71231.666749770273,199183.34827208446,{"$f":"OFFSET(F1834,0,Brains!$D$1,1,1)","v":199183.34827208446},"Operational Specialist","Specialist","India","India","All 8","All the 8 hours baby, all the 8!","0-5 yrs","150-249.9K",8,5,5,1,10,7]
["ID1563","2012-05-31T23:10:44","70000 â‚¬",70000,"EUR",88927.960729412545,87933.954063302401,{"$f":"OFFSET(F1835,0,Brains!$D$1,1,1)","v":87933.954063302401},"Specialist Learning Technology","Specialist","Germany","Germany","1 or 2","1 or 2 hours a day","0-5 yrs","75-99.9K",1.5,5,2,1,10,5]
["ID1086","2012-05-28T15:44:12","Â£63000",63000,"GBP",99299.231140238902,93471.810089020772,{"$f":"OFFSET(F1836,0,Brains!$D$1,1,1)","v":93471.810089020772},"Business Improvement Specialist","Specialist","UK","UK","2 to 3","2 to 3 hours per day","0-5 yrs","75-99.9K",2.5,1,3,1,10,5]
["ID1679","2012-06-05T04:06:09",80000,80000,"USD",80000,80000,{"$f":"OFFSET(F1837,0,Brains!$D$1,1,1)","v":80000},"Data Resource Specialist","Specialist","USA","USA","2 to 3","2 to 3 hours per day","0-5 yrs","75-99.9K",2.5,2,3,1,10,5]
["ID1645","2012-06-03T14:27:29",4019,4019,"USD",4019,4019,{"$f":"OFFSET(F1838,0,Brains!$D$1,1,1)","v":4019},"Clinical Intake Specialist","Specialist","Philippines","Philippines","2 to 3","2 to 3 hours per day","0-5 yrs","0-14.9K",2.5,3,3,1,10,1]
["ID1851","2012-06-15T02:24:44",40000,40000,"USD",40000,40000,{"$f":"OFFSET(F1839,0,Brains!$D$1,1,1)","v":40000},"Research Support Specialist","Specialist","USA","USA","4 to 6","4 to 6 hours a day","0-5 yrs","30-49.9K",5,1,4,1,10,3]
["ID1713","2012-06-06T09:31:47",80000,80000,"AUD",81592.772512210868,50890.585241730281,{"$f":"OFFSET(F1840,0,Brains!$D$1,1,1)","v":50890.585241730281},"PPC Search Specialist","Specialist","Australia","Australia","4 to 6","4 to 6 hours a day","0-5 yrs","50-74.9K",5,5,4,1,10,4]
["ID1422","2012-05-30T01:12:04",49000,49000,"USD",49000,49000,{"$f":"OFFSET(F1841,0,Brains!$D$1,1,1)","v":49000},"Clinical Data Specialist","Specialist","USA","USA","4 to 6","4 to 6 hours a day","0-5 yrs","30-49.9K",5,5,4,1,10,3]
["ID0560","2012-05-26T05:55:22",54000,54000,"USD",54000,54000,{"$f":"OFFSET(F1842,0,Brains!$D$1,1,1)","v":54000},"IT Specialist","Specialist","USA","USA","All 8","All the 8 hours baby, all the 8!","0-5 yrs","50-74.9K",8,5,5,1,10,4]
["ID1243","2012-05-29T04:11:58","Â£30000",30000,"GBP",47285.348162018527,44510.385756676558,{"$f":"OFFSET(F1843,0,Brains!$D$1,1,1)","v":44510.385756676558},"Infection Prevention Surveillance Specialist","Specialist","UK","UK","4 to 6","4 to 6 hours a day","11-20 yrs","30-49.9K",5,14,4,3,10,3]
["ID0588","2012-05-26T07:57:04",106000,106000,"AUD",108110.42357867939,67430.025445292616,{"$f":"OFFSET(F1844,0,Brains!$D$1,1,1)","v":67430.025445292616},"Pricing and Strategy Specialist","Specialist","Australia","Australia","4 to 6","4 to 6 hours a day","11-20 yrs","50-74.9K",5,16,4,3,10,4]
["ID0683","2012-05-26T13:08:39",52000,52000,"USD",52000,52000,{"$f":"OFFSET(F1845,0,Brains!$D$1,1,1)","v":52000},"Maint Sys Support Specialist","Specialist","USA","USA","4 to 6","4 to 6 hours a day","11-20 yrs","50-74.9K",5,18,4,3,10,4]
["ID1421","2012-05-30T01:05:26",45000,45000,"USD",45000,45000,{"$f":"OFFSET(F1846,0,Brains!$D$1,1,1)","v":45000},"Technical Support Specialist","Specialist","USA","USA","4 to 6","4 to 6 hours a day","11-20 yrs","30-49.9K",5,20,4,3,10,3]
["ID1682","2012-06-05T06:51:36","Â£40000",40000,"GBP",63047.130882691366,59347.181008902073,{"$f":"OFFSET(F1847,0,Brains!$D$1,1,1)","v":59347.181008902073},"Technical Specialist","Specialist","UK","UK","2 to 3","2 to 3 hours per day","21-30 yrs","50-74.9K",2.5,25,3,4,10,4]
["ID1391","2012-05-29T21:54:33",62000,62000,"USD",62000,62000,{"$f":"OFFSET(F1848,0,Brains!$D$1,1,1)","v":62000},"Measurement Specialist","Specialist","USA","USA","All 8","All the 8 hours baby, all the 8!","21-30 yrs","50-74.9K",8,25,5,4,10,4]
["ID0755","2012-05-26T16:34:57","Â£ 24000",24000,"GBP",37828.278529614821,35608.308605341248,{"$f":"OFFSET(F1849,0,Brains!$D$1,1,1)","v":35608.308605341248},"Business Support Specialist","Specialist","UK","UK","All 8","All the 8 hours baby, all the 8!","6-10 yrs","30-49.9K",8,8,5,2,10,3]
["ID1011","2012-05-28T11:31:20",18000,18000,"USD",18000,18000,{"$f":"OFFSET(F1850,0,Brains!$D$1,1,1)","v":18000},"Data Specialist","Specialist","India","India","All 8","All the 8 hours baby, all the 8!","6-10 yrs","15-29.9K",8,8,5,2,10,2]
["ID1873","2012-06-16T05:23:03",38666,38666,"USD",38666,38666,{"$f":"OFFSET(F1851,0,Brains!$D$1,1,1)","v":38666},"Actuarial Specialist","Specialist","South Africa","South Africa","All 8","All the 8 hours baby, all the 8!","6-10 yrs","30-49.9K",8,10,5,2,10,3]
["ID1468","2012-05-30T15:59:01","Rs 10,00,000",1000000,"INR",17807.916687442568,49795.837068021116,{"$f":"OFFSET(F1852,0,Brains!$D$1,1,1)","v":49795.837068021116},"Marketing Specialist","Specialist","India","India","2 to 3","2 to 3 hours per day","6-10 yrs","30-49.9K",2.5,7,3,2,10,3]
["ID1295","2012-05-29T13:13:56",12500,12500,"USD",12500,12500,{"$f":"OFFSET(F1853,0,Brains!$D$1,1,1)","v":12500},"Specialist","Specialist","Philippines","Philippines","2 to 3","2 to 3 hours per day","6-10 yrs","0-14.9K",2.5,7,3,2,10,1]
["ID0583","2012-05-26T07:37:53",50000,50000,"USD",50000,50000,{"$f":"OFFSET(F1854,0,Brains!$D$1,1,1)","v":50000},"IT Specialist","Specialist","USA","USA","2 to 3","2 to 3 hours per day","6-10 yrs","50-74.9K",2.5,10,3,2,10,4]
["ID1496","2012-05-30T21:19:31",45000,45000,"USD",45000,45000,{"$f":"OFFSET(F1855,0,Brains!$D$1,1,1)","v":45000},"Data Specialist","Specialist","USA","USA","2 to 3","2 to 3 hours per day","6-10 yrs","30-49.9K",2.5,10,3,2,10,3]
["ID1399","2012-05-29T22:32:16",20000,20000,"USD",20000,20000,{"$f":"OFFSET(F1856,0,Brains!$D$1,1,1)","v":20000},"Business Operation Specialist","Specialist","India","India","4 to 6","4 to 6 hours a day","6-10 yrs","15-29.9K",5,6,4,2,10,2]
["ID0833","2012-05-26T23:15:18","65000 ron",65000,"RON",18499.860539512854,29411.764705882353,{"$f":"OFFSET(F1857,0,Brains!$D$1,1,1)","v":29411.764705882353},"HR Planning Specialist","Specialist","Romania","Romania","4 to 6","4 to 6 hours a day","6-10 yrs","15-29.9K",5,6,4,2,10,2]
["ID1218","2012-05-29T00:36:21",74000,74000,"USD",74000,74000,{"$f":"OFFSET(F1858,0,Brains!$D$1,1,1)","v":74000},"marketing specialist","Specialist","USA","USA","4 to 6","4 to 6 hours a day","6-10 yrs",{"$f":"IF(H1858<15000,\"0-14.9K\",IF(H1858<30000,\"15-29.9K\",IF(H1858<50000,\"30-49.9K\",IF(H1858<75000,\"50-74.9K\",IF(H1858<100000,\"75-99.9K\",IF(H1858<150000,\"100-149.9K\",IF(H1858<250000,\"150-249.9K\",\"250K+\")))))))","v":"50-74.9K"},5,10,4,2,10,{"$f":"IF(H1858<15000,1,IF(H1858<30000,2,IF(H1858<50000,3,IF(H1858<75000,4,IF(H1858<100000,5,IF(H1858<150000,6,IF(H1858<250000,7,8)))))))","v":4}]
["ID0704","2012-05-26T13:49:54",35000,35000,"USD",35000,35000,{"$f":"OFFSET(F1859,0,Brains!$D$1,1,1)","v":35000},"IT Specialist","Specialist","USA","USA","4 to 6","4 to 6 hours a day","6-10 yrs","30-49.9K",5,10,4,2,10,3]
["ID1380","2012-05-29T21:27:23",36000,36000,"USD",36000,36000,{"$f":"OFFSET(F1860,0,Brains!$D$1,1,1)","v":36000},"Data Specialist","Specialist","USA","USA","All 8","All the 8 hours baby, all the 8!","6-10 yrs","30-49.9K",8,8,5,2,10,3]
["ID0532","2012-05-26T05:07:30",140000,140000,"GBP",220664.95808941979,207715.13353115725,{"$f":"OFFSET(F1861,0,Brains!$D$1,1,1)","v":207715.13353115725},"vba specialist","Specialist","UK","UK","All 8","All the 8 hours baby, all the 8!",null,"150-249.9K",8,null,5,null,10,7]
["ID0075","2012-05-25T23:03:00",59450,59450,"CAD",58460.842544152933,47598.078462770209,{"$f":"OFFSET(F1862,0,Brains!$D$1,1,1)","v":47598.078462770209},"Process Improvement Specialist","Specialist","Canada","Canada","All 8","All the 8 hours baby, all the 8!",null,"30-49.9K",8,null,5,null,10,3]
["ID0240","2012-05-26T01:02:16","1000 â‚¬",12000,"EUR",15244.793267899293,15074.392125137554,{"$f":"OFFSET(F1863,0,Brains!$D$1,1,1)","v":15074.392125137554},"HR Specialist","Specialist","Portugal","Portugal","All 8","All the 8 hours baby, all the 8!",null,"15-29.9K",8,null,5,null,10,2]
["ID0557","2012-05-26T05:50:23",60000,60000,"USD",60000,60000,{"$f":"OFFSET(F1864,0,Brains!$D$1,1,1)","v":60000},"Marketing Specialist","Specialist","USA","USA","1 or 2","1 or 2 hours a day",null,"50-74.9K",1.5,null,2,null,10,4]
["ID0228","2012-05-26T00:58:10",45000,45000,"CAD",44251.268536364711,36028.823058446753,{"$f":"OFFSET(F1865,0,Brains!$D$1,1,1)","v":36028.823058446753},"Technical support specialist","Specialist","Canada","Canada","1 or 2","1 or 2 hours a day",null,"30-49.9K",1.5,null,2,null,10,3]
["ID0271","2012-05-26T01:09:34",7600,7600,"USD",7600,7600,{"$f":"OFFSET(F1866,0,Brains!$D$1,1,1)","v":7600},"DP specialist","Specialist","Ukraine","Ukraine","1 or 2","1 or 2 hours a day",null,"0-14.9K",1.5,null,2,null,10,1]
["ID0194","2012-05-26T00:51:59",96000,96000,"USD",96000,96000,{"$f":"OFFSET(F1867,0,Brains!$D$1,1,1)","v":96000},"Business Process Specialist","Specialist","USA","USA","2 to 3","2 to 3 hours per day",null,"75-99.9K",2.5,null,3,null,10,5]
["ID0011","2012-05-25T03:43:45","â‚¬ 51650",51650,"EUR",65616.131023916547,64882.69610527956,{"$f":"OFFSET(F1868,0,Brains!$D$1,1,1)","v":64882.69610527956},"Training Specialist","Specialist","Ireland","Ireland","2 to 3","2 to 3 hours per day",null,"50-74.9K",2.5,null,3,null,10,4]
["ID0231","2012-05-26T00:59:03",65000,65000,"USD",65000,65000,{"$f":"OFFSET(F1869,0,Brains!$D$1,1,1)","v":65000},"Sr. Strategic Development Specialist","Specialist","USA","USA","2 to 3","2 to 3 hours per day",null,"50-74.9K",2.5,null,3,null,10,4]
["ID0299","2012-05-26T01:20:46",31000,31000,"USD",31000,31000,{"$f":"OFFSET(F1870,0,Brains!$D$1,1,1)","v":31000},"Support Specialist ","Specialist","USA","USA","2 to 3","2 to 3 hours per day",null,"30-49.9K",2.5,null,3,null,10,3]
["ID0394","2012-05-26T02:02:02","99147 $",99147,"USD",99147,99147,{"$f":"OFFSET(F1871,0,Brains!$D$1,1,1)","v":99147},"Chief Specialist of Economics & Planning","Specialist","Russia","Russia","4 to 6","4 to 6 hours a day",null,"75-99.9K",5,null,4,null,10,5]
["ID0102","2012-05-26T00:40:46",90000,90000,"USD",90000,90000,{"$f":"OFFSET(F1872,0,Brains!$D$1,1,1)","v":90000},"Product Specialist","Specialist","USA","USA","4 to 6","4 to 6 hours a day",null,"75-99.9K",5,null,4,null,10,5]
["ID0263","2012-05-26T01:08:04",73000,73000,"USD",73000,73000,{"$f":"OFFSET(F1873,0,Brains!$D$1,1,1)","v":73000},"Sr. Global marketing Specialist","Specialist","USA","USA","4 to 6","4 to 6 hours a day",null,"50-74.9K",5,null,4,null,10,4]
["ID0112","2012-05-26T00:41:22",50000,50000,"USD",50000,50000,{"$f":"OFFSET(F1874,0,Brains!$D$1,1,1)","v":50000},"Transportation Specialist","Specialist","USA","USA","4 to 6","4 to 6 hours a day",null,"50-74.9K",5,null,4,null,10,4]
["ID0123","2012-05-26T00:41:56",50000,50000,"USD",50000,50000,{"$f":"OFFSET(F1875,0,Brains!$D$1,1,1)","v":50000},"Information Systems Specialist","Specialist","USA","USA","4 to 6","4 to 6 hours a day",null,"50-74.9K",5,null,4,null,10,4]
["ID0326","2012-05-26T01:30:12",47000,47000,"USD",47000,47000,{"$f":"OFFSET(F1876,0,Brains!$D$1,1,1)","v":47000},"Sourcing Specialist","Specialist","USA","USA","4 to 6","4 to 6 hours a day",null,"30-49.9K",5,null,4,null,10,3]
["ID0338","2012-05-26T01:34:56",45000,45000,"USD",45000,45000,{"$f":"OFFSET(F1877,0,Brains!$D$1,1,1)","v":45000},"QC Fabrication Inspector","Specialist","USA","USA","4 to 6","4 to 6 hours a day",null,"30-49.9K",5,null,4,null,10,3]
["ID0060","2012-05-25T07:00:52",41000,41000,"USD",41000,41000,{"$f":"OFFSET(F1878,0,Brains!$D$1,1,1)","v":41000},"Specialist","Specialist","USA","USA","4 to 6","4 to 6 hours a day",null,"30-49.9K",5,null,4,null,10,3]
["ID0284","2012-05-26T01:15:12","36000 $",36000,"USD",36000,36000,{"$f":"OFFSET(F1879,0,Brains!$D$1,1,1)","v":36000},"Senior Specialist","Specialist","Russia","Russia","4 to 6","4 to 6 hours a day",null,"30-49.9K",5,null,4,null,10,3]
["ID0474","2012-05-26T03:15:50",20000,20000,"USD",20000,20000,{"$f":"OFFSET(F1880,0,Brains!$D$1,1,1)","v":20000},"Specialist","Specialist","India","India","4 to 6","4 to 6 hours a day",null,"15-29.9K",5,null,4,null,10,2]
["ID0032","2012-05-25T04:57:06","360000 INR",360000,"INR",6410.8500074793246,17926.501344487599,{"$f":"OFFSET(F1881,0,Brains!$D$1,1,1)","v":17926.501344487599},"Specialist","Specialist","India","India","4 to 6","4 to 6 hours a day",null,"15-29.9K",5,null,4,null,10,2]
["ID0467","2012-05-26T03:11:21","5250 $",5250,"USD",5250,5250,{"$f":"OFFSET(F1882,0,Brains!$D$1,1,1)","v":5250},"Treasure Specialist","Specialist","Republic of Georgia","Republic of Georgia","4 to 6","4 to 6 hours a day",null,"0-14.9K",5,null,4,null,10,1]
["ID0318","2012-05-26T01:27:03",400000,400000,"USD",400000,400000,{"$f":"OFFSET(F1883,0,Brains!$D$1,1,1)","v":400000},"Financial Specialist","Specialist","USA","USA","All 8","All the 8 hours baby, all the 8!",null,"250K+",8,null,5,null,10,8]
["ID0177","2012-05-26T00:49:21",75000,75000,"USD",75000,75000,{"$f":"OFFSET(F1884,0,Brains!$D$1,1,1)","v":75000},"Informatics specialist","Specialist","USA","USA","All 8","All the 8 hours baby, all the 8!",null,"75-99.9K",8,null,5,null,10,5]

{"sheet":"Reference","index":1,"n_rows":105,"n_cols":22,"rows_kept":105,"cut":false,"hidden":false,"merged":[]}
["Named Lists",null,null,null,null,null,null,null,null,null,null,"Country Data"]
["JobType","Country","Hours","Experience","Salary","Fields","Fields1","CountryAll","Rank","Type Range","Fields2","Country","Avg Salary","Rank1","Rank ppp","Avg Hours","Rank","Avg Exp","Rank","Common Job","Participants","Rank"]
["Accountant","Albania","Excel??","0-5 yrs","0-14.9K","Country","JobType","All",1,"Count","JobType","All",{"$f":"SUM(List1[Selected Salary])/Reference!U3","v":52505.971745271469},null,null,4.8175783324482211,null,6.1373340414232613,null,"Analyst",1883]
["Analyst","Arabian Gulf","1 or 2","6-10 yrs","15-29.9K","JobType","Hours","Albania",2,"Percentage","Hours","Albania",{"$f":"SUMIF(List1[clean Country],Reference!L4,List1[Selected Salary])/Reference!U4","v":20571},61,67,5,40,8,29,"CXO or Top Mgmt.",1,57]
["Consultant","Argentina","2 to 3","11-20 yrs","30-49.9K","Hours","Experience","Arabian Gulf",3,null,"Experience","Arabian Gulf",{"$f":"SUMIF(List1[clean Country],Reference!L5,List1[Selected Salary])/Reference!U5","v":21000},60,64,1.5,99,0,92,"Analyst",1,58]
["Controller","Armenia","4 to 6","21-30 yrs","50-74.9K","Experience","Salary","Argentina",4,null,null,"Argentina",{"$f":"SUMIF(List1[clean Country],Reference!L6,List1[Selected Salary])/Reference!U6","v":24000},57,60,5,41,21,1,"Manager",1,59]
["CXO or Top Mgmt.","Aruba","All 8","31-40 yrs","75-99.9K","Salary",null,"Armenia",5,null,"Fields3","Armenia",{"$f":"SUMIF(List1[clean Country],Reference!L7,List1[Selected Salary])/Reference!U7","v":6000},95,96,8,1,5,60,"Reporting",1,60]
["Engineer","Asia",null,null,"100-149.9K",null,null,"Aruba",6,null,"Hours","Aruba",{"$f":"SUMIF(List1[clean Country],Reference!L8,List1[Selected Salary])/Reference!U8","v":5000},98,99,1.5,100,13,11,"Consultant",1,61]
["Manager","Australia",null,null,"150-249.9K",null,null,"Asia",7,null,"Experience","Asia",{"$f":"SUMIF(List1[clean Country],Reference!L9,List1[Selected Salary])/Reference!U9","v":12000},82,86,8,2,3,77,"Manager",1,62]
["Misc.","Austria",null,null,"250K+",null,null,"Australia",8,null,"Salary","Australia",{"$f":"SUMIF(List1[clean Country],Reference!L10,List1[Selected Salary])/Reference!U10","v":60028.558037256924},8,24,4.1728395061728394,77,9.5,22,"Analyst",81,4]
["Reporting","Azerbaijan",null,null,null,null,null,"Austria",9,null,null,"Austria",{"$f":"SUMIF(List1[clean Country],Reference!L11,List1[Selected Salary])/Reference!U11","v":50247.973750458514},30,31,5,42,20,2,"Manager",1,63]
["Specialist","Baltic",null,null,null,null,null,"Azerbaijan",10,null,null,"Azerbaijan",{"$f":"SUMIF(List1[clean Country],Reference!L12,List1[Selected Salary])/Reference!U12","v":36000},42,45,5,43,5,61,"Consultant",1,64]
[null,"Bangladesh",null,null,null,null,null,"Baltic",11,null,null,"Baltic",{"$f":"SUMIF(List1[clean Country],Reference!L13,List1[Selected Salary])/Reference!U13","v":8400},93,94,8,3,0.3,91,"Analyst",1,65]
[null,"Belgium",null,null,null,null,null,"Bangladesh",12,null,null,"Bangladesh",{"$f":"SUMIF(List1[clean Country],Reference!L14,List1[Selected Salary])/Reference!U14","v":23468.633673033502},89,62,2,97,6,48,"Analyst",2,46]
[null,"Bermuda",null,null,null,null,null,"Belgium",13,null,null,"Belgium",{"$f":"SUMIF(List1[clean Country],Reference!L15,List1[Selected Salary])/Reference!U15","v":41241.024455688828},40,41,3.5,85,7.875,36,"Analyst",4,34]
[null,"Bhutan",null,null,null,null,null,"Bermuda",14,null,null,"Bermuda",{"$f":"SUMIF(List1[clean Country],Reference!L16,List1[Selected Salary])/Reference!U16","v":78000},14,11,5,44,0,93,"Accountant",1,66]
[null,"Bolivia",null,null,null,null,null,"Bhutan",15,null,null,"Bhutan",{"$f":"SUMIF(List1[clean Country],Reference!L17,List1[Selected Salary])/Reference!U17","v":4800},99,100,5,45,2,81,"Analyst",1,67]
[null,"Brazil",null,null,null,null,null,"Bolivia",16,null,null,"Bolivia",{"$f":"SUMIF(List1[clean Country],Reference!L18,List1[Selected Salary])/Reference!U18","v":9600},91,93,8,4,2,82,"Analyst",1,68]
[null,"Bulgaria",null,null,null,null,null,"Brazil",17,null,null,"Brazil",{"$f":"SUMIF(List1[clean Country],Reference!L19,List1[Selected Salary])/Reference!U19","v":43374.281914893618},38,36,5.6749999999999998,27,4,68,"Analyst",20,8]
[null,"Cambodia",null,null,null,null,null,"Bulgaria",18,null,null,"Bulgaria",{"$f":"SUMIF(List1[clean Country],Reference!L20,List1[Selected Salary])/Reference!U20","v":14400},74,81,8,5,15,9,"Analyst",1,69]
[null,"Canada",null,null,null,null,null,"Cambodia",19,null,null,"Cambodia",{"$f":"SUMIF(List1[clean Country],Reference!L21,List1[Selected Salary])/Reference!U21","v":3000},101,102,2.5,91,2,83,"Consultant",1,70]
[null,"CEE",null,null,null,null,null,"Canada",20,null,null,"Canada",{"$f":"SUMIF(List1[clean Country],Reference!L22,List1[Selected Salary])/Reference!U22","v":74417.255145690273},9,15,4.5517241379310347,71,3.6206896551724137,72,"Analyst",58,5]
[null,"Central America",null,null,null,null,null,"CEE",21,null,null,"CEE",{"$f":"SUMIF(List1[clean Country],Reference!L23,List1[Selected Salary])/Reference!U23","v":86528.970469265827},10,9,5.25,30,20,3,"Manager",2,47]
[null,"China",null,null,null,null,null,"Central America",22,null,null,"Central America",{"$f":"SUMIF(List1[clean Country],Reference!L24,List1[Selected Salary])/Reference!U24","v":95000},7,6,2.5,92,0,94,"CXO or Top Mgmt.",1,71]
[null,"Colombia",null,null,null,null,null,"China",23,null,null,"China",{"$f":"SUMIF(List1[clean Country],Reference!L25,List1[Selected Salary])/Reference!U25","v":20826.097215667767},70,65,5,46,8,30,"Accountant",2,48]
[null,"Costa Rica",null,null,null,null,null,"Colombia",24,null,null,"Colombia",{"$f":"SUMIF(List1[clean Country],Reference!L26,List1[Selected Salary])/Reference!U26","v":12362},81,85,4.8,66,5.6,57,"Analyst",5,28]
[null,"Croatia",null,null,null,null,null,"Costa Rica",25,null,null,"Costa Rica",{"$f":"SUMIF(List1[clean Country],Reference!L27,List1[Selected Salary])/Reference!U27","v":35591.712215584084},53,48,8,6,0,95,"Analyst",1,72]
[null,"Czech Republic",null,null,null,null,null,"Croatia",26,null,null,"Croatia",{"$f":"SUMIF(List1[clean Country],Reference!L28,List1[Selected Salary])/Reference!U28","v":43148.784250275108},36,37,4,81,2.6666666666666665,80,"Manager",3,39]
[null,"Denmark",null,null,null,null,null,"Czech Republic",27,null,null,"Czech Republic",{"$f":"SUMIF(List1[clean Country],Reference!L29,List1[Selected Salary])/Reference!U29","v":36000},43,46,2.5,93,9,26,"Controller",1,73]
[null,"Dominican Republic",null,null,null,null,null,"Denmark",28,null,null,"Denmark",{"$f":"SUMIF(List1[clean Country],Reference!L30,List1[Selected Salary])/Reference!U30","v":62446.005065622834},12,22,4.083333333333333,79,17,6,"Analyst",6,23]
[null,"Dubai",null,null,null,null,null,"Dominican Republic",29,null,null,"Dominican Republic",{"$f":"SUMIF(List1[clean Country],Reference!L31,List1[Selected Salary])/Reference!U31","v":15694.823539121822},87,78,8,7,1.5,87,"Analyst",2,49]
[null,"Egypt",null,null,null,null,null,"Dubai",30,null,null,"Dubai",{"$f":"SUMIF(List1[clean Country],Reference!L32,List1[Selected Salary])/Reference!U32","v":24890.49508692366},49,56,3.25,89,4.75,66,"Accountant",4,35]
[null,"Estonia",null,null,null,null,null,"Egypt",31,null,null,"Egypt",{"$f":"SUMIF(List1[clean Country],Reference!L33,List1[Selected Salary])/Reference!U33","v":41753.653444676405},64,39,8,8,5,62,"Analyst",1,74]
[null,"Ethiopia",null,null,null,null,null,"Estonia",32,null,null,"Estonia",{"$f":"SUMIF(List1[clean Country],Reference!L34,List1[Selected Salary])/Reference!U34","v":12000},83,87,8,9,0,96,"Analyst",1,75]
[null,"Europe",null,null,null,null,null,"Ethiopia",33,null,null,"Ethiopia",{"$f":"SUMIF(List1[clean Country],Reference!L35,List1[Selected Salary])/Reference!U35","v":7454.1821296031976},102,95,5,47,3,78,"Reporting",1,76]
[null,"Finland",null,null,null,null,null,"Europe",34,null,null,"Europe",{"$f":"SUMIF(List1[clean Country],Reference!L36,List1[Selected Salary])/Reference!U36","v":122504.56000361787},3,2,3.3,88,13.4,10,"Controller",5,29]
[null,"France",null,null,null,null,null,"Finland",35,null,null,"Finland",{"$f":"SUMIF(List1[clean Country],Reference!L37,List1[Selected Salary])/Reference!U37","v":74770.29138799978},16,14,5.833333333333333,25,3,79,"Analyst",3,40]
[null,"Germany",null,null,null,null,null,"France",36,null,null,"France",{"$f":"SUMIF(List1[clean Country],Reference!L38,List1[Selected Salary])/Reference!U38","v":56405.548046275035},25,26,5.083333333333333,39,3.5,74,"Manager",6,24]
[null,"Ghana",null,null,null,null,null,"Germany",37,null,null,"Germany",{"$f":"SUMIF(List1[clean Country],Reference!L39,List1[Selected Salary])/Reference!U39","v":78891.642018065031},13,10,4.3235294117647056,74,5.7058823529411766,54,"Manager",17,11]
[null,"Greece",null,null,null,null,null,"Ghana",38,null,null,"Ghana",{"$f":"SUMIF(List1[clean Country],Reference!L40,List1[Selected Salary])/Reference!U40","v":18000},66,73,5,48,12,13,"Manager",1,77]
[null,"Guyana",null,null,null,null,null,"Greece",39,null,null,"Greece",{"$f":"SUMIF(List1[clean Country],Reference!L41,List1[Selected Salary])/Reference!U41","v":29730.051135687954},51,54,4.833333333333333,64,9.3333333333333339,24,"Manager",3,41]
[null,"Hong Kong",null,null,null,null,null,"Guyana",40,null,null,"Guyana",{"$f":"SUMIF(List1[clean Country],Reference!L42,List1[Selected Salary])/Reference!U42","v":6000},96,97,1.5,101,20,4,"Manager",1,78]
[null,"Hungary",null,null,null,null,null,"Hong Kong",41,null,null,"Hong Kong",{"$f":"SUMIF(List1[clean Country],Reference!L43,List1[Selected Salary])/Reference!U43","v":20000},62,68,1.5,102,1,89,"Analyst",1,79]
[null,"Iceland",null,null,null,null,null,"Hungary",42,null,null,"Hungary",{"$f":"SUMIF(List1[clean Country],Reference!L44,List1[Selected Salary])/Reference!U44","v":24612.212267540312},56,58,5.0999999999999996,35,3.6,73,"Manager",5,30]
[null,"India",null,null,null,null,null,"Iceland",43,null,null,"Iceland",{"$f":"SUMIF(List1[clean Country],Reference!L45,List1[Selected Salary])/Reference!U45","v":41731},39,40,8,10,0,97,"Analyst",1,80]
[null,"Indonesia",null,null,null,null,null,"India",44,null,null,"India",{"$f":"SUMIF(List1[clean Country],Reference!L46,List1[Selected Salary])/Reference!U46","v":29754.287140599659},76,53,4.861946902654867,62,5.4615929203539828,58,"Manager",565,2]
[null,"Iran",null,null,null,null,null,"Indonesia",45,null,null,"Indonesia",{"$f":"SUMIF(List1[clean Country],Reference!L47,List1[Selected Salary])/Reference!U47","v":29073.944791785889},52,55,3.3125,87,7.875,37,"Analyst",8,20]
[null,"Ireland",null,null,null,null,null,"Iran",46,null,null,"Iran",{"$f":"SUMIF(List1[clean Country],Reference!L48,List1[Selected Salary])/Reference!U48","v":18000},67,74,3.3333333333333335,86,11,16,"Accountant",3,42]
[null,"Israel",null,null,null,null,null,"Ireland",47,null,null,"Ireland",{"$f":"SUMIF(List1[clean Country],Reference!L49,List1[Selected Salary])/Reference!U49","v":60963.354152743799},24,23,4.0999999999999996,78,7.2,42,"Analyst",5,31]
[null,"Italy",null,null,null,null,null,"Israel",48,null,null,"Israel",{"$f":"SUMIF(List1[clean Country],Reference!L50,List1[Selected Salary])/Reference!U50","v":66840},23,19,5.0999999999999996,36,4.2,67,"Manager",5,32]
[null,"Japan",null,null,null,null,null,"Italy",49,null,null,"Italy",{"$f":"SUMIF(List1[clean Country],Reference!L51,List1[Selected Salary])/Reference!U51","v":46730.615587926419},33,33,5.583333333333333,28,11.666666666666666,14,"Analyst",6,25]
[null,"Kenya",null,null,null,null,null,"Japan",50,null,null,"Japan",{"$f":"SUMIF(List1[clean Country],Reference!L52,List1[Selected Salary])/Reference!U52","v":63499.518768046197},21,20,5.166666666666667,32,3.3333333333333335,76,"Analyst",3,43]
[null,"Kuwait",null,null,null,null,null,"Kenya",51,null,null,"Kenya",{"$f":"SUMIF(List1[clean Country],Reference!L53,List1[Selected Salary])/Reference!U53","v":92227.179135209342},29,8,5,49,9,27,"Manager",1,81]
[null,"Latin America",null,null,null,null,null,"Kuwait",52,null,null,"Kuwait",{"$f":"SUMIF(List1[clean Country],Reference!L54,List1[Selected Salary])/Reference!U54","v":35900},44,47,5.125,34,10.25,18,"Analyst",4,36]
[null,"Lesotho",null,null,null,null,null,"Latin America",53,null,null,"Latin America",{"$f":"SUMIF(List1[clean Country],Reference!L55,List1[Selected Salary])/Reference!U55","v":4400},100,101,2.5,94,5,63,"Manager",1,82]
[null,"Libya",null,null,null,null,null,"Lesotho",54,null,null,"Lesotho",{"$f":"SUMIF(List1[clean Country],Reference!L56,List1[Selected Salary])/Reference!U56","v":177600},1,1,5,50,6,49,"Accountant",1,83]
[null,"Lithuania",null,null,null,null,null,"Libya",55,null,null,"Libya",{"$f":"SUMIF(List1[clean Country],Reference!L57,List1[Selected Salary])/Reference!U57","v":24864},55,57,8,11,8,31,"Manager",1,84]
[null,"Malaysia",null,null,null,null,null,"Lithuania",56,null,null,"Lithuania",{"$f":"SUMIF(List1[clean Country],Reference!L58,List1[Selected Salary])/Reference!U58","v":15000},73,80,5,51,2,84,"Accountant",1,85]
[null,"Mauritius",null,null,null,null,null,"Malaysia",57,null,null,"Malaysia",{"$f":"SUMIF(List1[clean Country],Reference!L59,List1[Selected Salary])/Reference!U59","v":31622.974963181154},54,52,4.0714285714285712,80,7.7142857142857144,38,"Manager",7,21]
[null,"Mexico",null,null,null,null,null,"Mauritius",58,null,null,"Mauritius",{"$f":"SUMIF(List1[clean Country],Reference!L60,List1[Selected Salary])/Reference!U60","v":16628.175519630484},92,76,5,52,7,43,"Engineer",1,86]
[null,"Mongolia",null,null,null,null,null,"Mexico",59,null,null,"Mexico",{"$f":"SUMIF(List1[clean Country],Reference!L61,List1[Selected Salary])/Reference!U61","v":32717.280910917616},50,50,6.5,19,3.7,71,"Analyst",10,16]
[null,"Montenegro",null,null,null,null,null,"Mongolia",60,null,null,"Mongolia",{"$f":"SUMIF(List1[clean Country],Reference!L62,List1[Selected Salary])/Reference!U62","v":10432.16322858065},94,91,8,12,2,85,"Analyst",1,87]
[null,"Morocco",null,null,null,null,null,"Montenegro",61,null,null,"Montenegro",{"$f":"SUMIF(List1[clean Country],Reference!L63,List1[Selected Salary])/Reference!U63","v":13500},77,82,5,53,13,12,"Manager",1,88]
[null,"Mozambique",null,null,null,null,null,"Morocco",62,null,null,"Morocco",{"$f":"SUMIF(List1[clean Country],Reference!L64,List1[Selected Salary])/Reference!U64","v":24096.385542168671},75,59,8,13,8,32,"Controller",1,89]
[null,"Myanmar",null,null,null,null,null,"Mozambique",63,null,null,"Mozambique",{"$f":"SUMIF(List1[clean Country],Reference!L65,List1[Selected Salary])/Reference!U65","v":24000},58,61,2.5,95,0,98,"Engineer",1,90]
[null,"MYS",null,null,null,null,null,"Myanmar",64,null,null,"Myanmar",{"$f":"SUMIF(List1[clean Country],Reference!L66,List1[Selected Salary])/Reference!U66","v":17700},68,75,3.25,90,10,19,"Manager",2,50]
[null,"Netherlands",null,null,null,null,null,"MYS",65,null,null,"MYS",{"$f":"SUMIF(List1[clean Country],Reference!L67,List1[Selected Salary])/Reference!U67","v":12000},84,88,2.5,96,0,99,"Analyst",1,91]
[null,"New Zealand",null,null,null,null,null,"Netherlands",66,null,null,"Netherlands",{"$f":"SUMIF(List1[clean Country],Reference!L68,List1[Selected Salary])/Reference!U68","v":72190.390009479408},17,18,4.7173913043478262,68,8.1304347826086953,28,"Analyst",23,7]
[null,"Nigeria",null,null,null,null,null,"New Zealand",67,null,null,"New Zealand",{"$f":"SUMIF(List1[clean Country],Reference!L69,List1[Selected Salary])/Reference!U69","v":55312.077294685987},20,28,5.0999999999999996,37,10.933333333333334,17,"Analyst",15,12]
[null,"Norway",null,null,null,null,null,"Nigeria",68,null,null,"Nigeria",{"$f":"SUMIF(List1[clean Country],Reference!L70,List1[Selected Salary])/Reference!U70","v":18278.543327372263},78,71,5.166666666666667,33,5.666666666666667,55,"Manager",3,44]
[null,"Oman",null,null,null,null,null,"Norway",69,null,null,"Norway",{"$f":"SUMIF(List1[clean Country],Reference!L71,List1[Selected Salary])/Reference!U71","v":94671.228669948774},6,7,5,54,6.1428571428571432,47,"Manager",7,22]
[null,"Pakistan",null,null,null,null,null,"Oman",70,null,null,"Oman",{"$f":"SUMIF(List1[clean Country],Reference!L72,List1[Selected Salary])/Reference!U72","v":100800},4,4,5,55,4,69,"CXO or Top Mgmt.",1,92]
[null,"Panama",null,null,null,null,null,"Pakistan",71,null,null,"Pakistan",{"$f":"SUMIF(List1[clean Country],Reference!L73,List1[Selected Salary])/Reference!U73","v":15501.782653181977},85,79,5.2586206896551726,29,5.931034482758621,53,"Manager",29,6]
[null,"Paraguay",null,null,null,null,null,"Panama",72,null,null,"Panama",{"$f":"SUMIF(List1[clean Country],Reference!L74,List1[Selected Salary])/Reference!U74","v":44404.983594036574},35,35,5.25,31,0,100,"Analyst",2,51]
[null,"Peru",null,null,null,null,null,"Paraguay",73,null,null,"Paraguay",{"$f":"SUMIF(List1[clean Country],Reference!L75,List1[Selected Salary])/Reference!U75","v":20000},63,69,8,14,6,50,"Reporting",1,93]
[null,"Philippines",null,null,null,null,null,"Peru",74,null,null,"Peru",{"$f":"SUMIF(List1[clean Country],Reference!L76,List1[Selected Salary])/Reference!U76","v":15840},72,77,8,15,8,33,"Analyst",1,94]
[null,"Poland",null,null,null,null,null,"Philippines",75,null,null,"Philippines",{"$f":"SUMIF(List1[clean Country],Reference!L77,List1[Selected Salary])/Reference!U77","v":20612.414638321545},69,66,5.0909090909090908,38,7.3636363636363633,40,"Manager",11,14]
[null,"Portugal",null,null,null,null,null,"Poland",76,null,null,"Poland",{"$f":"SUMIF(List1[clean Country],Reference!L78,List1[Selected Salary])/Reference!U78","v":36199.003671830164},47,44,4.666666666666667,69,5,64,"Analyst",6,26]
[null,"Qatar",null,null,null,null,null,"Portugal",77,null,null,"Portugal",{"$f":"SUMIF(List1[clean Country],Reference!L79,List1[Selected Salary])/Reference!U79","v":32589.113274007228},48,51,4.5,72,6.7,44,"Accountant",10,17]
[null,"Republic of Georgia",null,null,null,null,null,"Qatar",78,null,null,"Qatar",{"$f":"SUMIF(List1[clean Country],Reference!L80,List1[Selected Salary])/Reference!U80","v":53066.666666666664},27,30,4.333333333333333,73,15.333333333333334,8,"Accountant",3,45]
[null,"Romania",null,null,null,null,null,"Republic of Georgia",79,null,null,"Republic of Georgia",{"$f":"SUMIF(List1[clean Country],Reference!L81,List1[Selected Salary])/Reference!U81","v":5250},97,98,5,56,0,101,"Specialist",1,95]
[null,"Russia",null,null,null,null,null,"Romania",80,null,null,"Romania",{"$f":"SUMIF(List1[clean Country],Reference!L82,List1[Selected Salary])/Reference!U82","v":18268.627450980392},71,72,4.583333333333333,70,1.8333333333333333,86,"Manager",6,27]
[null,"Saudi Arabia",null,null,null,null,null,"Russia",81,null,null,"Russia",{"$f":"SUMIF(List1[clean Country],Reference!L83,List1[Selected Salary])/Reference!U83","v":55905.222222222219},26,27,6.0555555555555554,22,5.4444444444444446,59,"Analyst",9,19]
[null,"Singapore",null,null,null,null,null,"Saudi Arabia",82,null,null,"Saudi Arabia",{"$f":"SUMIF(List1[clean Country],Reference!L84,List1[Selected Salary])/Reference!U84","v":37475.392009612493},45,42,5.8636363636363633,24,9.1818181818181817,25,"Manager",11,15]
[null,"Slovakia",null,null,null,null,null,"Singapore",83,null,null,"Singapore",{"$f":"SUMIF(List1[clean Country],Reference!L85,List1[Selected Salary])/Reference!U85","v":53344.482885535523},28,29,5.6923076923076925,26,6.1538461538461542,46,"Analyst",13,13]
[null,"Slovenia",null,null,null,null,null,"Slovakia",84,null,null,"Slovakia",{"$f":"SUMIF(List1[clean Country],Reference!L86,List1[Selected Salary])/Reference!U86","v":13000},79,83,8,16,6,51,"Analyst",1,96]
[null,"Somalia",null,null,null,null,null,"Slovenia",85,null,null,"Slovenia",{"$f":"SUMIF(List1[clean Country],Reference!L87,List1[Selected Salary])/Reference!U87","v":18842.990156421944},65,70,5,57,4,70,"Analyst",1,97]
[null,"South Africa",null,null,null,null,null,"Somalia",86,null,null,"Somalia",{"$f":"SUMIF(List1[clean Country],Reference!L88,List1[Selected Salary])/Reference!U88","v":78000},15,12,5,58,0,102,"Manager",1,98]
[null,"Spain",null,null,null,null,null,"South Africa",87,null,null,"South Africa",{"$f":"SUMIF(List1[clean Country],Reference!L89,List1[Selected Salary])/Reference!U89","v":59833.278450003716},31,25,6,23,9.3684210526315788,23,"Analyst",19,9]
[null,"Sri Lanka",null,null,null,null,null,"Spain",88,null,null,"Spain",{"$f":"SUMIF(List1[clean Country],Reference!L90,List1[Selected Salary])/Reference!U90","v":45732.266736343867},34,34,3.85,82,11.2,15,"Analyst",10,18]
[null,"Sweden",null,null,null,null,null,"Sri Lanka",89,null,null,"Sri Lanka",{"$f":"SUMIF(List1[clean Country],Reference!L91,List1[Selected Salary])/Reference!U91","v":23369.088763779793},59,63,6.2,21,7.9,35,"Manager",5,33]
[null,"Switzerland",null,null,null,null,null,"Sweden",90,null,null,"Sweden",{"$f":"SUMIF(List1[clean Country],Reference!L92,List1[Selected Salary])/Reference!U92","v":75343.18901795143},11,13,2,98,10,20,"Consultant",2,52]
[null,"Thailand",null,null,null,null,null,"Switzerland",91,null,null,"Switzerland",{"$f":"SUMIF(List1[clean Country],Reference!L93,List1[Selected Salary])/Reference!U93","v":121789.53771289537},2,3,4.25,75,6.5,45,"Manager",4,37]
[null,"Tunisia",null,null,null,null,null,"Thailand",92,null,null,"Thailand",{"$f":"SUMIF(List1[clean Country],Reference!L94,List1[Selected Salary])/Reference!U94","v":73000},18,16,6.5,20,0.5,90,"Engineer",2,53]
[null,"Turkey",null,null,null,null,null,"Tunisia",93,null,null,"Tunisia",{"$f":"SUMIF(List1[clean Country],Reference!L95,List1[Selected Salary])/Reference!U95","v":11000},88,90,5,59,8,34,"Analyst",1,99]
[null,"UAE",null,null,null,null,null,"Turkey",94,null,null,"Turkey",{"$f":"SUMIF(List1[clean Country],Reference!L96,List1[Selected Salary])/Reference!U96","v":48000},32,32,3.75,83,5,65,"Accountant",2,54]
[null,"Uganda",null,null,null,null,null,"UAE",95,null,null,"UAE",{"$f":"SUMIF(List1[clean Country],Reference!L97,List1[Selected Salary])/Reference!U97","v":42033.370648844335},37,38,4.8157894736842106,65,7.2368421052631575,41,"Manager",19,10]
[null,"UK",null,null,null,null,null,"Uganda",96,null,null,"Uganda",{"$f":"SUMIF(List1[clean Country],Reference!L98,List1[Selected Salary])/Reference!U98","v":100000},5,5,5,60,17,7,"Analyst",1,100]
[null,"Ukraine",null,null,null,null,null,"UK",97,null,null,"UK",{"$f":"SUMIF(List1[clean Country],Reference!L99,List1[Selected Salary])/Reference!U99","v":63474.010559173752},22,21,4.837662337662338,63,7.4837662337662341,39,"Analyst",154,3]
[null,"Uruguay",null,null,null,null,null,"Ukraine",98,null,null,"Ukraine",{"$f":"SUMIF(List1[clean Country],Reference!L100,List1[Selected Salary])/Reference!U100","v":11650},86,89,4.25,76,1.25,88,"Analyst",4,38]
[null,"USA",null,null,null,null,null,"Uruguay",99,null,null,"Uruguay",{"$f":"SUMIF(List1[clean Country],Reference!L101,List1[Selected Salary])/Reference!U101","v":35000},46,49,8,17,10,21,"Manager",1,101]
[null,"Vietnam",null,null,null,null,null,"USA",100,null,null,"USA",{"$f":"SUMIF(List1[clean Country],Reference!L102,List1[Selected Salary])/Reference!U102","v":72701.336569579289},19,17,4.7556634304207117,67,5.6456310679611654,56,"Analyst",618,1]
[null,"Zambia",null,null,null,null,null,"Vietnam",101,null,null,"Vietnam",{"$f":"SUMIF(List1[clean Country],Reference!L103,List1[Selected Salary])/Reference!U103","v":10000},90,92,3.75,84,6,52,"Accountant",2,55]
[null,"Zimbabwe",null,null,null,null,null,"Zambia",102,null,null,"Zambia",{"$f":"SUMIF(List1[clean Country],Reference!L104,List1[Selected Salary])/Reference!U104","v":13000},80,84,8,18,3.5,75,"Accountant",2,56]
[null,null,null,null,null,null,null,"Zimbabwe",null,null,null,"Zimbabwe",{"$f":"SUMIF(List1[clean Country],Reference!L105,List1[Selected Salary])/Reference!U105","v":36400},41,43,5,61,20,5,"Analyst",1,102]

{"sheet":"Brains","index":2,"n_rows":24,"n_cols":12,"rows_kept":24,"cut":false,"hidden":false,"merged":[]}
["PPP",null,true,{"$f":"--C1","v":1}]
[null,null,{"$f":"Dashboard!$L$17","v":"Percentage"},{"$f":"MATCH($C$2,TypeRange,0)","v":2}]
[{"$f":"G5 & \"- \" &C7&\" vs \"&C10","v":"Salary Earned - India vs All"}]
["Chart 2"]
["Field",1,{"$f":"Dashboard!$L$11","v":"Salary"},{"$f":"COUNTA(INDIRECT(C5))","v":8},{"$f":"CHOOSE(MATCH(C5,Fields1,0),\"$J$2:$J$1884\",\"$M$2:$M$1884\",\"$O$2:$O$1884\",\"$P$2:$P$1884\")","v":"$P$2:$P$1884"},null,{"$f":"CHOOSE(MATCH(C5,Fields1,0),\"Job Title \",\"Hours per Day in Excel \",\"Years of Experience \",\"Salary Earned \")","v":"Salary Earned "}]
["Labels",null,{"$f":"IF(COLUMN()>$D$5+2,\"\",INDEX(INDIRECT($C$5),COLUMN()-2))","v":"0-14.9K"},{"$f":"IF(COLUMN()>$D$5+2,\"\",INDEX(INDIRECT($C$5),COLUMN()-2))","v":"15-29.9K"},"30-49.9K","50-74.9K","75-99.9K","100-149.9K","150-249.9K","250K+","",""]
["Country1",44,{"$f":"Dashboard!$L$13","v":"India"},{"$f":"SUM((Data!$H$2:$H$1884)*(Data!$L$2:$L$1884=C7))","v":16811172.234438807},{"$f":"D7/SUM(C8:L8)","v":29754.287140599659}]
[null,null,{"$f":"IF($C$7=0,\"\",IF(C6=\"\",\"\",IF($C$7=\"All\",COUNTIF(INDIRECT(\"Data!\"&$E$5),C$6),SUM((INDIRECT(\"Data!\"&$E$5)=C$6)*(Data!$L$2:$L$1884=$C$7)))))","v":208},{"$f":"IF($C$7=0,\"\",IF(D6=\"\",\"\",IF($C$7=\"All\",COUNTIF(INDIRECT(\"Data!\"&$E$5),D$6),SUM((INDIRECT(\"Data!\"&$E$5)=D$6)*(Data!$L$2:$L$1884=$C$7)))))","v":201},{"$f":"IF($C$7=0,\"\",IF(E6=\"\",\"\",IF($C$7=\"All\",COUNTIF(INDIRECT(\"Data!\"&$E$5),E$6),SUM((INDIRECT(\"Data!\"&$E$5)=E$6)*(Data!$L$2:$L$1884=$C$7)))))","v":91},{"$f":"IF($C$7=0,\"\",IF(F6=\"\",\"\",IF($C$7=\"All\",COUNTIF(INDIRECT(\"Data!\"&$E$5),F$6),SUM((INDIRECT(\"Data!\"&$E$5)=F$6)*(Data!$L$2:$L$1884=$C$7)))))","v":37},{"$f":"IF($C$7=0,\"\",IF(G6=\"\",\"\",IF($C$7=\"All\",COUNTIF(INDIRECT(\"Data!\"&$E$5),G$6),SUM((INDIRECT(\"Data!\"&$E$5)=G$6)*(Data!$L$2:$L$1884=$C$7)))))","v":9},{"$f":"IF($C$7=0,\"\",IF(H6=\"\",\"\",IF($C$7=\"All\",COUNTIF(INDIRECT(\"Data!\"&$E$5),H$6),SUM((INDIRECT(\"Data!\"&$E$5)=H$6)*(Data!$L$2:$L$1884=$C$7)))))","v":10},{"$f":"IF($C$7=0,\"\",IF(I6=\"\",\"\",IF($C$7=\"All\",COUNTIF(INDIRECT(\"Data!\"&$E$5),I$6),SUM((INDIRECT(\"Data!\"&$E$5)=I$6)*(Data!$L$2:$L$1884=$C$7)))))","v":6},{"$f":"IF($C$7=0,\"\",IF(J6=\"\",\"\",IF($C$7=\"All\",COUNTIF(INDIRECT(\"Data!\"&$E$5),J$6),SUM((INDIRECT(\"Data!\"&$E$5)=J$6)*(Data!$L$2:$L$1884=$C$7)))))","v":3},{"$f":"IF($C$7=0,\"\",IF(K6=\"\",\"\",IF($C$7=\"All\",COUNTIF(INDIRECT(\"Data!\"&$E$5),K$6),SUM((INDIRECT(\"Data!\"&$E$5)=K$6)*(Data!$L$2:$L$1884=$C$7)))))","v":""},{"$f":"IF($C$7=0,\"\",IF(L6=\"\",\"\",IF($C$7=\"All\",COUNTIF(INDIRECT(\"Data!\"&$E$5),L$6),SUM((INDIRECT(\"Data!\"&$E$5)=L$6)*(Data!$L$2:$L$1884=$C$7)))))","v":""}]
[null,null,{"$f":"IF(C8=\"\",\"\",C8/SUM($C$8:$L$8))","v":0.36814159292035398},{"$f":"IF(D8=\"\",\"\",D8/SUM($C$8:$L$8))","v":0.35575221238938054},0.16106194690265488,6.5486725663716813E-2,1.5929203539823009E-2,1.7699115044247787E-2,1.0619469026548672E-2,5.3097345132743362E-3,"",""]
["Country2",1,{"$f":"Dashboard!$L$15","v":"All"}]
[null,null,{"$f":"IF($C$10=0,\"\",IF(C6=\"\",\"\",IF($C$10=\"All\",COUNTIF(INDIRECT(\"Data!\"&$E$5),C$6),SUM((INDIRECT(\"Data!\"&$E$5)=C$6)*(Data!$L$2:$L$1884=$C$10)))))","v":298},{"$f":"IF($C$10=0,\"\",IF(D6=\"\",\"\",IF($C$10=\"All\",COUNTIF(INDIRECT(\"Data!\"&$E$5),D$6),SUM((INDIRECT(\"Data!\"&$E$5)=D$6)*(Data!$L$2:$L$1884=$C$10)))))","v":323},{"$f":"IF($C$10=0,\"\",IF(E6=\"\",\"\",IF($C$10=\"All\",COUNTIF(INDIRECT(\"Data!\"&$E$5),E$6),SUM((INDIRECT(\"Data!\"&$E$5)=E$6)*(Data!$L$2:$L$1884=$C$10)))))","v":426},{"$f":"IF($C$10=0,\"\",IF(F6=\"\",\"\",IF($C$10=\"All\",COUNTIF(INDIRECT(\"Data!\"&$E$5),F$6),SUM((INDIRECT(\"Data!\"&$E$5)=F$6)*(Data!$L$2:$L$1884=$C$10)))))","v":433},{"$f":"IF($C$10=0,\"\",IF(G6=\"\",\"\",IF($C$10=\"All\",COUNTIF(INDIRECT(\"Data!\"&$E$5),G$6),SUM((INDIRECT(\"Data!\"&$E$5)=G$6)*(Data!$L$2:$L$1884=$C$10)))))","v":222},{"$f":"IF($C$10=0,\"\",IF(H6=\"\",\"\",IF($C$10=\"All\",COUNTIF(INDIRECT(\"Data!\"&$E$5),H$6),SUM((INDIRECT(\"Data!\"&$E$5)=H$6)*(Data!$L$2:$L$1884=$C$10)))))","v":130},{"$f":"IF($C$10=0,\"\",IF(I6=\"\",\"\",IF($C$10=\"All\",COUNTIF(INDIRECT(\"Data!\"&$E$5),I$6),SUM((INDIRECT(\"Data!\"&$E$5)=I$6)*(Data!$L$2:$L$1884=$C$10)))))","v":39},{"$f":"IF($C$10=0,\"\",IF(J6=\"\",\"\",IF($C$10=\"All\",COUNTIF(INDIRECT(\"Data!\"&$E$5),J$6),SUM((INDIRECT(\"Data!\"&$E$5)=J$6)*(Data!$L$2:$L$1884=$C$10)))))","v":12},{"$f":"IF($C$10=0,\"\",IF(K6=\"\",\"\",IF($C$10=\"All\",COUNTIF(INDIRECT(\"Data!\"&$E$5),K$6),SUM((INDIRECT(\"Data!\"&$E$5)=K$6)*(Data!$L$2:$L$1884=$C$10)))))","v":""},{"$f":"IF($C$10=0,\"\",IF(L6=\"\",\"\",IF($C$10=\"All\",COUNTIF(INDIRECT(\"Data!\"&$E$5),L$6),SUM((INDIRECT(\"Data!\"&$E$5)=L$6)*(Data!$L$2:$L$1884=$C$10)))))","v":""}]
[null,null,{"$f":"IF(C11=\"\",\"\",C11/SUM($C$11:$L$11))","v":0.15825809877854488},{"$f":"IF(D11=\"\",\"\",D11/SUM($C$11:$L$11))","v":0.17153478491768454},0.22623473181093998,0.2299522039298991,0.11789697291556028,6.9038767923526284E-2,2.0711630377057887E-2,6.3728093467870419E-3,"",""]
[]
["By the Numbers",null,{"$f":"IF(D15=1,B15,IF(D16=1,B16,IF(D17=1,B17,IF(D19=1,B19,B15))))","v":"USA"},{"$f":"Dashboard!P10","v":"USA"}]
[{"$f":"Dashboard!R11","v":17},{"$f":"INDEX(Reference!$L$4:$L$105,MATCH(A15,OFFSET(Reference!$N$4,0,Brains!$D$1,102,1),0))","v":"USA"},null,{"$f":"COUNTIF($B$15:$B$19,B15)","v":4},{"$f":"VLOOKUP(C14,Reference!$L:$V,3+Brains!D1,FALSE)","v":17},{"$f":"VLOOKUP(D14,Reference!$L:$V,3+Brains!D1,FALSE)","v":17}]
[{"$f":"Dashboard!R12","v":67},{"$f":"INDEX(Reference!$L$4:$L$105,MATCH(A16,OFFSET(Reference!$Q$4,0,0,102,1),0))","v":"USA"},null,{"$f":"COUNTIF($B$15:$B$19,B16)","v":4},{"$f":"VLOOKUP(C14,Reference!$L:$V,6,FALSE)","v":67},{"$f":"VLOOKUP(D14,Reference!$L:$V,6,FALSE)","v":67}]
[{"$f":"Dashboard!R13","v":56},{"$f":"INDEX(Reference!$L$4:$L$105,MATCH(A17,OFFSET(Reference!$S$4,0,0,102,1),0))","v":"USA"},null,4,{"$f":"VLOOKUP(C14,Reference!$L:$V,8,FALSE)","v":56},{"$f":"VLOOKUP(D14,Reference!$L:$V,8,FALSE)","v":56}]
[{"$f":"Dashboard!R14","v":0},null,null,0]
[{"$f":"Dashboard!R15","v":1},{"$f":"INDEX(Reference!$L$4:$L$105,MATCH(A19,OFFSET(Reference!$V$4,0,0,102,1),0))","v":"USA"},null,4,{"$f":"VLOOKUP(C14,Reference!$L:$V,11,FALSE)","v":1},{"$f":"VLOOKUP(D14,Reference!$L:$V,11,FALSE)","v":1}]
[{"$f":"\"A Closer Look - \" &C22& \": \"&C23&\"/\"&C24","v":"A Closer Look - UK: JobType/Salary"}]
["Bubble Chart"]
["Country",null,{"$f":"Dashboard!$C$29","v":"UK"}]
["Field 1",null,{"$f":"Dashboard!$C$32","v":"JobType"}]
["Field 2",null,{"$f":"Dashboard!$C$35","v":"Salary"}]

{"sheet":"Dashboard","index":3,"n_rows":35,"n_cols":18,"rows_kept":35,"cut":false,"hidden":false,"merged":[[28,2,28,3],[31,2,31,3],[34,2,34,3],[21,8,22,16],[3,1,4,8]]}
["Excel Salary Summary"]
[]
[]
[null,{"$f":"Brains!A3","v":"Salary Earned - India vs All"}]
[]
[]
[]
[null,null,null,null,null,null,null,null,null,null,null,"Filters",null,null,null,"By the Numbers"]
[]
[null,null,null,null,null,null,null,null,null,null,null,null,null,null,null,"USA","Value","Rank"]
[null,null,null,null,null,null,null,null,null,null,null,"Salary",null,null,null,"Average Salary",{"$f":"VLOOKUP($P$10,Reference!$L:$M,2,FALSE)","v":72701.336569579289},17]
[null,null,null,null,null,null,null,null,null,null,null,null,null,null,null,"Average Hours p/ Day",{"$f":"VLOOKUP($P$10,Reference!$L:$P,5,FALSE)","v":4.7556634304207117},67]
[null,null,null,null,null,null,null,null,null,null,null,"India",null,null,null,"Average Years Exp",{"$f":"VLOOKUP($P$10,Reference!$L:$R,7,FALSE)","v":5.6456310679611654},56]
[null,null,null,null,null,null,null,null,null,null,null,null,null,null,null,"Most Common Job"]
[null,null,null,null,null,null,null,null,null,null,null,"All",null,null,null,"Survey Participants",{"$f":"VLOOKUP($P$10,Reference!$L:$U,10,FALSE)","v":618},1]
[]
[null,null,null,null,null,null,null,null,null,null,null,"Percentage"]
[]
[]
[]
[]
[null,null,null,null,null,null,null,null,{"$f":"Brains!A20","v":"A Closer Look - UK: JobType/Salary"}]
[]
[]
[]
[null,null,"Filters"]
[]
[null,null,"Country:"]
[null,null,"UK"]
[]
[null,null,"X-Axis:"]
[null,null,"JobType"]
[]
[null,null,"Y-Axis:"]
[null,null,"Salary"]