{"text_format":"1","workbook":"xlsx","n_sheets":4,"sheets":["Viz","Calc","Data","xyData"],"not_rendered":{"charts":10,"images":0,"macros":1,"external_links":1,"defined_names":26,"comments":0,"pivot_tables":0},"unopened":[],"bounds":{"document_bytes":16777216,"sheet_cells":100000,"rows_first":2000,"rows_last":500,"rows_between":2000,"halvings":0,"cell_chars":16384,"cell_head_chars":4096},"cells_cut":0,"cells_raw":0,"read":"whole","date_system":"1900"}

{"sheet":"Viz","index":0,"n_rows":48,"n_cols":13,"rows_kept":48,"cut":false,"hidden":false,"merged":[]}
[]
[null,"Clickable",null,"Average Salary in USD",null,null,"Average Years Experience",null,null,null,"Average Excel Hours per Day"]
[]
[]
[null,"Oceana"]
[null,"North America"]
[null,"Europe"]
[null,"Africa"]
[null,"Middle East"]
[null,"South America"]
[null,"Asia"]
[null,"All Regions"]
[null,null,"* South America includes Central America and The Caribbean"]
[]
[]
[null,"Top Mgmt"]
[null,"Controllers"]
[null,"Consultants"]
[null,"Specialists"]
[null,"Engineers"]
[null,"Managers"]
[null,"Analysts"]
[null,"Accountants"]
[null,"Miscellaneous"]
[null,"Reporting"]
[null,"All Jobs"]
[]
[null,"All versus",{"$f":"region_filter&\", \"&job_filter","v":"North America, Analysts"},null,null,null,null,null,null,null,null,null,"Click the names of the regions and job types above to filter the information below"]
[]
[null,"Salary vs Experience",null,null,null,"Salary Distribution (by thousands USD)",null,null,null,"Statistics for "]
[]
[null,"Years Experience",null,null,null,null,null,null,null,{"$f":"C28","v":"North America, Analysts"}]
[null,null,null,null,null,null,null,null,null,"Respondent Count",null,null,{"$f":"SUBTOTAL(3,Table2[Salary in USD])","v":329}]
[null,null,null,null,null,null,null,null,null,"Average Experience",null,null,{"$f":"IFERROR(TEXT(SUBTOTAL(1,Table2[Years of Experience]),\"0.0\")& \" Years\",\"n/a\")","v":"8.8 Years"}]
[null,null,null,null,null,null,null,null,null,"Average Excel/Day",null,null,{"$f":"IFERROR(TEXT(SUBTOTAL(1,Table2[Hours]),\"0.0\")& \" Hours\",\"n/a\")","v":"5.1 Hours"}]
[null,null,null,null,null,null,null,null,null,"Average Salary",null,null,{"$f":"IFERROR(SUBTOTAL(1,Table2[Salary in USD]),\"n/a\")","v":62637.349184293482}]
[null,null,null,null,null,null,null,null,null,"Top Salary",null,null,{"$f":"IFERROR(SUBTOTAL(4,Table2[Salary in USD]),\"n/a\")","v":245840.3807575817}]
[null,null,null,null,null,null,null,null,null,"Bottom Salary",null,null,{"$f":"IFERROR(SUBTOTAL(5,Table2[Salary in USD]),\"n/a\")","v":10000}]
[]
[null,null,null,null,null,"Experience Distribution (by years)",null,null,null,"Excel per Day Distribution (by hours)"]
{"$rows_left_out":9}
{"sheet":"Calc","index":1,"n_rows":78,"n_cols":10,"rows_kept":78,"cut":false,"hidden":false,"merged":[]}
[]
[null,null,null,"Salary","Hours",null,"Experience",null,"Salary","Hours"]
[null,"Region","n","avg","avg","exp n","avg",null,"median","median"]
[null,"Oceana",{"$f":"COUNTIF(Data!$C$2:$C$1884,$B4)","v":96},{"$f":"SUMIF(Data!$C$2:$C$1884,$B4,Data!$D$2:$D$1884)/C4","v":89331.05565369704},{"$f":"SUMIF(Data!$C$2:$C$1884,$B4,Data!$E$2:$E$1884)/C4","v":4.317708333333333},{"$f":"COUNTIFS(Data!$C$2:$C$1884,$B4,Data!$F$2:$F$1884,\">0\")","v":89},{"$f":"SUMIF(Data!$C$2:$C$1884,$B4,Data!$F$2:$F$1884)/F4","v":10.488764044943821},null,{"$f":"MEDIAN(IF(Data!$C$2:$C$1884=$B4,Data!$D$2:$D$1884))","v":86692.320794224041},{"$f":"MEDIAN(IF(Data!$C$2:$C$1884=$B4,Data!$E$2:$E$1884))","v":5}]
[null,"North America",{"$f":"COUNTIF(Data!$C$2:$C$1884,$B5)","v":677},{"$f":"SUMIF(Data!$C$2:$C$1884,$B5,Data!$D$2:$D$1884)/C5","v":72539.906429461393},{"$f":"SUMIF(Data!$C$2:$C$1884,$B5,Data!$E$2:$E$1884)/C5","v":4.738552437223043},{"$f":"COUNTIFS(Data!$C$2:$C$1884,$B5,Data!$F$2:$F$1884,\">0\")","v":362},{"$f":"SUMIF(Data!$C$2:$C$1884,$B5,Data!$F$2:$F$1884)/F5","v":10.218232044198896},null,{"$f":"MEDIAN(IF(Data!$C$2:$C$1884=$B5,Data!$D$2:$D$1884))","v":65000},{"$f":"MEDIAN(IF(Data!$C$2:$C$1884=$B5,Data!$E$2:$E$1884))","v":5}]
[null,"Europe",{"$f":"COUNTIF(Data!$C$2:$C$1884,$B6)","v":313},{"$f":"SUMIF(Data!$C$2:$C$1884,$B6,Data!$D$2:$D$1884)/C6","v":63084.83295606621},{"$f":"SUMIF(Data!$C$2:$C$1884,$B6,Data!$E$2:$E$1884)/C6","v":4.7539936102236418},{"$f":"COUNTIFS(Data!$C$2:$C$1884,$B6,Data!$F$2:$F$1884,\">0\")","v":224},{"$f":"SUMIF(Data!$C$2:$C$1884,$B6,Data!$F$2:$F$1884)/F6","v":10.345089285714286},null,{"$f":"MEDIAN(IF(Data!$C$2:$C$1884=$B6,Data!$D$2:$D$1884))","v":53590.061250287661},{"$f":"MEDIAN(IF(Data!$C$2:$C$1884=$B6,Data!$E$2:$E$1884))","v":5}]
[null,"Africa",{"$f":"COUNTIF(Data!$C$2:$C$1884,$B7)","v":37},{"$f":"SUMIF(Data!$C$2:$C$1884,$B7,Data!$D$2:$D$1884)/C7","v":42575.940660978296},{"$f":"SUMIF(Data!$C$2:$C$1884,$B7,Data!$E$2:$E$1884)/C7","v":5.8648648648648649},{"$f":"COUNTIFS(Data!$C$2:$C$1884,$B7,Data!$F$2:$F$1884,\">0\")","v":31},{"$f":"SUMIF(Data!$C$2:$C$1884,$B7,Data!$F$2:$F$1884)/F7","v":9.8387096774193541},null,{"$f":"MEDIAN(IF(Data!$C$2:$C$1884=$B7,Data!$D$2:$D$1884))","v":24864},{"$f":"MEDIAN(IF(Data!$C$2:$C$1884=$B7,Data!$E$2:$E$1884))","v":5}]
[null,"Middle East",{"$f":"COUNTIF(Data!$C$2:$C$1884,$B8)","v":51},{"$f":"SUMIF(Data!$C$2:$C$1884,$B8,Data!$D$2:$D$1884)/C8","v":42213.809288841891},{"$f":"SUMIF(Data!$C$2:$C$1884,$B8,Data!$E$2:$E$1884)/C8","v":4.7941176470588234},{"$f":"COUNTIFS(Data!$C$2:$C$1884,$B8,Data!$F$2:$F$1884,\">0\")","v":39},{"$f":"SUMIF(Data!$C$2:$C$1884,$B8,Data!$F$2:$F$1884)/F8","v":10.320512820512821},null,{"$f":"MEDIAN(IF(Data!$C$2:$C$1884=$B8,Data!$D$2:$D$1884))","v":36000},{"$f":"MEDIAN(IF(Data!$C$2:$C$1884=$B8,Data!$E$2:$E$1884))","v":5}]
[null,"South America",{"$f":"COUNTIF(Data!$C$2:$C$1884,$B9)","v":49},{"$f":"SUMIF(Data!$C$2:$C$1884,$B9,Data!$D$2:$D$1884)/C9","v":32472.217927323851},{"$f":"SUMIF(Data!$C$2:$C$1884,$B9,Data!$E$2:$E$1884)/C9","v":5.7551020408163263},{"$f":"COUNTIFS(Data!$C$2:$C$1884,$B9,Data!$F$2:$F$1884,\">0\")","v":28},{"$f":"SUMIF(Data!$C$2:$C$1884,$B9,Data!$F$2:$F$1884)/F9","v":8.3214285714285712},null,{"$f":"MEDIAN(IF(Data!$C$2:$C$1884=$B9,Data!$D$2:$D$1884))","v":19200},{"$f":"MEDIAN(IF(Data!$C$2:$C$1884=$B9,Data!$E$2:$E$1884))","v":8}]
[null,"Asia",{"$f":"COUNTIF(Data!$C$2:$C$1884,$B10)","v":660},{"$f":"SUMIF(Data!$C$2:$C$1884,$B10,Data!$D$2:$D$1884)/C10","v":15067.277491071964},{"$f":"SUMIF(Data!$C$2:$C$1884,$B10,Data!$E$2:$E$1884)/C10","v":4.875},{"$f":"COUNTIFS(Data!$C$2:$C$1884,$B10,Data!$F$2:$F$1884,\">0\")","v":550},{"$f":"SUMIF(Data!$C$2:$C$1884,$B10,Data!$F$2:$F$1884)/F10","v":6.6659999999999995},null,{"$f":"MEDIAN(IF(Data!$C$2:$C$1884=$B10,Data!$D$2:$D$1884))","v":9616.275011218986},{"$f":"MEDIAN(IF(Data!$C$2:$C$1884=$B10,Data!$E$2:$E$1884))","v":0}]
[null,"All",{"$f":"COUNTA(Data!$C$2:$C$1884)","v":1883},{"$f":"SUM(Data!$D$2:$D$1884)/C11","v":49227.087950866866},{"$f":"SUM(Data!$E$2:$E$1884)/C11","v":4.8175783324482211},{"$f":"COUNTIF(Data!$F$2:$F$1884,\">0\")","v":1323},{"$f":"SUM(Data!$F$2:$F$1884)/F11","v":8.7351473922902496}]
[]
[null,null,null,"Salary","Hours","Experience","Experience",null,"Salary","Hours"]
[null,"Region","n","avg","avg","exp n","avg",null,"median","median"]
[null,"Top Mgmt",{"$f":"COUNTIF(Data!$B$2:$B$1884,$B15)","v":75},{"$f":"SUMIF(Data!$B$2:$B$1884,$B15,Data!$D$2:$D$1884)/C15","v":97265.875618660837},{"$f":"SUMIF(Data!$B$2:$B$1884,$B15,Data!$E$2:$E$1884)/C15","v":4.24},{"$f":"COUNTIFS(Data!$B$2:$B$1884,$B15,Data!$F$2:$F$1884,\">0\")","v":47},{"$f":"SUMIF(Data!$B$2:$B$1884,$B15,Data!$F$2:$F$1884)/F15","v":13.414893617021276},null,{"$f":"MEDIAN(IF(Data!$B$2:$B$1884=$B15,Data!$D$2:$D$1884))","v":95000},{"$f":"MEDIAN(IF(Data!$B$2:$B$1884=$B15,Data!$E$2:$E$1884))","v":5}]
[null,"Controllers",{"$f":"COUNTIF(Data!$B$2:$B$1884,$B16)","v":67},{"$f":"SUMIF(Data!$B$2:$B$1884,$B16,Data!$D$2:$D$1884)/C16","v":65103.929025765538},{"$f":"SUMIF(Data!$B$2:$B$1884,$B16,Data!$E$2:$E$1884)/C16","v":4.9626865671641793},{"$f":"COUNTIFS(Data!$B$2:$B$1884,$B16,Data!$F$2:$F$1884,\">0\")","v":55},{"$f":"SUMIF(Data!$B$2:$B$1884,$B16,Data!$F$2:$F$1884)/F16","v":11.8},null,{"$f":"MEDIAN(IF(Data!$B$2:$B$1884=$B16,Data!$D$2:$D$1884))","v":57167.974754622352},{"$f":"MEDIAN(IF(Data!$B$2:$B$1884=$B16,Data!$E$2:$E$1884))","v":5}]
[null,"Consultants",{"$f":"COUNTIF(Data!$B$2:$B$1884,$B17)","v":90},{"$f":"SUMIF(Data!$B$2:$B$1884,$B17,Data!$D$2:$D$1884)/C17","v":62950.733221147333},{"$f":"SUMIF(Data!$B$2:$B$1884,$B17,Data!$E$2:$E$1884)/C17","v":4.6444444444444448},{"$f":"COUNTIFS(Data!$B$2:$B$1884,$B17,Data!$F$2:$F$1884,\">0\")","v":56},{"$f":"SUMIF(Data!$B$2:$B$1884,$B17,Data!$F$2:$F$1884)/F17","v":9.5535714285714288},null,{"$f":"MEDIAN(IF(Data!$B$2:$B$1884=$B17,Data!$D$2:$D$1884))","v":54847.710583168722},{"$f":"MEDIAN(IF(Data!$B$2:$B$1884=$B17,Data!$E$2:$E$1884))","v":5}]
[null,"Specialists",{"$f":"COUNTIF(Data!$B$2:$B$1884,$B18)","v":51},{"$f":"SUMIF(Data!$B$2:$B$1884,$B18,Data!$D$2:$D$1884)/C18","v":59812.969274133829},{"$f":"SUMIF(Data!$B$2:$B$1884,$B18,Data!$E$2:$E$1884)/C18","v":4.8431372549019605},{"$f":"COUNTIFS(Data!$B$2:$B$1884,$B18,Data!$F$2:$F$1884,\">0\")","v":27},{"$f":"SUMIF(Data!$B$2:$B$1884,$B18,Data!$F$2:$F$1884)/F18","v":9.2592592592592595},null,{"$f":"MEDIAN(IF(Data!$B$2:$B$1884=$B18,Data!$D$2:$D$1884))","v":49000},{"$f":"MEDIAN(IF(Data!$B$2:$B$1884=$B18,Data!$E$2:$E$1884))","v":5}]
[null,"Engineers",{"$f":"COUNTIF(Data!$B$2:$B$1884,$B19)","v":74},{"$f":"SUMIF(Data!$B$2:$B$1884,$B19,Data!$D$2:$D$1884)/C19","v":51715.151424567106},{"$f":"SUMIF(Data!$B$2:$B$1884,$B19,Data!$E$2:$E$1884)/C19","v":3.7837837837837838},{"$f":"COUNTIFS(Data!$B$2:$B$1884,$B19,Data!$F$2:$F$1884,\">0\")","v":49},{"$f":"SUMIF(Data!$B$2:$B$1884,$B19,Data!$F$2:$F$1884)/F19","v":7.9387755102040813},null,{"$f":"MEDIAN(IF(Data!$B$2:$B$1884=$B19,Data!$D$2:$D$1884))","v":49430.763217042899},{"$f":"MEDIAN(IF(Data!$B$2:$B$1884=$B19,Data!$E$2:$E$1884))","v":2.5}]
[null,"Managers",{"$f":"COUNTIF(Data!$B$2:$B$1884,$B20)","v":558},{"$f":"SUMIF(Data!$B$2:$B$1884,$B20,Data!$D$2:$D$1884)/C20","v":46488.240712802522},{"$f":"SUMIF(Data!$B$2:$B$1884,$B20,Data!$E$2:$E$1884)/C20","v":4.422043010752688},{"$f":"COUNTIFS(Data!$B$2:$B$1884,$B20,Data!$F$2:$F$1884,\">0\")","v":389},{"$f":"SUMIF(Data!$B$2:$B$1884,$B20,Data!$F$2:$F$1884)/F20","v":10.002827763496144},null,{"$f":"MEDIAN(IF(Data!$B$2:$B$1884=$B20,Data!$D$2:$D$1884))","v":40000},{"$f":"MEDIAN(IF(Data!$B$2:$B$1884=$B20,Data!$E$2:$E$1884))","v":5}]
[null,"Analysts",{"$f":"COUNTIF(Data!$B$2:$B$1884,$B21)","v":743},{"$f":"SUMIF(Data!$B$2:$B$1884,$B21,Data!$D$2:$D$1884)/C21","v":46295.769417049465},{"$f":"SUMIF(Data!$B$2:$B$1884,$B21,Data!$E$2:$E$1884)/C21","v":5.1049798115746974},{"$f":"COUNTIFS(Data!$B$2:$B$1884,$B21,Data!$F$2:$F$1884,\">0\")","v":522},{"$f":"SUMIF(Data!$B$2:$B$1884,$B21,Data!$F$2:$F$1884)/F21","v":7.3890804597701152},null,{"$f":"MEDIAN(IF(Data!$B$2:$B$1884=$B21,Data!$D$2:$D$1884))","v":45000},{"$f":"MEDIAN(IF(Data!$B$2:$B$1884=$B21,Data!$E$2:$E$1884))","v":5}]
[null,"Accountants",{"$f":"COUNTIF(Data!$B$2:$B$1884,$B22)","v":135},{"$f":"SUMIF(Data!$B$2:$B$1884,$B22,Data!$D$2:$D$1884)/C22","v":46001.75981283158},{"$f":"SUMIF(Data!$B$2:$B$1884,$B22,Data!$E$2:$E$1884)/C22","v":5.1333333333333337},{"$f":"COUNTIFS(Data!$B$2:$B$1884,$B22,Data!$F$2:$F$1884,\">0\")","v":101},{"$f":"SUMIF(Data!$B$2:$B$1884,$B22,Data!$F$2:$F$1884)/F22","v":9.3366336633663369},null,{"$f":"MEDIAN(IF(Data!$B$2:$B$1884=$B22,Data!$D$2:$D$1884))","v":45000},{"$f":"MEDIAN(IF(Data!$B$2:$B$1884=$B22,Data!$E$2:$E$1884))","v":5}]
[null,"Miscellaneous",{"$f":"COUNTIF(Data!$B$2:$B$1884,$B23)","v":7},{"$f":"SUMIF(Data!$B$2:$B$1884,$B23,Data!$D$2:$D$1884)/C23","v":45952.334217962794},{"$f":"SUMIF(Data!$B$2:$B$1884,$B23,Data!$E$2:$E$1884)/C23","v":4.0714285714285712},{"$f":"COUNTIFS(Data!$B$2:$B$1884,$B23,Data!$F$2:$F$1884,\">0\")","v":6},{"$f":"SUMIF(Data!$B$2:$B$1884,$B23,Data!$F$2:$F$1884)/F23","v":6.166666666666667},null,{"$f":"MEDIAN(IF(Data!$B$2:$B$1884=$B23,Data!$D$2:$D$1884))","v":41712.231189497601},{"$f":"MEDIAN(IF(Data!$B$2:$B$1884=$B23,Data!$E$2:$E$1884))","v":5}]
[null,"Reporting",{"$f":"COUNTIF(Data!$B$2:$B$1884,$B24)","v":83},{"$f":"SUMIF(Data!$B$2:$B$1884,$B24,Data!$D$2:$D$1884)/C24","v":19574.158532349131},{"$f":"SUMIF(Data!$B$2:$B$1884,$B24,Data!$E$2:$E$1884)/C24","v":5.9518072289156629},{"$f":"COUNTIFS(Data!$B$2:$B$1884,$B24,Data!$F$2:$F$1884,\">0\")","v":71},{"$f":"SUMIF(Data!$B$2:$B$1884,$B24,Data!$F$2:$F$1884)/F24","v":5.2802816901408445},null,{"$f":"MEDIAN(IF(Data!$B$2:$B$1884=$B24,Data!$D$2:$D$1884))","v":7123.1666749770275},{"$f":"MEDIAN(IF(Data!$B$2:$B$1884=$B24,Data!$E$2:$E$1884))","v":5}]
[null,"All",{"$f":"COUNTA(Data!$C$2:$C$1884)","v":1883},{"$f":"SUM(Data!$D$2:$D$1884)/C25","v":49227.087950866866},{"$f":"SUM(Data!$E$2:$E$1884)/C25","v":4.8175783324482211},{"$f":"COUNTIF(Data!$F$2:$F$1884,\">0\")","v":1323},{"$f":"SUM(Data!$F$2:$F$1884)/F11","v":8.7351473922902496}]
[]
[]
[null,"Region Filter","North America"]
[null,"Job Filter","Analysts"]
[]
[]
[null,"Hours"]
[null,null,null,"Filtered",null,"Unfiltered"]
[null,"Bin","Name","Count","%","Count","%",null,"Hour Translation Table"]
[null,"Excel ?!? What Excel?","Excel, what Excel?",{"$f":"SUMPRODUCT(SUBTOTAL(3,OFFSET(Data!$I$2:$I$1884,ROW(Data!$I$2:$I$1884)-ROW(Data!$I$2),0,1)),--(Data!$I$2:$I$1884=B35))","v":3},{"$f":"D35/$D$40","v":9.11854103343465E-3},{"$f":"COUNTIF(Table2[How many hours of a day you work on Excel],B35)","v":7},{"$f":"F35/$F$40","v":3.7174721189591076E-3},null,"1 or 2 hours a day",1.5]
[null,"1 or 2 hours a day","1 or 2 hours a day",{"$f":"SUMPRODUCT(SUBTOTAL(3,OFFSET(Data!$I$2:$I$1884,ROW(Data!$I$2:$I$1884)-ROW(Data!$I$2),0,1)),--(Data!$I$2:$I$1884=B36))","v":19},{"$f":"D36/$D$40","v":5.7750759878419454E-2},{"$f":"COUNTIF(Table2[How many hours of a day you work on Excel],B36)","v":174},9.2405735528412108E-2,null,"2 to 3 hours per day",2.5]
[null,"2 to 3 hours per day","2 to 3 hours a day",{"$f":"SUMPRODUCT(SUBTOTAL(3,OFFSET(Data!$I$2:$I$1884,ROW(Data!$I$2:$I$1884)-ROW(Data!$I$2),0,1)),--(Data!$I$2:$I$1884=B37))","v":61},{"$f":"D37/$D$40","v":0.18541033434650456},{"$f":"COUNTIF(Table2[How many hours of a day you work on Excel],B37)","v":451},0.23951141795007966,null,"4 to 6 hours a day",5]
[null,"4 to 6 hours a day","4 to 6 hours a day",{"$f":"SUMPRODUCT(SUBTOTAL(3,OFFSET(Data!$I$2:$I$1884,ROW(Data!$I$2:$I$1884)-ROW(Data!$I$2),0,1)),--(Data!$I$2:$I$1884=B38))","v":162},{"$f":"D38/$D$40","v":0.49240121580547114},{"$f":"COUNTIF(Table2[How many hours of a day you work on Excel],B38)","v":775},0.4115772703133298,null,"All the 8 hours baby, all the 8!",8]
[null,"All the 8 hours baby, all the 8!","All the 8 hours baby!",{"$f":"SUMPRODUCT(SUBTOTAL(3,OFFSET(Data!$I$2:$I$1884,ROW(Data!$I$2:$I$1884)-ROW(Data!$I$2),0,1)),--(Data!$I$2:$I$1884=B39))","v":84},{"$f":"D39/$D$40","v":0.25531914893617019},{"$f":"COUNTIF(Table2[How many hours of a day you work on Excel],B39)","v":476},{"$f":"F39/$F$40","v":0.25278810408921931},null,"Excel ?!? What Excel?",0]
[null,null,null,{"$f":"SUM(D35:D39)","v":329},{"$f":"D40/$D$40","v":1},{"$f":"SUM(F35:F39)","v":1883},{"$f":"F40/$F$40","v":1}]
{"$rows_left_out":39}
{"sheet":"Data","index":2,"n_rows":1884,"n_cols":9,"rows_kept":1884,"cut":false,"hidden":false,"merged":[]}
["Unique ID","Job Type","Region 2","Salary in USD","Hours","Years of Experience","clean Country","Your Job Title","How many hours of a day you work on Excel"]
["ID0001","Analysts","Asia",5846,{"$f":"VLOOKUP(I2,Calc!$I$35:$J$39,2,FALSE)","v":5},null,"India","MIS Analyst","4 to 6 hours a day"]
["ID0002","Controllers","Europe",15000,{"$f":"VLOOKUP(I3,Calc!$I$35:$J$39,2,FALSE)","v":8},null,"Croatia","cost control","All the 8 hours baby, all the 8!"]
["ID0003","Analysts","North America",58000,{"$f":"VLOOKUP(I4,Calc!$I$35:$J$39,2,FALSE)","v":8},null,"USA","Financial Analyst","All the 8 hours baby, all the 8!"]
["ID0004","Controllers","Asia",48000,{"$f":"VLOOKUP(I5,Calc!$I$35:$J$39,2,FALSE)","v":2.5},null,"Pakistan","Quality Control","2 to 3 hours per day"]
["ID0005","Engineers","North America",54000,{"$f":"VLOOKUP(I6,Calc!$I$35:$J$39,2,FALSE)","v":8},null,"USA","Quality Engineer","All the 8 hours baby, all the 8!"]
["ID0006","Analysts","Europe",41731,{"$f":"VLOOKUP(I7,Calc!$I$35:$J$39,2,FALSE)","v":8},null,"Iceland","Analyst","All the 8 hours baby, all the 8!"]
["ID0007","Managers","Europe",184207.91865378313,{"$f":"VLOOKUP(I8,Calc!$I$35:$J$39,2,FALSE)","v":1.5},null,"Germany","senior project manager","1 or 2 hours a day"]
["ID0008","Analysts","Europe",12000,{"$f":"VLOOKUP(I9,Calc!$I$35:$J$39,2,FALSE)","v":8},null,"Ukraine","Assistant SP&A","All the 8 hours baby, all the 8!"]
["ID0009","Top Mgmt","Europe",44000,{"$f":"VLOOKUP(I10,Calc!$I$35:$J$39,2,FALSE)","v":1.5},null,"Portugal","CFO","1 or 2 hours a day"]
["ID0010","Accountants","Asia",12227.430201752599,{"$f":"VLOOKUP(I11,Calc!$I$35:$J$39,2,FALSE)","v":8},null,"Pakistan","Audit Trainee ","All the 8 hours baby, all the 8!"]
["ID0011","Specialists","Europe",65616.131023916547,{"$f":"VLOOKUP(I12,Calc!$I$35:$J$39,2,FALSE)","v":2.5},null,"Ireland","Training Specialist","2 to 3 hours per day"]
["ID0012","Engineers","Europe",14000,{"$f":"VLOOKUP(I13,Calc!$I$35:$J$39,2,FALSE)","v":5},null,"Hungary","quality engineer","4 to 6 hours a day"]
["ID0013","Analysts","Asia",13338.129598894484,{"$f":"VLOOKUP(I14,Calc!$I$35:$J$39,2,FALSE)","v":8},null,"India","Senion Analyst","All the 8 hours baby, all the 8!"]
["ID0014","Analysts","North America",49000,{"$f":"VLOOKUP(I15,Calc!$I$35:$J$39,2,FALSE)","v":8},null,"USA","business analyst","All the 8 hours baby, all the 8!"]
["ID0015","Engineers","North America",85000,{"$f":"VLOOKUP(I16,Calc!$I$35:$J$39,2,FALSE)","v":1.5},null,"USA","Project Engineer","1 or 2 hours a day"]
["ID0016","Engineers","North America",75000,{"$f":"VLOOKUP(I17,Calc!$I$35:$J$39,2,FALSE)","v":8},null,"USA","Sr Project Engineer","All the 8 hours baby, all the 8!"]
["ID0017","Managers","Europe",107000,{"$f":"VLOOKUP(I18,Calc!$I$35:$J$39,2,FALSE)","v":5},null,"Switzerland","Business Development","4 to 6 hours a day"]
["ID0018","Reporting","Africa",45000,{"$f":"VLOOKUP(I19,Calc!$I$35:$J$39,2,FALSE)","v":8},null,"South Africa","Excel Report Writer","All the 8 hours baby, all the 8!"]
["ID0019","Managers","Asia",9794.354178093412,{"$f":"VLOOKUP(I20,Calc!$I$35:$J$39,2,FALSE)","v":2.5},null,"India","AGM","2 to 3 hours per day"]
["ID0020","Managers","Asia",50000,{"$f":"VLOOKUP(I21,Calc!$I$35:$J$39,2,FALSE)","v":1.5},null,"India","GM","1 or 2 hours a day"]
["ID0021","Managers","Asia",13500,{"$f":"VLOOKUP(I22,Calc!$I$35:$J$39,2,FALSE)","v":5},null,"India","DSE Co-ordinator","4 to 6 hours a day"]
["ID0022","Analysts","North America",96000,{"$f":"VLOOKUP(I23,Calc!$I$35:$J$39,2,FALSE)","v":2.5},null,"USA","Analyst","2 to 3 hours per day"]
["ID0023","Managers","Asia",17807.916687442568,{"$f":"VLOOKUP(I24,Calc!$I$35:$J$39,2,FALSE)","v":5},null,"India","Manager","4 to 6 hours a day"]
["ID0024","Top Mgmt","North America",75000,{"$f":"VLOOKUP(I25,Calc!$I$35:$J$39,2,FALSE)","v":5},null,"USA","Marketing Director","4 to 6 hours a day"]
["ID0025","Managers","North America",40000,{"$f":"VLOOKUP(I26,Calc!$I$35:$J$39,2,FALSE)","v":2.5},null,"USA","sales and marketing","2 to 3 hours per day"]
["ID0026","Analysts","North America",60000,{"$f":"VLOOKUP(I27,Calc!$I$35:$J$39,2,FALSE)","v":8},null,"USA","Analyst II","All the 8 hours baby, all the 8!"]
["ID0028","Managers","Europe",41160.941823328096,{"$f":"VLOOKUP(I28,Calc!$I$35:$J$39,2,FALSE)","v":5},null,"Belgium","Project Leader","4 to 6 hours a day"]
["ID0029","Engineers","Asia",16027.125018698311,{"$f":"VLOOKUP(I29,Calc!$I$35:$J$39,2,FALSE)","v":1.5},null,"India","Applications Engineer","1 or 2 hours a day"]
["ID0030","Managers","Asia",10684.750012465542,{"$f":"VLOOKUP(I30,Calc!$I$35:$J$39,2,FALSE)","v":5},null,"India","strategy manager","4 to 6 hours a day"]
["ID0031","Managers","Europe",41000,{"$f":"VLOOKUP(I31,Calc!$I$35:$J$39,2,FALSE)","v":8},null,"Russia","Chief of the department of public budget analisis and forecasting","All the 8 hours baby, all the 8!"]
["ID0032","Specialists","Asia",6410.8500074793246,{"$f":"VLOOKUP(I32,Calc!$I$35:$J$39,2,FALSE)","v":5},null,"India","Specialist","4 to 6 hours a day"]
["ID0033","Analysts","Europe",55166.239522354947,{"$f":"VLOOKUP(I33,Calc!$I$35:$J$39,2,FALSE)","v":8},null,"UK","Management Information Analyst","All the 8 hours baby, all the 8!"]
["ID0035","Analysts","Europe",19200,{"$f":"VLOOKUP(I34,Calc!$I$35:$J$39,2,FALSE)","v":2.5},null,"Poland","Analyst","2 to 3 hours per day"]
["ID0036","Consultants","Asia",8903.9583437212841,{"$f":"VLOOKUP(I35,Calc!$I$35:$J$39,2,FALSE)","v":8},null,"India","Senior Consultant","All the 8 hours baby, all the 8!"]
["ID0037","Managers","North America",150000,{"$f":"VLOOKUP(I36,Calc!$I$35:$J$39,2,FALSE)","v":2.5},null,"USA","Portfolio Manager","2 to 3 hours per day"]
["ID0038","Engineers","North America",69000,{"$f":"VLOOKUP(I37,Calc!$I$35:$J$39,2,FALSE)","v":5},null,"USA","Design Engineer","4 to 6 hours a day"]
["ID0039","Consultants","North America",30000,{"$f":"VLOOKUP(I38,Calc!$I$35:$J$39,2,FALSE)","v":2.5},null,"USA","Academic Advisor","2 to 3 hours per day"]
["ID0040","Managers","Asia",7123.1666749770275,{"$f":"VLOOKUP(I39,Calc!$I$35:$J$39,2,FALSE)","v":5},null,"India","Coordination","4 to 6 hours a day"]
["ID0041","Consultants","Oceana",71393.675948184507,{"$f":"VLOOKUP(I40,Calc!$I$35:$J$39,2,FALSE)","v":2.5},null,"Australia","consultant","2 to 3 hours per day"]
{"$rows_left_out":1845}
{"sheet":"xyData","index":3,"n_rows":1336,"n_cols":2,"rows_kept":1336,"cut":false,"hidden":false,"merged":[]}
["Salary in USD","Years of Experience"]
[54000,5]
[15600,20]
[35000,7]
[188000,20]
[27500,1]
[140000,10]
[69871.969144538423,6]
[45000,2]
[95000,11]
[158085.99674240855,20]
[63807.047488395103,23]
[38000,11]
[90000,6]
[45393.934235537781,27]
[33099.743713412965,10]
[4285,6]
[6000,20]
[22438.012440857987,8]
[90000,15]
[150000,22]
[132588.25533234264,27]
[45000,3]
[50000,10]
[300000,30]
[104030.78495306884,10]
[115000,15]
[70000,3]
[108110.42357867939,16]
[75000,25]
[40414,8]
[65000,3]
[120000,7]
[15092.18020692008,10]
[36000,10]
[63519.971949580387,4]
[108000,7]
[75000,5]
[7123.1666749770275,3]
[50000,25]
{"$rows_left_out":1296}