{"text_format":"1","workbook":"xlsx","n_sheets":8,"sheets":["Result list","Year&Salary","Country&Salary","Number of respondents","Hours&Salary","Position&Salary","Salary as is","start"],"not_rendered":{"charts":12,"images":0,"macros":1,"external_links":0,"defined_names":6,"comments":1,"pivot_tables":3},"unopened":[],"bounds":{"document_bytes":16777216,"sheet_cells":100000,"rows_first":2000,"rows_last":500,"rows_between":2000,"halvings":0,"cell_chars":16384,"cell_head_chars":4096},"cells_cut":0,"cells_raw":0,"read":"whole","date_system":"1900"}

{"sheet":"Result list","index":0,"n_rows":333,"n_cols":36,"rows_kept":333,"cut":false,"hidden":false,"merged":[]}
["CXO or Top Mgmt.",null,null,{"$f":"\"Number of respondents = \"&IFERROR(VLOOKUP(A1,'Number of respondents'!$A$2:$B$11,2,FALSE),'Number of respondents'!B12)&\" of 1 883 (\"&ROUND(IFERROR(VLOOKUP(A1,'Number of respondents'!$A$2:$B$11,2,FALSE),'Number of respondents'!B12)/'Number of respondents'!B12*100,0)&\"%)\"","v":"Number of respondents = 75 of 1 883 (4%)"}]
[]
[]
[]
[]
[]
[]
[]
[]
[]
[]
[]
[]
[]
[]
["Republica Dominicana",null,null,{"$f":"\"Number of respondents = \"&VLOOKUP(A16,'Number of respondents'!$E$2:$F$108,2,FALSE)&\" of 1 883 (\"&ROUND(VLOOKUP(A16,'Number of respondents'!$E$2:$F$108,2,FALSE)/'Number of respondents'!B12*100,0)&\"%)\"","v":"Number of respondents = 1 of 1 883 (0%)"}]
[]
[]
[]
[]
{"$rows_left_out":314}
{"sheet":"Year&Salary","index":1,"n_rows":59,"n_cols":47,"rows_kept":59,"cut":false,"hidden":false,"merged":[]}
[{"$f":"'Result list'!A1","v":"CXO or Top Mgmt."},{"$f":"IF(A1=G1,2,IF(A1=K1,6,IF(A1=O1,10,IF(A1=S1,14,IF(A1=W1,18,IF(A1=AA1,22,IF(A1=AE1,26,IF(A1=AI1,30,IF(A1=AM1,34,IF(A1=AQ1,38,IF(A1=AU1,42,\"FFFF\")))))))))))","v":18},null,"Job Type",null,"Job Type","Accountant",null,null,"Job Type","Analyst",null,null,"Job Type","Consultant",null,null,"Job Type","Controller",null,null,"Job Type","CXO or Top Mgmt.",null,null,"Job Type","Engineer",null,null,"Job Type","Manager",null,null,"Job Type","Misc.",null,null,"Job Type","Reporting",null,null,"Job Type","Specialist",null,null,"Job Type","ALL"]
[null,null,null,"Analyst"]
[{"$f":"IF(INDEX(F:AU,ROW(A3),$B$1-1)=\"\",\"\",INDEX(F:AU,ROW(A3),$B$1-1))","v":"Years of Experience"},{"$f":"INDEX(F:AQ,ROW(A3),2)","v":"Average of Salary in USD"},null,"Controller",null,"Years of Experience","Average of Salary in USD",null,null,"Years of Experience","Average of Salary in USD",null,null,"Years of Experience","Average of Salary in USD",null,null,"Years of Experience","Average of Salary in USD",null,null,"Years of Experience","Average of Salary in USD",null,null,"Years of Experience","Average of Salary in USD",null,null,"Years of Experience","Average of Salary in USD",null,null,"Years of Experience","Average of Salary in USD",null,null,"Years of Experience","Average of Salary in USD",null,null,"Years of Experience","Average of Salary in USD",null,null,"Years of Experience","Average of Salary in USD"]
[{"$f":"IF(INDEX(F:AU,ROW(A4),$B$1-1)=\"\",\"\",INDEX(F:AU,ROW(A4),$B$1-1))","v":1},{"$f":"IF(INDEX(F:AU,ROW(A4),$B$1)=\"\",\"\",INDEX(F:AU,ROW(A4),$B$1))","v":11677.968757790963},null,"Engineer",null,1,59000,null,null,0,18907.322347616006,null,null,0,22311.583337488515,null,null,1,46325,null,null,1,11677.968757790963,null,null,0.5,50000,null,null,0,10043.665011717609,null,null,3,46000,null,null,0.5,10000,null,null,1,69649.615570119451,null,null,0,15497.343738548101]
[{"$f":"IF(INDEX(F:AU,ROW(A5),$B$1-1)=\"\",\"\",INDEX(F:AU,ROW(A5),$B$1-1))","v":2},{"$f":"IF(INDEX(F:AU,ROW(A5),$B$1)=\"\",\"\",INDEX(F:AU,ROW(A5),$B$1))","v":71393.675948184507},null,"Manager",null,1.5,6232.7708406048987,null,null,0.3,15000,null,null,1,24136.873431977026,null,null,2,15867.474707326768,null,null,2,71393.675948184507,null,null,1,24742.666949644354,null,null,0.1,5591.6858398569666,null,null,5,11746.55416812098,null,null,1,8161.5833374885142,null,null,2,80000,null,null,0.1,5591.6858398569666]
[3,75000,null,"CXO or Top Mgmt.",null,2,8451.9535491705865,null,null,0.5,5342.3750062327708,null,null,2,4705.4250037396623,null,null,3,22500,null,null,3,75000,null,null,2,17369.099614371931,null,null,1,19182.40062899897,null,null,9,74461,null,null,2,15989.089590941818,null,null,3,4019,null,null,0.3,15000]
[4,100800,null,"Accountant",null,3,24533.195840550292,null,null,0.6,9000,null,null,3,44829.190154130956,null,null,4,3953.3575046122505,null,null,4,100800,null,null,2.5,4451.9791718606421,null,null,1.1000000000000001,30273.458368652366,null,null,12,41712.231189497601,null,null,2.5,13500,null,null,5,68950.479998278737,null,null,0.5,21780.791668744259]
[4.5,2671.1875031163854,null,"Specialist",null,4,24747.809797278431,null,null,0.8,8903.9583437212841,null,null,4,59765.914362041927,null,null,5,60271.238022800295,null,null,4.5,2671.1875031163854,null,null,3,12883.430564558446,null,null,1.5,39622.614629559714,null,null,null,null,null,null,3,6725.552460935367,null,null,6,19249.930269756427,null,null,0.6,9000]
[5,71668.076151516347,null,"Reporting",null,4.5,36000,null,null,1,32352.622655797641,null,null,5,69000,null,null,7,19350,null,null,5,71668.076151516347,null,null,4,51000,null,null,2,33339.724228646715,null,null,null,null,null,null,3.5,4095.8208381117906,null,null,7,15153.958343721284,null,null,0.8,8903.9583437212841]
[6,76136.361154047961,null,"Consultant",null,5,32122.607260894434,null,null,1.5,46456.281372585123,null,null,6,69677.625601005348,null,null,8,35933.272695696993,null,null,6,76136.361154047961,null,null,5,44626.468226748984,null,null,3,28560.280989879298,null,null,null,null,null,null,4,5572.5279813250918,null,null,8,30609.426176538273,null,null,1,30813.442449504801]
[8,47166.340747675924,null,"Misc.",null,6,68561.028205365641,null,null,1.6,4273.9000049862161,null,null,7,80678.388218823762,null,null,9,68250,null,null,8,47166.340747675924,null,null,6,24796.055558325676,null,null,4,30531.375941664253,null,null,null,null,null,null,4.5,4763.617713890887,null,null,10,48533.2,null,null,1.1000000000000001,30273.458368652366]
[9,44519.791718606422,null,"ALL",null,7,46872.096626957275,null,null,2,28066.413350507519,null,null,8,70100.776752220569,null,null,10,78003.186161792997,null,null,9,44519.791718606422,null,null,7,30630.821764402488,null,null,4.5,11000,null,null,null,null,null,null,5,5475.9895859303215,null,null,14,47285.348162018527,null,null,1.5,41557.113734582294]
[10,105304.94089836419,null,null,null,8,33539.699823390758,null,null,2.4,10150.512511842264,null,null,9,75000,null,null,12,81285.926572774319,null,null,10,105304.94089836419,null,null,8,14400,null,null,4.5999999999999996,18000,null,null,null,null,null,null,5.5,4006.7812546745777,null,null,16,108110.42357867939,null,null,1.6,4273.9000049862161]
[12,35000,null,null,null,9,57000,null,null,2.5,36585.195711482258,null,null,10,63967.689466091098,null,null,13,40300,null,null,12,35000,null,null,9,80000,null,null,5,25193.004005076287,null,null,null,null,null,null,6,22888.226431222265,null,null,18,52000,null,null,2,26333.145395768915]
[15,112914.78450838824,null,null,null,10,49457.179150351556,null,null,3,38545.877505009303,null,null,12,126094.26176538273,null,null,15,73440.407383199883,null,null,15,112914.78450838824,null,null,10,115039.91618934735,null,null,6,38572.935785075897,null,null,null,null,null,null,6.4,6600,null,null,20,45000,null,null,2.4,10150.512511842264]
[17,49138.203388935108,null,null,null,11,38000,null,null,3.5,19910.886810507141,null,null,13,45794.35417809341,null,null,18,82888.5550559455,null,null,17,49138.203388935108,null,null,12,91064.094465822374,null,null,7,27163.811353762496,null,null,null,null,null,null,7,4555.2679845119219,null,null,25,62523.56544134568,null,null,2.5,28696.851104181707]
[18,82623.989714846146,null,null,null,12,123500,null,null,4,32352.569760353177,null,null,14,48073.437298052166,null,null,20,90836.304534454728,null,null,18,82623.989714846146,null,null,13,77000,null,null,7.3,8738,null,null,null,null,null,null,8,31676.084883724481,null,null,null,null,null,null,3,30986.095502658478]
[20,135009.98597479018,null,null,null,14,13102.712501869832,null,null,4.5,21680.791668744259,null,null,15,59645.207449157642,null,null,22,103000,null,null,20,135009.98597479018,null,null,14,79259.985974790194,null,null,8,38756.782472950792,null,null,null,null,null,null,9,7123.1666749770275,null,null,null,null,null,null,3.5,15957.120317408306]
[22,121396.60165456688,null,null,null,15,44024.957619189889,null,null,5,44547.252697059208,null,null,16,101206.40684944032,null,null,23,24000,null,null,22,121396.60165456688,null,null,15,44000,null,null,8.5,17807.916687442568,null,null,null,null,null,null,10,58500,null,null,null,null,null,null,4,30723.669528656406]
[25,135000,null,null,null,16,63000,null,null,5.5,105431.08884729186,null,null,20,141873.42717454553,null,null,25,108887.83284944661,null,null,25,135000,null,null,17,168285.09330643489,null,null,9,25383.367236144524,null,null,null,null,null,null,11,31200,null,null,null,null,null,null,4.5,15530.099742141367]
{"$rows_left_out":40}
{"sheet":"Country&Salary","index":2,"n_rows":286,"n_cols":10,"rows_kept":286,"cut":false,"hidden":false,"merged":[]}
["Job Type","Min of Salary in USD","Max of Salary in USD","Average of Salary in USD (World)",null,null,null,null,null,"Australia"]
["Accountant",1783.166904422254,1229201.9037879086,54196.440581630908,null,null,null,null,null,"Bermuda"]
["Analyst",2136.9500024931081,245840.3807575817,46295.769417049465,null,null,null,null,null,"Canada"]
["Consultant",2564.3400029917298,250000,62950.733221147333,null,null,null,null,null,"china"]
["Controller",2564.3400029917298,228671.89901848941,65103.929025765538,null,null,null,null,null,"Dubai"]
["CXO or Top Mgmt.",2671.1875031163854,300000,97265.875618660837,null,null,null,null,null,"India"]
["Engineer",2671.1875031163854,231119.74856804207,51715.151424567106,null,null,null,null,null,"iran"]
["Manager",1805.7739622442759,400000,46488.240712802522,null,null,null,null,null,"italy"]
["Misc.",2493.1083362419595,90000,45952.334217962794,null,null,null,null,null,"Lesotho"]
["Reporting",1910.5359690238436,254079.88779832155,19574.158532349131,null,null,null,null,null,"Lithuania"]
["Specialist",4019,400000,59812.969274133829,null,null,null,null,null,"Mexico"]
[null,null,null,null,null,null,null,null,null,"Netherlands"]
[null,null,null,null,null,null,null,null,null,"New Zealand"]
[null,"India",null,null,null,null,null,null,null,"Norway"]
["Job Type","clean Country","Min of Salary in USD","Max of Salary in USD","Average of Salary in USD",null,null,null,null,"Pakistan"]
["Accountant","Australia",64254.308353366054,132588.25533234264,92811.778732639854,null,null,null,null,"Philippines"]
["Accountant","Bermuda",78000,78000,78000,null,null,null,null,"Portugal"]
["Accountant","Canada",131770.4440860638,1229201.9037879086,680486.17393698625,null,null,null,null,"Qatar"]
["Accountant","china",15092.18020692008,15092.18020692008,15092.18020692008,null,null,null,null,"Romania"]
["Accountant","Dubai",9146.5655463031271,33500,23289.495605020813,null,null,null,null,"Saudi Arabia"]
{"$rows_left_out":267}
{"sheet":"Number of respondents","index":3,"n_rows":109,"n_cols":15,"rows_kept":109,"cut":false,"hidden":false,"merged":[]}
["Job Type","Count of Unique ID",null,null,"clean Country","Count of Unique ID",null,null,"clean Country","Count of Unique ID",null,null,"Job Type","Average of Salary in USD","Count of Unique ID"]
["Accountant",135,null,null,"USA",617,{"$f":"F2/$F$109","v":0.32766861391396707},null,"USA",617,null,null,"Analyst",46295.769417049465,-743]
["Analyst",743,null,null,"India",565,{"$f":"F3/$F$109","v":0.30005310674455654},null,"India",565,null,null,"Manager",46488.240712802522,-558]
["Consultant",90,null,null,"UK",154,{"$f":"F4/$F$109","v":8.1784386617100371E-2},null,"UK",154,null,null,"Accountant",54196.440581630908,-135]
["Controller",67,null,null,"Australia",81,{"$f":"F5/$F$109","v":4.3016463090812536E-2},null,"Australia",81,null,null,"Consultant",62950.733221147333,-90]
["CXO or Top Mgmt.",75,null,null,"Canada",58,{"$f":"F6/$F$109","v":3.0801911842804036E-2},null,"Canada",58,null,null,"Reporting",19574.158532349131,-83]
["Engineer",74,null,null,"Pakistan",29,{"$f":"F7/$F$109","v":1.5400955921402018E-2},null,"Pakistan",29,null,null,"CXO or Top Mgmt.",97265.875618660837,-75]
["Manager",558,null,null,"Netherlands",23,{"$f":"F8/$F$109","v":1.2214551248008496E-2},null,"Other country",{"$f":"SUM(F8:F108)","v":379},null,null,"Engineer",51715.151424567106,-74]
["Misc.",7,null,null,"South Africa",19,{"$f":"F9/$F$109","v":1.009028146574615E-2},null,null,null,null,null,"Controller",65103.929025765538,-67]
["Reporting",83,null,null,"UAE",19,{"$f":"F10/$F$109","v":1.009028146574615E-2},null,null,null,null,null,"Specialist",59812.969274133829,-51]
["Specialist",51,null,null,"Brazil",17,{"$f":"F11/$F$109","v":9.0281465746149762E-3},null,null,null,null,null,"Misc.",45952.334217962794,-7]
["Grand Total",1883,null,null,"Germany",17,{"$f":"F12/$F$109","v":9.0281465746149762E-3}]
[null,null,null,null,"New Zealand",15,{"$f":"F13/$F$109","v":7.9660116834838028E-3}]
[null,null,null,null,"Singapore",13,{"$f":"F14/$F$109","v":6.9038767923526286E-3}]
[null,null,null,null,"Philippines",11,{"$f":"F15/$F$109","v":5.8417419012214552E-3}]
[null,null,null,null,"Saudi Arabia",11,{"$f":"F16/$F$109","v":5.8417419012214552E-3}]
[null,null,null,null,"Mexico",10,{"$f":"F17/$F$109","v":5.3106744556558685E-3}]
[null,null,null,null,"Portugal",10,{"$f":"F18/$F$109","v":5.3106744556558685E-3}]
[null,null,null,null,"Spain",10,{"$f":"F19/$F$109","v":5.3106744556558685E-3}]
[null,null,null,null,"Russia",9,{"$f":"F20/$F$109","v":4.7796070100902819E-3}]
{"$rows_left_out":90}
{"sheet":"Hours&Salary","index":4,"n_rows":43,"n_cols":7,"rows_kept":43,"cut":false,"hidden":false,"merged":[]}
["Job Type","How many hours of a day you work on Excel","Average of Salary in USD",null,"Job Type","Reporting"]
["Accountant","1 or 2 hours a day",21800.493274571108]
["Accountant","2 to 3 hours per day",37590.173381888562,null,"Row Labels","Average of Average of Salary in USD"]
["Accountant","4 to 6 hours a day",69577.608917447331,null,"1 or 2 hours a day",13071.865628583842]
["Accountant","All the 8 hours baby, all the 8!",49121.802390403333,null,"2 to 3 hours per day",29495.900281211096]
["Analyst","Excel ?!? What Excel?",63090.734110736041,null,"4 to 6 hours a day",17890.784526711308]
["Analyst","1 or 2 hours a day",43819.276613241374,null,"All the 8 hours baby, all the 8!",18372.109624429639]
["Analyst","2 to 3 hours per day",48572.511802634959,null,"Grand Total",19707.665015233972]
["Analyst","4 to 6 hours a day",47705.910945881275]
["Analyst","All the 8 hours baby, all the 8!",42953.141493969306]
["Consultant","1 or 2 hours a day",45623.743608740042]
["Consultant","2 to 3 hours per day",64408.616233495886]
["Consultant","4 to 6 hours a day",62042.014526238476,null,"How many hours of a day you work on Excel","Average of Salary in USD","Count of Unique ID"]
["Consultant","All the 8 hours baby, all the 8!",70732.906092761841,null,"Excel ?!? What Excel?",57493.381507668601,7]
["Controller","1 or 2 hours a day",37497.741410065893,null,"1 or 2 hours a day",49726.375588481365,174]
["Controller","2 to 3 hours per day",77495.728807803403,null,"2 to 3 hours per day",53554.662152255129,451]
["Controller","4 to 6 hours a day",63312.757112221705,null,"4 to 6 hours a day",51423.250796790198,775]
["Controller","All the 8 hours baby, all the 8!",60376.61241065192,null,"All the 8 hours baby, all the 8!",43571.162802818289,476]
["CXO or Top Mgmt.","1 or 2 hours a day",79353.150650823431,null,"Grand Total",49814.598255586934,1883]
["CXO or Top Mgmt.","2 to 3 hours per day",120604.48681611959]
{"$rows_left_out":24}
{"sheet":"Position&Salary","index":5,"n_rows":0,"n_cols":0,"rows_kept":0,"cut":false,"hidden":false,"merged":[]}

{"sheet":"Salary as is","index":6,"n_rows":1884,"n_cols":10,"rows_kept":1884,"cut":false,"hidden":false,"merged":[]}
["Salary in USD","Job Type","clean Country","Country group",null,"Mark","Sum of Salary","Num of resp","Share of resp","Salary levels in USD"]
[1783.166904422254,"Accountant","Pakistan","Pakistan",null,60000,{"$f":"SUMIF(A:A,\"<\"&F2,A:A)","v":30665833.14289337},{"$f":"COUNTIF(A:A,\"<\"&F2)","v":1222},{"$f":"H2/$H$6","v":0.64896441848114705},"up to 60 000"]
[1805.7739622442759,"Manager","Sri Lanka","Other country",null,90000,{"$f":"SUMIFS(A:A,A:A,\"<\"&F3,A:A,\">=\"&F2)","v":27880847.88674793},{"$f":"COUNTIFS(A:A,\"<\"&F3,A:A,\">=\"&F2)","v":387},{"$f":"H3/$H$6","v":0.20552310143388211},"60 001-90 000"]
[1910.5359690238436,"Reporting","Pakistan","Pakistan",null,120000,{"$f":"SUMIFS(A:A,A:A,\"<\"&F4,A:A,\">=\"&F3)","v":16292840.693874966},{"$f":"COUNTIFS(A:A,\"<\"&F4,A:A,\">=\"&F3)","v":162},{"$f":"H4/$H$6","v":8.6032926181625072E-2},"90 001-120 000"]
[2122.8177433598262,"Accountant","Pakistan","Pakistan",null,150000000,{"$f":"SUMIFS(A:A,A:A,\"<\"&F5,A:A,\">=\"&F4)","v":18961366.791754153},{"$f":"COUNTIFS(A:A,\"<\"&F5,A:A,\">=\"&F4)","v":112},{"$f":"H5/$H$6","v":5.9479553903345722E-2},"from 120 001"]
[2136.9500024931081,"Analyst","India","India",null,"Total",{"$f":"SUM(G2:G5)","v":93800888.515270427},{"$f":"COUNT(A:A)","v":1883},{"$f":"H6/$H$6","v":1}]
[2136.9500024931081,"Analyst","India","India"]
[2136.9500024931081,"Accountant","India","India"]
[2136.9500024931081,"Manager","India","India"]
[2136.9500024931081,"Analyst","India","India",null,"Row Labels","Sum of Salary in USD","Count of Job Type","%"]
[2165.2740982270229,"Manager","Pakistan","Pakistan",null,"USA",44879426,617,{"$f":"G11/$G$18","v":0.47845416722991768}]
[2225.989585930321,"Analyst","India","India",null,"India",7644128.4552130885,565,{"$f":"G12/$G$18","v":8.1493134832818392E-2}]
[2225.989585930321,"Analyst","India","India",null,"UK",10355072.437370565,154,0.11039418284065415]
[2400,"Accountant","Pakistan","Pakistan",null,"Australia",7521468.0182482246,81,8.0185466654974905E-2]
[2400,"Analyst","India","India",null,"Canada",5208372.5565332361,58,5.5525833912387093E-2]
[2493.1083362419595,"Accountant","India","India",null,"Pakistan",344333.025016603,29,3.6708929997027414E-3]
[2493.1083362419595,"Misc.","India","India",null,"Other country",17848088.02288866,379,0.19027632152954591]
[2564.3400029917298,"Consultant","India","India",null,"Grand Total",93800888.515270293,1883,1]
[2564.3400029917298,"Manager","India","India"]
[2564.3400029917298,"Analyst","India","India"]
{"$rows_left_out":1865}
{"sheet":"start","index":7,"n_rows":1884,"n_cols":8,"rows_kept":1884,"cut":false,"hidden":false,"merged":[]}
["Unique ID","clean Salary (in local currency)","Currency","Salary in USD","Job Type","clean Country","How many hours of a day you work on Excel","Years of Experience"]
["ID0001",5846,"USD",5846,"Analyst","India","4 to 6 hours a day","n/a"]
["ID0002",15000,"USD",15000,"Controller","Croatia","All the 8 hours baby, all the 8!","n/a"]
["ID0003",58000,"USD",58000,"Analyst","USA","All the 8 hours baby, all the 8!","n/a"]
["ID0004",48000,"USD",48000,"Controller","Pakistan","2 to 3 hours per day","n/a"]
["ID0005",54000,"USD",54000,"Engineer","USA","All the 8 hours baby, all the 8!","n/a"]
["ID0006",41731,"USD",41731,"Analyst","Iceland","All the 8 hours baby, all the 8!","n/a"]
["ID0007",145000,"EUR",184207.91865378313,"Manager","Germany","1 or 2 hours a day","n/a"]
["ID0008",12000,"USD",12000,"Analyst","Ukraine","All the 8 hours baby, all the 8!","n/a"]
["ID0009",44000,"USD",44000,"CXO or Top Mgmt.","Portugal","1 or 2 hours a day","n/a"]
["ID0010",1152000,"PKR",12227.430201752599,"Accountant","Pakistan","All the 8 hours baby, all the 8!","n/a"]
["ID0011",51650,"EUR",65616.131023916547,"Specialist","Ireland","2 to 3 hours per day","n/a"]
["ID0012",14000,"USD",14000,"Engineer","Hungary","4 to 6 hours a day","n/a"]
["ID0013",749000,"INR",13338.129598894484,"Analyst","India","All the 8 hours baby, all the 8!","n/a"]
["ID0014",49000,"USD",49000,"Analyst","USA","All the 8 hours baby, all the 8!","n/a"]
["ID0015",85000,"USD",85000,"Engineer","USA","1 or 2 hours a day","n/a"]
["ID0016",75000,"USD",75000,"Engineer","USA","All the 8 hours baby, all the 8!","n/a"]
["ID0017",107000,"USD",107000,"Manager","Switzerland","4 to 6 hours a day","n/a"]
["ID0018",45000,"USD",45000,"Reporting","South Africa","All the 8 hours baby, all the 8!","n/a"]
["ID0019",550000,"INR",9794.354178093412,"Manager","India","2 to 3 hours per day","n/a"]
{"$rows_left_out":1864}