{"text_format":"1","workbook":"xlsx","n_sheets":9,"sheets":["Contest Rules","2012","2011","2010","Dashboard","DataTab","Pivot","Data_Dump_Agg","StateListAbbrev"],"not_rendered":{"charts":5,"images":22,"macros":1,"external_links":0,"defined_names":3,"comments":0,"pivot_tables":2},"unopened":[],"bounds":{"document_bytes":16777216,"sheet_cells":100000,"rows_first":2000,"rows_last":500,"rows_between":2000,"halvings":0,"cell_chars":16384,"cell_head_chars":4096},"cells_cut":0,"cells_raw":0,"read":"whole","date_system":"1900"}

{"sheet":"Contest Rules","index":0,"n_rows":49,"n_cols":16,"rows_kept":49,"cut":false,"hidden":false,"merged":[[46,2,46,13],[18,6,18,9],[48,2,48,7]]}
[null,"Excel Datavis Contest - Chandoo.org - 2014"]
[]
[null,"Contest Rules"]
[null,null,null,null,null,null,null,null,null,null,null,null,null,null,null,"Texas"]
[null,null,"Make a dashboard or set of charts."]
[null,null,"Help us understand state to state migration trends and interesting facts"]
[null,null,"Use any standard Excel feature (no add-ins, no Power Pivot etc.)"]
[null,null,"You can use Macros & VBA to add interaction to charts. (Code must be commented clearly and sources should be credited)"]
[null,null,"You can add additional demographic or economic data as long as,"]
[null,null,"You use publicly available data sources"]
[null,null,"You provide links to the data sources and credit them"]
[null,null,"Examples: Percaptia income, weather or living conditions"]
[null,null,"You may ignore the Margin of Error data (provided in extreme right in the data tables). "]
[null,null,"You may submit more than one entry. For voting & selecting winners only 1 entry from each individual is considered."]
[]
[null,"Important Dates"]
[]
[null,null,"Contest start date",null,"9th of April, 2014"]
[null,null,"Last date for submission",null,"20th of April, 2014",null,{"$f":"DATE(2014,4,20)-TODAY()","v":4}]
[]
[null,"How to submit your entry?"]
[]
[null,null,"Email"]
[null,null,"Send to: chandoo.d@gmail.com"]
[null,null,"Subject: Datavis contest 2014"]
[null,null,"Include: Your workbook, Your name, Email Address & Version of Excel used to make it"]
[]
[null,null,"Facebook"]
[null,null,"Join chandoo.org fan page (Click here)"]
[null,null,"Send your entry as a message (with workbook as attachment)"]
[null,null,"Include: Your workbook, Your name, Email Address & Version of Excel used to make it"]
[]
[null,"What do you get?"]
[null,null,"First prize"]
[null,null,"iPad (Latest version) 16 GB"]
[]
[null,null,"Second prize"]
[null,null,"iPad Mini (latest version) 16 GB"]
[]
[null,null,"Third prize (2 nos)"]
[null,null,"Samsung Galaxy Tab 3"]
[]
[null,"How winners are selected"]
[null,null,"Winners will be selected by voting and a panel of judges (to be revealed). If there is a tie, Judges' decision will be given more weightage."]
[]
[null,"Fine Print"]
[null,null,"Prizes will be delivered thru Amazon.com. If you are located in a country where shipping Amazon goods is not possible (or prohibitively expensive) you will be offered a choice of either getting money payment or purchase from a local website.\n\nYou also agree that Chandoo.org reserves the right to showcase your files, share them, use them in courses & training programs or any other publication as deemed fit. You agree to share the copy-right of your workbook with Chandoo.org indefinetly for no compensation.\n\nChandoo.org may get in touch with you if we need any clarifications or we are unable to use your file.\n\nChandoo.org reserves the right to disqualify a contest entry based on sole discretion."]
[null,null,"For updates on rules, dates & policies, please click below link:"]
[null,null,"http://chandoo.org/wp/2014/04/09/visualize-state-migration-contest/"]

{"sheet":"2012","index":1,"n_rows":120,"n_cols":114,"rows_kept":120,"cut":false,"hidden":true,"merged":[[6,0,8,0],[6,2,7,3],[6,4,7,5],[6,6,7,7]]}
[]
["Table 1.  State-to-State Migration Flows*: 2012"]
["Dataset: 2012 American Community Survey 1-Year Estimates"]
["Universe: Population 1 year and over"]
["Source: http://www.census.gov/hhes/migration/files/acs/st-to-st/State_to_State_Migrations_Table_2012.xls"]
[null,null,null,null,null,null,null,null,"ESTIMATES",null,null,null,null,null,null,null,null,null,null,null,null,null,null,null,null,null,null,null,null,null,null,null,null,null,null,null,null,null,null,null,null,null,null,null,null,null,null,null,null,null,null,null,null,null,null,null,null,null,null,null,null,"Margin of Error"]
["Current residence in --",null,"Population 1 year and over",null,"Same residence 1 year ago",null,"Different residence, same state 1 year ago",null,1,2,3,4,5,6,7,8,9,10,11,12,13,14,15,16,17,18,19,20,21,22,23,24,25,26,27,28,29,30,31,32,33,34,35,36,37,38,39,40,41,42,43,44,45,46,47,48,49,50,51,52,53,1,2,3,4,5,6,7,8,9,10,11,12,13,14,15,16,17,18,19,20,21,22,23,24,25,26,27,28,29,30,31,32,33,34,35,36,37,38,39,40,41,42,43,44,45,46,47,48,49,50,51,52,53]
[null,null,null,null,null,null,null,null,"State of Residence Last year (Estimate)",null,null,null,null,null,null,null,null,null,null,null,null,null,null,null,null,null,null,null,null,null,null,null,null,null,null,null,null,null,null,null,null,null,null,null,null,null,null,null,null,null,null,null,null,null,null,null,null,null,null,null,null,"State of Residence Last year (Margin of Error)"]
[null,null,"Estimate","MOE","Estimate","MOE","Estimate","MOE","TOTAL","Alabama","Alaska","Arizona","Arkansas","California","Colorado","Connecticut","Delaware","District of Columbia ","Florida","Georgia","Hawaii","Idaho","Illinois","Indiana","Iowa","Kansas","Kentucky","Louisiana","Maine","Maryland","Massachusetts","Michigan","Minnesota","Mississippi","Missouri","Montana","Nebraska","Nevada","New Hampshire","New Jersey","New Mexico","New York","North Carolina","North Dakota","Ohio","Oklahoma","Oregon","Pennsylvania","Rhode Island","South Carolina","South Dakota","Tennessee","Texas","Utah","Vermont","Virginia","Washington","West Virginia","Wisconsin","Wyoming","Puerto Rico","TOTAL","Alabama","Alaska","Arizona","Arkansas","California","Colorado","Connecticut","Delaware","District of Columbia ","Florida","Georgia","Hawaii","Idaho","Illinois","Indiana","Iowa","Kansas","Kentucky","Louisiana","Maine","Maryland","Massachusetts","Michigan","Minnesota","Mississippi","Missouri","Montana","Nebraska","Nevada","New Hampshire","New Jersey","New Mexico","New York","North Carolina","North Dakota","Ohio","Oklahoma","Oregon","Pennsylvania","Rhode Island","South Carolina","South Dakota","Tennessee","Texas","Utah","Vermont","Virginia","Washington","West Virginia","Wisconsin","Wyoming","Puerto Rico"]
["United States",2,310212755,25814,263612596,229733,37696597,211307,7070345,109210,84068,206842,64967,566986,161530,87023,25149,59513,428325,252262,61509,55191,277953,144597,73325,93134,103004,95956,38574,157664,158156,175733,115946,66947,142754,33832,48816,98882,38696,219202,63921,405864,238663,23959,199202,102572,108182,237156,30498,127418,22534,163843,402187,82165,20056,238540,180462,47425,97724,32228,74500,58599,9027,7600,12859,6563,19755,10348,5968,3775,6154,18406,12868,6100,6257,12722,8929,6129,7286,7490,7745,5351,9686,10755,9302,8402,7206,9402,4879,4967,9332,3364,11087,5867,15692,13414,3373,10288,9213,7867,10246,3414,8502,2998,8717,15471,8304,2967,11611,9674,5262,5859,5150,8156]
["Alabama",3,4764428,3589,4054260,21464,590326,19701,104600,"N/A",1004,962,660,3077,1386,284,42,162,11244,19920,627,493,2722,1347,345,865,2495,3104,67,1513,334,2298,752,4952,1555,101,151,1009,161,1702,459,2709,5133,228,1411,194,200,1837,0,2811,518,10539,7468,579,0,3170,1034,128,760,88,619,8482,"N/A",829,583,382,1037,1393,256,68,195,2476,3636,477,456,1030,536,337,760,981,1216,82,847,272,881,716,1703,836,132,167,824,166,1200,576,1188,1788,194,576,157,169,736,184,1951,758,2731,2136,713,184,1577,684,156,605,107,551]
["Alaska",4,721186,1290,592551,8741,90613,7239,33415,1097,"N/A",1520,196,3494,556,0,0,356,1991,928,1376,538,58,260,13,221,161,120,66,508,297,563,192,56,819,371,1195,803,118,116,263,736,920,264,1316,335,3174,255,0,384,99,451,1488,330,79,1265,3725,0,206,136,25,4385,825,"N/A",1441,202,1643,279,143,143,459,942,894,805,387,118,235,24,272,196,145,62,591,289,426,191,76,628,334,1128,382,206,156,219,576,784,359,757,252,1510,240,143,394,123,413,760,347,108,674,1488,143,261,217,43]
["Arizona",5,6468907,3874,5242674,32185,953789,28803,232457,1331,3717,"N/A",1214,44889,13790,417,246,36,5553,2263,2491,2934,10744,2930,2702,2498,1328,724,616,3007,1961,9598,8570,293,2595,1118,2293,6712,510,2564,6946,7402,2721,877,7906,1626,8587,4280,614,1070,1472,5075,14788,5916,207,2763,13247,765,3765,2786,1791,14183,1286,1505,"N/A",659,5435,6133,309,215,60,2160,961,1285,1362,2614,1447,1000,852,997,442,593,1288,1083,3471,3050,215,1099,536,1037,2202,443,1085,1907,2615,939,444,2239,838,3200,1395,687,573,776,1919,3541,1789,291,1031,2448,734,1168,1401,1662]
["Arkansas",6,2912680,2753,2453347,16841,373046,14543,76948,374,855,1677,"N/A",3525,603,185,0,205,2682,1525,0,0,3576,1172,409,1033,1310,3953,17,169,254,1283,295,3689,9105,258,166,121,0,157,547,2262,3057,0,1135,9938,193,516,59,52,673,4195,11767,269,0,1159,251,84,695,1498,0,7223,293,906,954,"N/A",1202,369,264,184,232,1052,1006,184,184,1286,587,330,539,884,1340,39,209,262,607,285,2537,2916,293,201,161,184,171,482,1559,2173,184,626,2371,179,475,103,71,588,1127,2841,216,184,824,226,148,467,2098,184]
["California",7,37572738,10274,31777868,67939,5046618,65422,493641,2509,6995,38916,3472,"N/A",15150,6764,474,3199,21004,10790,11906,5331,21251,5891,2284,2790,3763,5180,1256,7902,14356,8921,8539,2556,6729,3060,3302,27968,1327,12057,5921,31261,11195,1827,10653,6671,22724,10466,1648,4110,826,5802,43005,12172,544,15625,34569,1413,5681,1886,2323,19652,983,1948,5726,1354,"N/A",2598,2194,413,1061,3394,2458,2720,1519,3521,1629,987,984,1292,1525,951,2347,2682,2069,1942,993,1595,1275,2007,3857,615,2447,2240,5136,2366,1272,2869,1795,3271,2392,697,1492,674,1880,5519,2457,345,3457,4540,1135,1716,1117,1076]
["Colorado",8,5123944,2939,4131357,21752,751921,19587,205060,3108,3457,10589,1043,22152,"N/A",1317,70,488,8615,5834,2536,2660,6374,4336,2776,5283,2500,5048,20,2844,5939,3343,2992,835,3771,2021,4472,3789,679,2464,6520,7250,4378,1918,4533,4582,2419,3950,137,2383,756,2535,17355,6398,503,3796,4853,837,3000,5602,1144,11855,1610,1695,2218,580,4260,"N/A",677,133,387,1907,2086,1020,1468,1617,2128,1486,1843,2135,2468,40,1196,2238,1293,909,522,1262,923,1729,1433,308,1179,1851,2604,1678,1071,2214,2102,836,1530,153,1479,553,1135,3352,2035,371,1568,1401,429,1006,2808,903]
["Connecticut",9,3555319,2447,3114940,16188,334918,14546,80311,46,439,3167,200,3161,367,"N/A",22,288,6578,1702,408,97,912,53,0,0,124,909,1224,1752,8743,753,605,276,358,50,45,172,1009,5665,444,23310,3379,0,287,415,35,2214,1558,940,0,260,3279,45,709,1729,1593,174,711,104,3228,6574,103,511,3028,228,1015,341,"N/A",36,230,1844,971,476,155,583,90,193,193,159,733,696,748,1587,539,564,293,330,91,74,166,551,1490,450,3774,1609,193,254,411,58,1037,689,665,193,216,1568,69,556,707,1274,293,684,120,1540]
["Delaware",10,906576,1624,782216,9177,86003,7626,34757,119,692,188,0,2221,0,1489,"N/A",11,715,179,0,32,567,62,30,113,0,178,0,5649,157,227,351,58,80,0,91,572,99,5846,85,3566,1349,0,191,0,0,6828,135,298,0,344,133,166,0,1746,29,161,0,0,56,4691,164,920,227,182,2189,182,679,"N/A",21,481,224,182,51,468,80,49,190,182,266,182,1598,131,233,390,110,138,182,116,474,127,2122,136,1751,809,182,201,182,182,1815,185,235,182,440,158,279,182,910,49,205,182,182,90]
["District of Columbia ",11,624847,948,500267,6225,61992,5668,53830,79,1247,902,35,4999,677,618,78,"N/A",1705,1079,38,46,795,469,133,164,112,283,194,14120,1524,944,393,44,337,0,172,42,197,1451,116,3085,985,0,651,0,157,1494,635,150,0,577,1473,116,267,9537,481,293,721,215,0,5001,138,715,646,59,2108,546,439,127,"N/A",661,470,87,75,446,379,221,267,136,295,244,2487,717,670,240,74,354,197,182,69,183,792,139,851,503,197,429,197,182,608,596,140,197,478,826,145,250,1762,358,219,420,303,197]
["Florida",12,19114620,6877,16032617,49245,2380288,44658,537148,18599,10704,6473,3321,20386,8766,8975,1099,780,"N/A",42754,3177,1268,22565,13803,3864,5661,6912,5550,7348,10442,15159,23400,5460,5490,10666,1758,945,1241,2362,27606,2853,53009,23133,239,22927,3142,2919,25659,3050,11366,1070,16275,28564,2499,2747,25697,4943,3533,6216,773,21638,19784,4762,4327,1865,1136,4221,2537,1882,608,481,"N/A",6205,2730,923,3828,2852,1332,3133,1607,2266,3032,2378,2747,3519,2185,3345,3498,2104,713,515,922,4242,1004,5886,3843,203,4305,1301,1736,4174,1458,2719,762,3583,4750,1348,1190,3965,1710,1587,1993,567,4641]
["Georgia",13,9796547,5863,8231384,34188,1236302,31155,277466,13864,2654,6657,1041,14174,4710,1829,226,1352,42870,"N/A",1409,936,7143,5972,1687,1497,6172,4100,222,3619,4153,9949,2237,3280,3377,251,1283,3783,15,4920,915,13957,16009,207,7501,3299,453,9076,440,18611,257,17606,16198,20,84,10702,1965,1237,3441,106,1730,14075,2903,1444,2675,519,3182,2093,824,246,994,5472,"N/A",831,797,1833,2678,1036,707,1972,1490,178,1621,1720,3100,2164,1372,1479,224,1001,2622,27,1544,512,3960,2963,250,2501,1818,472,2622,620,3871,291,4620,3367,35,142,2094,826,625,1725,154,1190]
["Hawaii",14,1374852,1662,1164145,10466,134827,9196,55145,608,1417,1865,24,9756,1216,191,278,230,2780,1448,"N/A",404,318,292,84,1135,485,207,91,2491,1266,321,192,44,944,131,75,760,85,410,284,2382,2241,0,884,1095,1763,1087,106,644,459,1314,3300,2183,0,1393,5920,197,295,50,336,5749,479,869,695,54,1508,574,222,253,253,1227,639,"N/A",431,194,261,98,709,630,183,147,1610,962,189,240,52,630,172,125,424,119,435,243,1279,1274,177,995,933,764,770,176,460,726,675,1887,1283,177,755,1901,330,234,66,436]
["Idaho",15,1573036,2184,1296975,12998,210151,11483,59283,575,1198,2424,291,10280,1186,44,120,116,2014,583,206,"N/A",532,283,90,63,83,54,0,107,338,683,637,87,214,3800,35,2535,0,214,675,938,817,0,1018,93,4963,169,0,205,118,1957,1352,6617,0,269,10398,0,225,677,136,6040,838,790,1307,268,2708,614,81,199,124,1608,848,194,"N/A",469,282,170,69,128,92,187,161,391,777,528,170,259,2162,60,1031,187,206,554,554,843,187,753,108,1377,181,187,238,192,1539,714,3016,187,388,1919,187,272,406,228]
["Illinois",16,12725119,5939,11009321,31714,1441191,27618,208755,883,2250,7139,1587,14940,3036,955,234,1066,12687,8745,869,1384,"N/A",16907,8529,2009,2923,1229,526,1865,3296,12583,6537,2744,13264,228,1302,1478,283,2366,1359,7561,3761,196,6872,1491,954,4588,462,1583,394,4648,16780,1154,156,4311,2704,1221,14414,302,2049,10844,478,1511,2314,643,2770,1235,634,228,615,2735,3894,593,868,"N/A",2654,1959,988,1049,561,347,755,1088,3412,1781,1178,3449,183,637,817,255,1097,1078,2307,1150,184,1834,860,517,1506,478,875,444,1468,3035,495,133,1212,971,1224,2249,309,1480]
["Indiana",17,6457067,4184,5493090,26865,805228,22224,134137,1625,479,2763,564,6033,1225,823,639,1045,11472,2258,856,186,28436,"N/A",1678,1624,11177,736,0,1050,837,11017,1543,1948,4526,134,591,1011,0,1537,219,2316,2665,113,11235,1198,387,2419,0,1414,111,3547,4490,105,0,1932,258,507,1727,1681,136,9664,788,429,1095,753,1477,531,595,831,733,2864,1176,998,176,4261,"N/A",860,785,2929,416,184,648,590,2594,732,1655,1802,191,541,549,184,1034,245,724,884,164,2192,725,239,1101,184,901,147,1422,1562,124,184,1101,221,345,769,2023,194]
["Iowa",18,3035469,2721,2585979,14093,362938,11238,75760,503,951,1590,451,3268,3252,112,0,151,4335,596,521,290,11969,1716,"N/A",918,819,763,78,419,585,946,7505,751,4168,452,7698,681,56,1018,114,1230,734,833,1127,1465,348,451,0,943,1158,1148,3553,886,0,268,919,22,3607,392,786,5982,400,814,803,237,1296,1250,135,151,155,2060,481,476,218,2313,1097,"N/A",500,609,568,125,287,520,497,1826,621,1021,305,1806,602,93,767,188,819,428,617,692,974,302,353,151,556,441,871,1275,880,151,200,485,41,849,316,1190]
["Kansas",19,2848708,2507,2361899,16878,381695,15902,88284,853,333,3094,2158,5411,3746,210,0,456,3118,1896,149,456,1702,1679,1527,"N/A",617,438,211,282,187,1125,682,452,21022,300,4126,851,0,267,1029,571,813,261,1310,8408,848,918,18,556,154,1542,8468,97,70,1705,3265,139,486,278,82,7145,609,407,1630,890,2012,1360,208,165,737,1380,1395,156,356,582,839,860,"N/A",476,408,225,282,203,682,367,501,3073,326,1245,606,165,228,627,367,476,263,638,2299,557,672,31,375,195,825,2434,106,138,853,1675,132,530,239,147]
["Kentucky",20,4328626,2851,3676472,15304,521511,14825,112787,4137,304,1103,518,3415,712,246,706,254,9232,4173,647,50,4445,12203,238,602,"N/A",666,46,1120,419,7302,605,646,2381,0,723,301,84,496,554,5239,3643,122,17041,577,298,2226,0,1347,0,10064,3345,464,45,3319,1988,3346,1395,0,170,7854,1628,370,715,299,1157,572,290,774,262,2697,1184,665,91,1359,2150,257,464,"N/A",294,80,615,285,1809,346,467,1021,181,588,294,103,551,348,1774,1903,192,3384,437,212,964,181,671,181,2378,1420,360,81,1111,998,1472,845,181,197]
["Louisiana",21,4545914,4612,3912023,21791,528406,20131,91215,2329,403,2021,3645,5139,1433,164,0,596,6534,4478,378,265,1229,1359,544,420,1649,"N/A",251,642,549,1080,330,6791,1591,428,745,931,11,975,150,2786,2284,64,1115,2159,195,1239,737,1914,0,2348,24488,277,45,1857,1581,238,682,146,655,6941,1114,467,1191,2324,1438,1002,149,193,517,2276,1559,283,242,466,954,447,392,1224,"N/A",334,701,354,782,324,1938,684,524,538,682,21,575,188,1105,1152,113,773,1365,232,616,695,1377,193,1546,4076,288,72,1033,631,271,474,216,507]
["Maine",22,1315586,1384,1132344,9895,151438,9223,27523,129,38,230,0,1610,314,1468,234,32,2926,511,0,143,195,0,7,277,482,15,"N/A",325,3887,116,430,79,69,0,82,35,3655,405,272,2519,1112,0,628,79,215,976,1024,173,0,985,496,200,349,573,118,51,0,59,38,3132,172,48,170,155,860,287,620,299,55,1292,538,155,128,277,155,16,401,521,30,"N/A",263,1167,123,359,134,112,155,136,56,1077,281,320,1180,574,155,368,115,255,600,656,143,155,1062,381,183,340,408,137,85,155,81,69]
["Maryland",23,5816472,3717,5068457,21604,549973,20595,154983,1261,1947,760,136,8614,1071,881,4100,21213,9610,4610,610,429,3621,1210,569,1726,715,606,332,"N/A",3977,2167,1422,581,256,0,132,330,1124,6260,638,11736,7507,116,2522,463,378,15485,82,2297,0,1800,5612,1061,589,20579,1431,1957,460,0,294,8958,713,1123,359,159,2155,609,516,1303,3437,2515,2430,474,444,1647,709,389,1123,602,441,261,"N/A",1805,973,707,706,199,190,152,258,820,2244,453,2585,2284,94,1035,447,426,2922,95,1139,190,986,1271,831,598,2668,884,799,371,190,249]
["Massachusetts",24,6580641,3587,5752166,19793,626380,17354,142577,636,890,1972,394,12770,980,10525,506,379,12890,2789,1108,188,2886,677,151,565,52,1556,3907,2381,"N/A",1337,966,155,453,49,182,787,13331,8046,521,19467,2514,81,1829,297,1528,8236,6863,2477,194,823,3694,1027,2534,4098,1653,385,584,264,4056,7863,622,600,979,340,2994,438,2062,505,219,2568,1129,564,164,1041,497,251,429,87,742,1349,895,"N/A",680,367,186,218,81,189,544,2144,1874,364,2432,1003,133,772,206,1359,1924,1317,1120,326,342,1078,666,913,1470,696,569,445,404,1883]
["Michigan",25,9778980,4263,8330990,24803,1268105,23226,133981,2341,1152,7168,906,8085,2363,798,114,274,13146,4270,291,242,10047,10976,993,805,3409,1284,261,2201,1720,"N/A",1127,922,2206,218,113,1354,446,1617,1318,5731,3912,265,11318,705,811,2739,68,1822,66,3259,8638,819,60,3057,2146,353,4768,1277,782,8566,1013,685,3100,559,1721,967,506,164,282,3306,1652,238,371,1702,2324,495,608,1388,662,218,1094,764,"N/A",512,671,695,171,137,715,342,721,685,1680,1056,202,2251,307,440,686,114,797,77,997,2574,534,120,855,839,279,1111,862,797]
["Minnesota",26,5315228,2787,4536303,18312,653012,17074,101042,1299,523,3065,375,8086,3565,696,0,310,2372,2235,1277,575,5896,2026,7220,924,57,791,187,1841,814,2212,"N/A",202,1709,1257,992,932,0,1038,322,1849,1745,6672,2635,1212,781,1106,299,1705,3442,1738,4001,429,77,1037,1685,0,17618,213,134,6534,919,312,861,222,2263,1095,360,139,353,752,1482,1179,531,1405,1057,1774,513,103,858,136,2080,434,822,"N/A",323,750,900,477,542,139,546,224,732,956,1485,1248,894,513,570,226,1448,990,1141,1244,312,126,434,678,139,2358,213,136]
["Mississippi",27,2947696,2744,2529377,17940,339807,16126,73500,5141,0,710,2680,4371,799,106,0,97,4676,2669,184,586,2703,1200,160,400,446,8588,163,379,67,1768,568,"N/A",2634,166,138,526,60,2127,86,1492,1709,98,896,562,465,613,185,596,79,11643,7230,454,0,1929,433,0,611,307,81,7080,1870,198,509,1447,1070,426,147,198,164,1396,865,191,597,933,621,275,339,276,2293,167,262,113,1071,385,"N/A",1581,168,159,342,117,1495,102,660,609,118,703,352,768,434,229,469,129,2856,2491,724,198,1285,309,198,521,287,108]
["Missouri",28,5951913,3866,4965459,21306,801093,19635,162930,1333,2186,2297,9434,10717,3798,410,234,144,8374,3451,2114,596,22001,4184,5956,20218,2291,1178,996,1246,810,2964,2798,1110,"N/A",511,1999,836,35,960,451,2834,3988,636,3557,5298,1186,1535,361,2856,527,3122,9278,3287,318,2609,2312,148,2636,810,826,8034,768,1289,741,2224,2409,1371,331,314,172,1990,1391,1271,478,2893,1267,1324,3673,1067,651,1247,717,486,1169,1265,532,"N/A",506,833,366,58,536,309,918,1420,462,1317,2199,899,639,582,1625,542,1350,2841,1733,413,1081,1093,181,999,452,958]
["Montana",29,995544,947,829489,8669,126463,7466,37690,31,726,1548,63,5428,2135,0,0,0,1875,292,556,3385,542,163,415,224,367,0,225,33,97,822,481,32,447,"N/A",108,968,115,156,259,482,1082,977,402,1018,2950,457,0,230,191,45,1393,260,87,156,4783,0,750,934,0,4305,55,442,938,102,2229,896,157,157,157,1029,270,572,1349,371,164,384,268,352,157,269,65,109,760,297,58,385,"N/A",149,499,177,198,178,371,808,604,332,948,1687,362,157,304,142,40,612,261,135,153,1555,157,425,387,157]
["Nebraska",30,1829420,2101,1540361,9074,237937,9736,43266,245,626,2406,363,3438,2023,0,0,0,1368,786,165,315,1193,290,6815,3103,131,411,68,129,195,258,1489,176,2223,108,"N/A",233,0,524,158,318,874,497,563,587,106,702,0,456,2507,232,3130,229,79,1076,1327,111,316,917,0,4512,275,531,1120,317,1425,791,149,149,149,978,482,149,374,546,214,2803,822,133,371,90,126,112,197,1049,132,836,156,"N/A",178,149,363,187,246,414,492,373,408,113,528,149,381,677,184,1218,230,131,758,673,152,218,371,149]
["Nevada",31,2725280,3005,2105070,21984,481496,19389,124285,761,2161,8748,353,49978,6402,143,373,468,3381,745,2053,1503,2822,362,714,1202,952,421,209,934,318,1235,1157,783,694,1086,714,"N/A",175,912,1138,3521,767,702,1407,1520,3101,1601,336,480,0,1699,5484,4605,121,1135,2997,100,1046,766,237,9956,724,1047,2540,404,7637,2736,181,521,759,1488,477,949,743,1412,341,592,1085,651,296,286,689,267,574,718,658,516,605,551,"N/A",230,600,665,1460,589,661,791,1384,1186,1078,548,403,200,822,1772,1899,222,832,1103,161,666,706,356]
["New Hampshire",32,1309203,1504,1127376,9730,125118,9101,50484,0,437,440,0,1514,572,1345,0,101,2746,470,43,20,673,297,53,102,284,7,6118,33,18990,426,0,0,289,0,110,0,"N/A",591,223,2905,1609,0,324,186,208,890,1248,323,0,77,2150,557,2960,660,113,80,239,71,75,5282,181,378,413,181,935,637,478,181,131,1312,324,78,38,608,365,89,161,250,13,1749,57,3350,441,181,181,262,181,136,181,"N/A",330,279,1027,1456,181,240,266,299,561,819,257,181,133,1715,762,1339,433,119,131,277,120,123]
["New Jersey",33,8772744,4541,7929570,23298,655465,21808,130223,779,359,1328,57,4330,380,3466,1921,840,10649,3002,22,113,2052,1039,357,426,631,339,430,3474,4907,324,570,106,384,67,35,908,126,"N/A",45,40495,3236,55,1452,1540,760,23597,429,2372,581,1400,2509,425,35,5024,1847,297,680,23,2574,7649,509,437,704,70,1070,264,1711,1383,637,2430,1032,41,134,874,559,405,405,614,343,388,1241,1730,191,429,165,363,112,58,526,219,"N/A",75,4293,1238,93,596,1537,587,2976,410,1386,644,612,1335,341,57,1899,1244,201,457,30,1462]
["New Mexico",34,2060595,2119,1769341,11461,226243,12069,54693,787,320,6391,410,4536,4780,280,100,25,4707,192,168,355,790,660,384,672,159,790,57,505,303,602,284,451,1216,139,194,604,268,252,"N/A",1111,335,41,1178,1076,932,822,0,325,509,338,11955,1382,81,1560,1251,0,321,95,429,5877,509,264,1673,286,1440,1546,250,136,51,2184,184,127,352,530,524,331,537,160,883,80,355,298,490,428,630,793,162,220,853,259,271,"N/A",618,373,82,1049,568,481,666,185,260,547,274,2917,889,103,1330,575,185,514,100,466]
["New York",35,19352153,6112,17202134,34343,1723117,30910,270053,1364,4002,4146,247,24623,3596,14595,477,3936,27392,7592,1598,607,8017,3040,955,1437,1753,1083,1345,7321,15073,5191,1059,773,3310,421,78,600,2760,42574,646,"N/A",10544,77,4625,1327,1055,22895,3222,5952,0,1279,11231,622,2764,7939,2614,921,979,396,7321,11861,864,2016,2468,203,2557,976,2921,284,1392,3450,1925,734,472,2204,1128,658,906,808,465,536,1575,2292,1445,631,800,1260,424,108,382,1059,4802,445,"N/A",2568,129,1103,652,716,3206,1538,1542,185,624,2384,489,1025,2109,840,689,507,370,1791]
["North Carolina",36,9640490,5097,8167830,27074,1149080,24801,273149,4329,1458,3493,861,13883,4790,4914,2180,1801,26365,16823,1566,334,6378,4532,775,1595,1531,919,1259,9005,3710,6161,1523,2377,2623,244,628,1627,754,11468,1138,19891,"N/A",206,9337,1263,1333,12179,290,25532,351,9230,12638,1189,445,26759,5915,2677,2266,604,2025,13136,1544,925,1189,649,2813,2047,1990,1732,687,3750,2851,921,256,2177,2259,524,748,794,758,972,2221,1158,2547,838,1092,1742,306,628,807,525,4262,705,3951,"N/A",232,2484,753,772,2356,198,4732,186,2122,2381,1040,291,4229,2630,985,980,687,1218]
["North Dakota",37,689838,1379,563978,6361,84294,5380,38213,83,70,1571,0,999,546,65,0,70,950,98,160,540,799,55,458,161,22,18,98,232,187,757,15257,72,1490,1776,950,854,0,140,161,331,231,"N/A",6,280,724,114,244,14,1754,746,1414,43,758,403,1604,0,543,365,0,3616,142,105,788,141,460,293,100,141,112,860,154,148,521,523,77,316,122,44,27,176,311,281,571,2266,109,1346,709,764,572,141,231,228,331,243,"N/A",14,260,529,157,255,28,822,694,756,60,1014,309,796,141,327,269,141]
["Ohio",38,11414635,5725,9735390,29715,1440815,28423,196391,3705,2207,4929,884,8995,3180,1355,1079,985,16366,8052,1198,412,9510,13534,1039,1166,13227,2214,1189,5026,2189,16336,1122,1017,3026,276,1052,907,189,4703,1361,8732,5498,453,"N/A",858,432,14147,435,2445,47,3542,11760,197,364,3193,2862,7820,974,202,1403,9611,2297,1757,1912,604,1803,1230,887,696,722,2560,2973,591,295,2157,2157,765,617,2976,1011,889,2570,808,2656,597,865,1068,292,656,525,156,2119,817,1741,1525,346,"N/A",417,307,2612,384,1029,76,1429,2739,211,350,1055,2150,2219,725,210,910]
["Oklahoma",39,3762311,2764,3107367,14635,531347,12812,108972,1030,1279,2974,5777,8950,4717,0,380,151,5011,2581,189,905,1100,1490,1088,7065,1354,2562,167,750,1233,1347,906,1850,5210,798,300,1101,549,1523,1244,1981,1961,308,1148,"N/A",1261,494,0,569,108,2471,25508,2588,197,1749,1574,368,1061,45,0,6570,467,600,1435,1187,2184,1556,149,288,148,1525,935,295,600,487,936,689,1535,898,1354,260,685,906,671,469,752,1349,710,208,799,383,748,712,936,912,340,533,"N/A",771,285,149,346,154,1035,2960,1465,316,829,575,298,758,68,149]
["Oregon",40,3857465,2984,3158450,19251,560673,17729,118925,373,2513,7954,165,31862,4472,381,0,696,1660,1032,2501,5093,1676,1380,834,556,202,227,446,457,760,570,1792,186,403,2192,570,5935,39,385,920,2379,1482,42,1411,725,"N/A",904,177,461,119,802,3347,4793,367,676,21224,593,426,765,152,7769,425,953,2060,158,3767,2133,457,193,919,620,523,813,1880,1192,1000,781,534,261,229,353,422,604,338,799,237,269,968,448,2774,65,327,676,1032,1046,85,789,546,"N/A",535,214,364,143,583,1277,2328,435,510,3153,502,284,664,177]
["Pennsylvania",41,12630082,4558,11107110,28998,1252378,26347,215500,1926,1658,3529,573,7772,2574,3311,4814,2921,14631,4337,245,359,3749,1599,125,967,1233,694,988,17529,5900,2642,1169,55,1171,135,214,1600,1138,33791,1001,32898,6380,166,14319,378,234,"N/A",771,3023,159,1273,6768,1276,1012,11960,1787,6762,1550,434,7847,8872,1318,857,1256,315,1558,1488,905,1468,830,2565,1703,180,350,1137,680,177,860,604,431,675,3084,1368,1235,588,49,575,169,187,999,609,4576,740,4482,1734,195,2479,253,220,"N/A",472,869,206,533,1688,804,873,2213,1202,2075,722,439,2646]
["Rhode Island",42,1040527,1533,899551,9890,101165,8498,33446,20,0,93,0,2146,332,4170,0,313,2752,168,120,0,385,0,0,27,286,24,279,482,11253,230,131,0,210,0,188,25,611,1219,36,3603,478,0,63,0,139,735,"N/A",481,0,120,823,0,53,1008,287,0,135,21,116,3551,44,200,151,200,811,315,1101,200,381,1143,211,145,200,382,200,200,47,405,45,249,325,1937,169,131,200,158,200,250,48,385,641,58,1335,508,200,80,200,235,552,"N/A",609,200,199,433,200,76,569,320,200,124,32,186]
["South Carolina",43,4668886,3434,3929626,20572,564350,20053,156705,1665,1244,2222,839,5979,1915,1590,697,435,11552,18570,638,198,2125,3802,643,1064,1924,2709,2077,3565,2313,2966,757,1407,1884,93,158,1025,917,6517,1052,10746,24764,656,4388,555,255,6497,538,"N/A",816,3550,5351,566,298,9377,1629,1345,832,0,1070,9611,635,1016,1160,526,1473,1059,729,492,352,2367,3616,493,321,1128,1911,437,855,991,2265,942,1205,826,1289,582,802,724,127,165,834,696,2181,1085,3642,3907,650,1326,354,202,2067,332,"N/A",1252,1136,1482,425,244,3040,1165,720,570,197,890]
["South Dakota",44,821669,1036,676014,7752,115606,7423,26051,0,855,435,227,1494,1744,2,0,0,970,122,8,78,74,210,2441,403,0,0,0,60,61,892,3568,34,474,248,2175,135,0,0,175,371,240,1725,64,21,667,515,0,158,"N/A",507,1715,388,5,340,1026,131,314,979,134,2891,147,1127,333,354,663,839,4,147,147,638,130,13,104,102,289,932,295,147,147,147,65,101,747,1023,48,274,208,801,171,147,147,187,317,220,823,77,36,583,633,147,159,"N/A",346,1067,372,9,300,681,216,413,735,235]
["Tennessee",45,6378278,4412,5396833,24470,783077,21860,177098,12116,1281,2250,3306,8396,2473,936,176,180,15641,16012,1058,787,7094,5591,617,2630,13202,2452,1040,1743,1525,4507,1178,10568,2694,308,432,735,271,783,751,6279,5904,7,6200,2495,1080,3329,26,4300,0,"N/A",8716,784,133,8008,1876,3248,1622,358,717,10625,3309,847,907,1731,2447,1156,900,222,203,3639,3114,1052,817,1891,2209,556,1972,2695,1206,589,867,706,1434,896,2321,1254,278,389,443,287,507,640,2008,1834,16,1742,1410,589,999,55,1280,193,"N/A",2938,1131,133,2159,852,1760,727,382,499]
["Texas",46,25711791,10124,21354247,60947,3656070,53747,507752,9993,6759,18908,13781,62702,16616,2769,181,1189,31259,20362,5040,2387,19672,8264,4934,12699,6040,29348,1293,4969,4813,9501,2803,6402,12319,1813,4794,8266,761,6797,16762,20274,22660,989,8728,26284,3827,10449,1763,4470,1264,10368,"N/A",4610,113,17734,11630,1729,4192,2472,4435,20202,3132,2614,3870,3771,8792,3638,1124,168,610,6252,3365,2386,1190,3645,2734,2063,3202,2224,5712,1284,2026,1584,2273,948,2032,2205,986,2045,4162,749,2141,3127,4211,6953,542,1739,4418,1684,2158,1605,1665,757,2623,"N/A",2045,135,4904,2741,938,1322,1676,1611]
["Utah",47,2805440,2571,2324019,16852,373980,16586,87870,126,2819,7966,361,15286,5350,142,0,0,2428,1142,1436,5129,1588,475,2791,398,217,345,380,613,1503,1670,385,284,1553,1057,489,5391,507,437,686,2129,842,175,1875,1338,4089,944,351,60,47,863,3605,"N/A",39,1369,3529,0,1445,2216,239,7490,171,1292,2419,402,2837,1845,168,181,181,1105,622,876,1135,802,296,2779,333,221,313,339,361,1343,1210,300,229,769,729,384,1743,442,322,505,924,611,218,881,691,2693,450,571,100,74,529,1278,"N/A",63,668,1319,181,1512,715,190]
["Vermont",48,620224,821,532237,5326,61242,5294,24431,16,93,127,0,1112,382,1626,0,116,966,56,6,0,230,68,30,0,1243,73,883,862,3318,284,315,0,23,147,0,17,2893,833,74,4780,328,0,214,11,26,935,341,124,39,193,493,81,"N/A",728,98,0,151,96,0,2713,23,153,165,143,537,296,540,143,134,519,81,10,143,221,81,43,143,1690,105,546,396,657,246,349,143,26,189,143,37,812,364,89,921,248,143,247,13,38,525,220,208,66,185,334,96,"N/A",427,109,143,115,102,143]
["Virginia",49,8085389,4754,6857430,25550,915242,24032,250653,2515,1906,2420,445,14780,5352,2725,2279,10964,19574,9535,3823,652,7089,2663,221,1144,3908,1638,1144,23925,3767,2982,2294,1344,1914,658,357,973,535,9073,947,15893,25575,852,5622,2810,1541,14190,1605,7936,35,6189,12944,2092,423,"N/A",4160,3839,1258,143,516,11997,990,1287,1030,319,2760,1834,1001,1465,4084,3694,1889,1460,411,3237,1228,209,669,1422,936,689,4264,1503,1136,1414,730,837,433,313,522,398,2029,637,3260,4182,1019,1519,1873,1069,2998,731,2435,57,1858,2828,994,437,"N/A",1420,1234,880,166,466]
["Washington",50,6815763,3864,5648199,25225,904695,24285,215494,1507,4328,8362,1413,45597,5195,2901,100,773,9370,6363,5239,10604,4298,1089,1159,2544,1368,1646,532,1191,2911,3470,2703,615,2802,2919,682,5671,309,2300,872,5562,4088,217,3192,1223,25525,3397,97,2727,94,3206,14196,5298,223,3839,"N/A",215,1168,394,1025,12552,730,1682,2641,1121,5884,2150,1138,164,528,2417,2288,2393,2191,1727,521,845,1029,911,915,655,923,1011,1605,1971,444,1017,1013,456,2919,248,1441,527,1947,1854,200,1400,768,4052,1799,162,1542,155,1819,3417,1995,216,1320,"N/A",271,638,495,878]
["West Virginia",51,1837518,2090,1613322,11785,174112,11396,47125,477,306,79,0,1231,104,143,674,294,1919,1108,166,181,220,328,68,39,2249,90,35,5352,164,778,20,0,59,0,0,229,129,1213,81,1721,4683,175,6757,520,118,5208,0,1098,36,1061,622,0,54,6317,297,"N/A",470,252,79,4317,339,455,129,182,516,114,177,525,194,666,483,277,250,190,406,111,64,1019,88,74,1897,191,581,37,182,76,182,182,268,147,679,90,965,1933,215,1474,447,207,1699,182,671,65,513,415,182,89,1774,285,"N/A",555,395,123]
["Wisconsin",52,5660677,3351,4849945,15530,693737,15440,99192,323,236,3257,253,5347,1600,657,296,15,4937,970,333,360,22285,2480,4161,1160,635,598,233,1306,489,3917,18965,238,1263,784,324,1163,3,606,526,2033,2939,284,2610,289,945,1563,144,1053,329,1051,2765,900,62,1267,1208,0,"N/A",30,975,6959,262,193,1696,216,2126,604,432,475,25,1590,396,416,231,3020,1136,1283,1199,502,403,195,586,356,1160,2405,211,681,512,240,682,7,477,553,980,1454,318,1053,204,601,750,157,675,220,638,1112,1091,88,916,416,145,"N/A",46,943]
["Wyoming",53,569734,1083,459226,7512,77324,6960,31149,260,590,2014,244,2035,5599,0,0,0,733,166,0,745,905,179,259,539,4,88,0,294,548,965,290,136,244,1901,1216,355,0,121,604,231,459,338,819,964,893,230,0,122,1175,4,1427,1710,0,138,1323,0,282,"N/A",16,3430,284,661,1234,405,720,1618,185,185,185,572,173,185,481,823,179,273,412,10,100,185,304,638,730,240,229,257,789,559,304,185,147,658,252,399,300,447,670,605,254,185,201,730,7,920,948,185,169,785,185,210,"N/A",27]
["Puerto Rico",54,3628402,2934,3366593,12125,238042,11523,20044,8,57,54,93,519,0,370,0,0,4192,232,110,0,1021,121,0,143,37,59,0,108,2258,435,0,0,0,0,0,0,0,1922,28,2314,638,0,328,0,0,2313,624,4,0,15,360,0,0,684,0,8,989,0,"N/A",2902,15,94,90,158,484,214,365,214,214,1203,300,172,214,602,153,214,240,72,101,214,177,1289,451,214,214,214,214,214,214,214,1129,48,761,565,214,499,214,214,1063,688,7,214,31,291,214,214,777,214,15,654,214,"N/A"]
[null,null,null,null,null,null,null,null,null,218428,168193,413738,130027,1134491,323060,174416,50298,119026,860842,504756,123128,110382,556927,289315,146650,186411,206045,191971,77148,315436,318570,351901,231892,133894,285508,67664,97632,197764,77392,440326,127870,814042,477964,47918,398732,205144,216364,476625,61620,254840,45068,327701,804734,164330,40112,477764,360924,94858,196437,64456,149000]
[null,null,null,null,null,null,null,null,null,23,32,11,37,1,16,31,49,40,2,6,39,41,5,19,35,30,25,29,45,18,17,14,22,36,20,46,42,27,44,10,38,3,7,50,12,26,24,9,48,21,51,15,4,33,52,8,13,43,28,47,34]
[]
[null,null,null,null,null,null,null,null,1,1.5,2,2.5,3,3.5,4,4.5,5,5.5,6,6.5,7,7.5,8,8.5,9,9.5,10,10.5,11,11.5,12,12.5,13,13.5,14,14.5,15,15.5,16,16.5,17,17.5,18,18.5,19,19.5,20,20.5,21,21.5,22,22.5,23,23.5,24,24.5,25,25.5,26,26.5,27,27.5,28,28.5,29,29.5,30,30.5,31,31.5,32,32.5,33,33.5,34,34.5,35,35.5,36,36.5,37,37.5,38,38.5,39,39.5,40,40.5,41,41.5,42,42.5,43,43.5,44,44.5,45,45.5,46,46.5,47,47.5,48,48.5,49,49.5,50,50.5,51,51.5,52,52.5,53,53.5]
[null,null,null,null,null,null,null,null,"Estimate","MOE","Estimate","MOE","Estimate","MOE","Estimate","MOE","Estimate","MOE","Estimate","MOE","Estimate","MOE","Estimate","MOE","Estimate","MOE","Estimate","MOE","Estimate","MOE","Estimate","MOE","Estimate","MOE","Estimate","MOE","Estimate","MOE","Estimate","MOE","Estimate","MOE","Estimate","MOE","Estimate","MOE","Estimate","MOE","Estimate","MOE","Estimate","MOE","Estimate","MOE","Estimate","MOE","Estimate","MOE","Estimate","MOE","Estimate","MOE","Estimate","MOE","Estimate","MOE","Estimate","MOE","Estimate","MOE","Estimate","MOE","Estimate","MOE","Estimate","MOE","Estimate","MOE","Estimate","MOE","Estimate","MOE","Estimate","MOE","Estimate","MOE","Estimate","MOE","Estimate","MOE","Estimate","MOE","Estimate","MOE","Estimate","MOE","Estimate","MOE","Estimate","MOE","Estimate","MOE","Estimate","MOE","Estimate","MOE","Estimate","MOE","Estimate","MOE","Estimate","MOE","Estimate","MOE"]
[null,null,null,null,null,null,null,null,7070345,58599,109210,9027,84068,7600,206842,12859,64967,6563,566986,19755,161530,10348,87023,5968,25149,3775,59513,6154,428325,18406,252262,12868,61509,6100,55191,6257,277953,12722,144597,8929,73325,6129,93134,7286,103004,7490,95956,7745,38574,5351,157664,9686,158156,10755,175733,9302,115946,8402,66947,7206,142754,9402,33832,4879,48816,4967,98882,9332,38696,3364,219202,11087,63921,5867,405864,15692,238663,13414,23959,3373,199202,10288,102572,9213,108182,7867,237156,10246,30498,3414,127418,8502,22534,2998,163843,8717,402187,15471,82165,8304,20056,2967,238540,11611,180462,9674,47425,5262,97724,5859,32228,5150,74500,8156]
[null,null,null,null,null,null,null,null,104600,8482,"N/A","N/A",1004,829,962,583,660,382,3077,1037,1386,1393,284,256,42,68,162,195,11244,2476,19920,3636,627,477,493,456,2722,1030,1347,536,345,337,865,760,2495,981,3104,1216,67,82,1513,847,334,272,2298,881,752,716,4952,1703,1555,836,101,132,151,167,1009,824,161,166,1702,1200,459,576,2709,1188,5133,1788,228,194,1411,576,194,157,200,169,1837,736,0,184,2811,1951,518,758,10539,2731,7468,2136,579,713,0,184,3170,1577,1034,684,128,156,760,605,88,107,619,551]
[null,null,null,null,null,null,null,null,33415,4385,1097,825,"N/A","N/A",1520,1441,196,202,3494,1643,556,279,0,143,0,143,356,459,1991,942,928,894,1376,805,538,387,58,118,260,235,13,24,221,272,161,196,120,145,66,62,508,591,297,289,563,426,192,191,56,76,819,628,371,334,1195,1128,803,382,118,206,116,156,263,219,736,576,920,784,264,359,1316,757,335,252,3174,1510,255,240,0,143,384,394,99,123,451,413,1488,760,330,347,79,108,1265,674,3725,1488,0,143,206,261,136,217,25,43]
[null,null,null,null,null,null,null,null,232457,14183,1331,1286,3717,1505,"N/A","N/A",1214,659,44889,5435,13790,6133,417,309,246,215,36,60,5553,2160,2263,961,2491,1285,2934,1362,10744,2614,2930,1447,2702,1000,2498,852,1328,997,724,442,616,593,3007,1288,1961,1083,9598,3471,8570,3050,293,215,2595,1099,1118,536,2293,1037,6712,2202,510,443,2564,1085,6946,1907,7402,2615,2721,939,877,444,7906,2239,1626,838,8587,3200,4280,1395,614,687,1070,573,1472,776,5075,1919,14788,3541,5916,1789,207,291,2763,1031,13247,2448,765,734,3765,1168,2786,1401,1791,1662]
[null,null,null,null,null,null,null,null,76948,7223,374,293,855,906,1677,954,"N/A","N/A",3525,1202,603,369,185,264,0,184,205,232,2682,1052,1525,1006,0,184,0,184,3576,1286,1172,587,409,330,1033,539,1310,884,3953,1340,17,39,169,209,254,262,1283,607,295,285,3689,2537,9105,2916,258,293,166,201,121,161,0,184,157,171,547,482,2262,1559,3057,2173,0,184,1135,626,9938,2371,193,179,516,475,59,103,52,71,673,588,4195,1127,11767,2841,269,216,0,184,1159,824,251,226,84,148,695,467,1498,2098,0,184]
[null,null,null,null,null,null,null,null,493641,19652,2509,983,6995,1948,38916,5726,3472,1354,"N/A","N/A",15150,2598,6764,2194,474,413,3199,1061,21004,3394,10790,2458,11906,2720,5331,1519,21251,3521,5891,1629,2284,987,2790,984,3763,1292,5180,1525,1256,951,7902,2347,14356,2682,8921,2069,8539,1942,2556,993,6729,1595,3060,1275,3302,2007,27968,3857,1327,615,12057,2447,5921,2240,31261,5136,11195,2366,1827,1272,10653,2869,6671,1795,22724,3271,10466,2392,1648,697,4110,1492,826,674,5802,1880,43005,5519,12172,2457,544,345,15625,3457,34569,4540,1413,1135,5681,1716,1886,1117,2323,1076]
[null,null,null,null,null,null,null,null,205060,11855,3108,1610,3457,1695,10589,2218,1043,580,22152,4260,"N/A","N/A",1317,677,70,133,488,387,8615,1907,5834,2086,2536,1020,2660,1468,6374,1617,4336,2128,2776,1486,5283,1843,2500,2135,5048,2468,20,40,2844,1196,5939,2238,3343,1293,2992,909,835,522,3771,1262,2021,923,4472,1729,3789,1433,679,308,2464,1179,6520,1851,7250,2604,4378,1678,1918,1071,4533,2214,4582,2102,2419,836,3950,1530,137,153,2383,1479,756,553,2535,1135,17355,3352,6398,2035,503,371,3796,1568,4853,1401,837,429,3000,1006,5602,2808,1144,903]
[null,null,null,null,null,null,null,null,80311,6574,46,103,439,511,3167,3028,200,228,3161,1015,367,341,"N/A","N/A",22,36,288,230,6578,1844,1702,971,408,476,97,155,912,583,53,90,0,193,0,193,124,159,909,733,1224,696,1752,748,8743,1587,753,539,605,564,276,293,358,330,50,91,45,74,172,166,1009,551,5665,1490,444,450,23310,3774,3379,1609,0,193,287,254,415,411,35,58,2214,1037,1558,689,940,665,0,193,260,216,3279,1568,45,69,709,556,1729,707,1593,1274,174,293,711,684,104,120,3228,1540]
[null,null,null,null,null,null,null,null,34757,4691,119,164,692,920,188,227,0,182,2221,2189,0,182,1489,679,"N/A","N/A",11,21,715,481,179,224,0,182,32,51,567,468,62,80,30,49,113,190,0,182,178,266,0,182,5649,1598,157,131,227,233,351,390,58,110,80,138,0,182,91,116,572,474,99,127,5846,2122,85,136,3566,1751,1349,809,0,182,191,201,0,182,0,182,6828,1815,135,185,298,235,0,182,344,440,133,158,166,279,0,182,1746,910,29,49,161,205,0,182,0,182,56,90]
[null,null,null,null,null,null,null,null,53830,5001,79,138,1247,715,902,646,35,59,4999,2108,677,546,618,439,78,127,"N/A","N/A",1705,661,1079,470,38,87,46,75,795,446,469,379,133,221,164,267,112,136,283,295,194,244,14120,2487,1524,717,944,670,393,240,44,74,337,354,0,197,172,182,42,69,197,183,1451,792,116,139,3085,851,985,503,0,197,651,429,0,197,157,182,1494,608,635,596,150,140,0,197,577,478,1473,826,116,145,267,250,9537,1762,481,358,293,219,721,420,215,303,0,197]
[null,null,null,null,null,null,null,null,537148,19784,18599,4762,10704,4327,6473,1865,3321,1136,20386,4221,8766,2537,8975,1882,1099,608,780,481,"N/A","N/A",42754,6205,3177,2730,1268,923,22565,3828,13803,2852,3864,1332,5661,3133,6912,1607,5550,2266,7348,3032,10442,2378,15159,2747,23400,3519,5460,2185,5490,3345,10666,3498,1758,2104,945,713,1241,515,2362,922,27606,4242,2853,1004,53009,5886,23133,3843,239,203,22927,4305,3142,1301,2919,1736,25659,4174,3050,1458,11366,2719,1070,762,16275,3583,28564,4750,2499,1348,2747,1190,25697,3965,4943,1710,3533,1587,6216,1993,773,567,21638,4641]
[null,null,null,null,null,null,null,null,277466,14075,13864,2903,2654,1444,6657,2675,1041,519,14174,3182,4710,2093,1829,824,226,246,1352,994,42870,5472,"N/A","N/A",1409,831,936,797,7143,1833,5972,2678,1687,1036,1497,707,6172,1972,4100,1490,222,178,3619,1621,4153,1720,9949,3100,2237,2164,3280,1372,3377,1479,251,224,1283,1001,3783,2622,15,27,4920,1544,915,512,13957,3960,16009,2963,207,250,7501,2501,3299,1818,453,472,9076,2622,440,620,18611,3871,257,291,17606,4620,16198,3367,20,35,84,142,10702,2094,1965,826,1237,625,3441,1725,106,154,1730,1190]
[null,null,null,null,null,null,null,null,55145,5749,608,479,1417,869,1865,695,24,54,9756,1508,1216,574,191,222,278,253,230,253,2780,1227,1448,639,"N/A","N/A",404,431,318,194,292,261,84,98,1135,709,485,630,207,183,91,147,2491,1610,1266,962,321,189,192,240,44,52,944,630,131,172,75,125,760,424,85,119,410,435,284,243,2382,1279,2241,1274,0,177,884,995,1095,933,1763,764,1087,770,106,176,644,460,459,726,1314,675,3300,1887,2183,1283,0,177,1393,755,5920,1901,197,330,295,234,50,66,336,436]
[null,null,null,null,null,null,null,null,59283,6040,575,838,1198,790,2424,1307,291,268,10280,2708,1186,614,44,81,120,199,116,124,2014,1608,583,848,206,194,"N/A","N/A",532,469,283,282,90,170,63,69,83,128,54,92,0,187,107,161,338,391,683,777,637,528,87,170,214,259,3800,2162,35,60,2535,1031,0,187,214,206,675,554,938,554,817,843,0,187,1018,753,93,108,4963,1377,169,181,0,187,205,238,118,192,1957,1539,1352,714,6617,3016,0,187,269,388,10398,1919,0,187,225,272,677,406,136,228]
[null,null,null,null,null,null,null,null,208755,10844,883,478,2250,1511,7139,2314,1587,643,14940,2770,3036,1235,955,634,234,228,1066,615,12687,2735,8745,3894,869,593,1384,868,"N/A","N/A",16907,2654,8529,1959,2009,988,2923,1049,1229,561,526,347,1865,755,3296,1088,12583,3412,6537,1781,2744,1178,13264,3449,228,183,1302,637,1478,817,283,255,2366,1097,1359,1078,7561,2307,3761,1150,196,184,6872,1834,1491,860,954,517,4588,1506,462,478,1583,875,394,444,4648,1468,16780,3035,1154,495,156,133,4311,1212,2704,971,1221,1224,14414,2249,302,309,2049,1480]
[null,null,null,null,null,null,null,null,134137,9664,1625,788,479,429,2763,1095,564,753,6033,1477,1225,531,823,595,639,831,1045,733,11472,2864,2258,1176,856,998,186,176,28436,4261,"N/A","N/A",1678,860,1624,785,11177,2929,736,416,0,184,1050,648,837,590,11017,2594,1543,732,1948,1655,4526,1802,134,191,591,541,1011,549,0,184,1537,1034,219,245,2316,724,2665,884,113,164,11235,2192,1198,725,387,239,2419,1101,0,184,1414,901,111,147,3547,1422,4490,1562,105,124,0,184,1932,1101,258,221,507,345,1727,769,1681,2023,136,194]
[null,null,null,null,null,null,null,null,75760,5982,503,400,951,814,1590,803,451,237,3268,1296,3252,1250,112,135,0,151,151,155,4335,2060,596,481,521,476,290,218,11969,2313,1716,1097,"N/A","N/A",918,500,819,609,763,568,78,125,419,287,585,520,946,497,7505,1826,751,621,4168,1021,452,305,7698,1806,681,602,56,93,1018,767,114,188,1230,819,734,428,833,617,1127,692,1465,974,348,302,451,353,0,151,943,556,1158,441,1148,871,3553,1275,886,880,0,151,268,200,919,485,22,41,3607,849,392,316,786,1190]
[null,null,null,null,null,null,null,null,88284,7145,853,609,333,407,3094,1630,2158,890,5411,2012,3746,1360,210,208,0,165,456,737,3118,1380,1896,1395,149,156,456,356,1702,582,1679,839,1527,860,"N/A","N/A",617,476,438,408,211,225,282,282,187,203,1125,682,682,367,452,501,21022,3073,300,326,4126,1245,851,606,0,165,267,228,1029,627,571,367,813,476,261,263,1310,638,8408,2299,848,557,918,672,18,31,556,375,154,195,1542,825,8468,2434,97,106,70,138,1705,853,3265,1675,139,132,486,530,278,239,82,147]
[null,null,null,null,null,null,null,null,112787,7854,4137,1628,304,370,1103,715,518,299,3415,1157,712,572,246,290,706,774,254,262,9232,2697,4173,1184,647,665,50,91,4445,1359,12203,2150,238,257,602,464,"N/A","N/A",666,294,46,80,1120,615,419,285,7302,1809,605,346,646,467,2381,1021,0,181,723,588,301,294,84,103,496,551,554,348,5239,1774,3643,1903,122,192,17041,3384,577,437,298,212,2226,964,0,181,1347,671,0,181,10064,2378,3345,1420,464,360,45,81,3319,1111,1988,998,3346,1472,1395,845,0,181,170,197]
[null,null,null,null,null,null,null,null,91215,6941,2329,1114,403,467,2021,1191,3645,2324,5139,1438,1433,1002,164,149,0,193,596,517,6534,2276,4478,1559,378,283,265,242,1229,466,1359,954,544,447,420,392,1649,1224,"N/A","N/A",251,334,642,701,549,354,1080,782,330,324,6791,1938,1591,684,428,524,745,538,931,682,11,21,975,575,150,188,2786,1105,2284,1152,64,113,1115,773,2159,1365,195,232,1239,616,737,695,1914,1377,0,193,2348,1546,24488,4076,277,288,45,72,1857,1033,1581,631,238,271,682,474,146,216,655,507]
[null,null,null,null,null,null,null,null,27523,3132,129,172,38,48,230,170,0,155,1610,860,314,287,1468,620,234,299,32,55,2926,1292,511,538,0,155,143,128,195,277,0,155,7,16,277,401,482,521,15,30,"N/A","N/A",325,263,3887,1167,116,123,430,359,79,134,69,112,0,155,82,136,35,56,3655,1077,405,281,272,320,2519,1180,1112,574,0,155,628,368,79,115,215,255,976,600,1024,656,173,143,0,155,985,1062,496,381,200,183,349,340,573,408,118,137,51,85,0,155,59,81,38,69]
[null,null,null,null,null,null,null,null,154983,8958,1261,713,1947,1123,760,359,136,159,8614,2155,1071,609,881,516,4100,1303,21213,3437,9610,2515,4610,2430,610,474,429,444,3621,1647,1210,709,569,389,1726,1123,715,602,606,441,332,261,"N/A","N/A",3977,1805,2167,973,1422,707,581,706,256,199,0,190,132,152,330,258,1124,820,6260,2244,638,453,11736,2585,7507,2284,116,94,2522,1035,463,447,378,426,15485,2922,82,95,2297,1139,0,190,1800,986,5612,1271,1061,831,589,598,20579,2668,1431,884,1957,799,460,371,0,190,294,249]
[null,null,null,null,null,null,null,null,142577,7863,636,622,890,600,1972,979,394,340,12770,2994,980,438,10525,2062,506,505,379,219,12890,2568,2789,1129,1108,564,188,164,2886,1041,677,497,151,251,565,429,52,87,1556,742,3907,1349,2381,895,"N/A","N/A",1337,680,966,367,155,186,453,218,49,81,182,189,787,544,13331,2144,8046,1874,521,364,19467,2432,2514,1003,81,133,1829,772,297,206,1528,1359,8236,1924,6863,1317,2477,1120,194,326,823,342,3694,1078,1027,666,2534,913,4098,1470,1653,696,385,569,584,445,264,404,4056,1883]
[null,null,null,null,null,null,null,null,133981,8566,2341,1013,1152,685,7168,3100,906,559,8085,1721,2363,967,798,506,114,164,274,282,13146,3306,4270,1652,291,238,242,371,10047,1702,10976,2324,993,495,805,608,3409,1388,1284,662,261,218,2201,1094,1720,764,"N/A","N/A",1127,512,922,671,2206,695,218,171,113,137,1354,715,446,342,1617,721,1318,685,5731,1680,3912,1056,265,202,11318,2251,705,307,811,440,2739,686,68,114,1822,797,66,77,3259,997,8638,2574,819,534,60,120,3057,855,2146,839,353,279,4768,1111,1277,862,782,797]
[null,null,null,null,null,null,null,null,101042,6534,1299,919,523,312,3065,861,375,222,8086,2263,3565,1095,696,360,0,139,310,353,2372,752,2235,1482,1277,1179,575,531,5896,1405,2026,1057,7220,1774,924,513,57,103,791,858,187,136,1841,2080,814,434,2212,822,"N/A","N/A",202,323,1709,750,1257,900,992,477,932,542,0,139,1038,546,322,224,1849,732,1745,956,6672,1485,2635,1248,1212,894,781,513,1106,570,299,226,1705,1448,3442,990,1738,1141,4001,1244,429,312,77,126,1037,434,1685,678,0,139,17618,2358,213,213,134,136]
[null,null,null,null,null,null,null,null,73500,7080,5141,1870,0,198,710,509,2680,1447,4371,1070,799,426,106,147,0,198,97,164,4676,1396,2669,865,184,191,586,597,2703,933,1200,621,160,275,400,339,446,276,8588,2293,163,167,379,262,67,113,1768,1071,568,385,"N/A","N/A",2634,1581,166,168,138,159,526,342,60,117,2127,1495,86,102,1492,660,1709,609,98,118,896,703,562,352,465,768,613,434,185,229,596,469,79,129,11643,2856,7230,2491,454,724,0,198,1929,1285,433,309,0,198,611,521,307,287,81,108]
[null,null,null,null,null,null,null,null,162930,8034,1333,768,2186,1289,2297,741,9434,2224,10717,2409,3798,1371,410,331,234,314,144,172,8374,1990,3451,1391,2114,1271,596,478,22001,2893,4184,1267,5956,1324,20218,3673,2291,1067,1178,651,996,1247,1246,717,810,486,2964,1169,2798,1265,1110,532,"N/A","N/A",511,506,1999,833,836,366,35,58,960,536,451,309,2834,918,3988,1420,636,462,3557,1317,5298,2199,1186,899,1535,639,361,582,2856,1625,527,542,3122,1350,9278,2841,3287,1733,318,413,2609,1081,2312,1093,148,181,2636,999,810,452,826,958]
[null,null,null,null,null,null,null,null,37690,4305,31,55,726,442,1548,938,63,102,5428,2229,2135,896,0,157,0,157,0,157,1875,1029,292,270,556,572,3385,1349,542,371,163,164,415,384,224,268,367,352,0,157,225,269,33,65,97,109,822,760,481,297,32,58,447,385,"N/A","N/A",108,149,968,499,115,177,156,198,259,178,482,371,1082,808,977,604,402,332,1018,948,2950,1687,457,362,0,157,230,304,191,142,45,40,1393,612,260,261,87,135,156,153,4783,1555,0,157,750,425,934,387,0,157]
[null,null,null,null,null,null,null,null,43266,4512,245,275,626,531,2406,1120,363,317,3438,1425,2023,791,0,149,0,149,0,149,1368,978,786,482,165,149,315,374,1193,546,290,214,6815,2803,3103,822,131,133,411,371,68,90,129,126,195,112,258,197,1489,1049,176,132,2223,836,108,156,"N/A","N/A",233,178,0,149,524,363,158,187,318,246,874,414,497,492,563,373,587,408,106,113,702,528,0,149,456,381,2507,677,232,184,3130,1218,229,230,79,131,1076,758,1327,673,111,152,316,218,917,371,0,149]
[null,null,null,null,null,null,null,null,124285,9956,761,724,2161,1047,8748,2540,353,404,49978,7637,6402,2736,143,181,373,521,468,759,3381,1488,745,477,2053,949,1503,743,2822,1412,362,341,714,592,1202,1085,952,651,421,296,209,286,934,689,318,267,1235,574,1157,718,783,658,694,516,1086,605,714,551,"N/A","N/A",175,230,912,600,1138,665,3521,1460,767,589,702,661,1407,791,1520,1384,3101,1186,1601,1078,336,548,480,403,0,200,1699,822,5484,1772,4605,1899,121,222,1135,832,2997,1103,100,161,1046,666,766,706,237,356]
[null,null,null,null,null,null,null,null,50484,5282,0,181,437,378,440,413,0,181,1514,935,572,637,1345,478,0,181,101,131,2746,1312,470,324,43,78,20,38,673,608,297,365,53,89,102,161,284,250,7,13,6118,1749,33,57,18990,3350,426,441,0,181,0,181,289,262,0,181,110,136,0,181,"N/A","N/A",591,330,223,279,2905,1027,1609,1456,0,181,324,240,186,266,208,299,890,561,1248,819,323,257,0,181,77,133,2150,1715,557,762,2960,1339,660,433,113,119,80,131,239,277,71,120,75,123]
[null,null,null,null,null,null,null,null,130223,7649,779,509,359,437,1328,704,57,70,4330,1070,380,264,3466,1711,1921,1383,840,637,10649,2430,3002,1032,22,41,113,134,2052,874,1039,559,357,405,426,405,631,614,339,343,430,388,3474,1241,4907,1730,324,191,570,429,106,165,384,363,67,112,35,58,908,526,126,219,"N/A","N/A",45,75,40495,4293,3236,1238,55,93,1452,596,1540,1537,760,587,23597,2976,429,410,2372,1386,581,644,1400,612,2509,1335,425,341,35,57,5024,1899,1847,1244,297,201,680,457,23,30,2574,1462]
[null,null,null,null,null,null,null,null,54693,5877,787,509,320,264,6391,1673,410,286,4536,1440,4780,1546,280,250,100,136,25,51,4707,2184,192,184,168,127,355,352,790,530,660,524,384,331,672,537,159,160,790,883,57,80,505,355,303,298,602,490,284,428,451,630,1216,793,139,162,194,220,604,853,268,259,252,271,"N/A","N/A",1111,618,335,373,41,82,1178,1049,1076,568,932,481,822,666,0,185,325,260,509,547,338,274,11955,2917,1382,889,81,103,1560,1330,1251,575,0,185,321,514,95,100,429,466]
[null,null,null,null,null,null,null,null,270053,11861,1364,864,4002,2016,4146,2468,247,203,24623,2557,3596,976,14595,2921,477,284,3936,1392,27392,3450,7592,1925,1598,734,607,472,8017,2204,3040,1128,955,658,1437,906,1753,808,1083,465,1345,536,7321,1575,15073,2292,5191,1445,1059,631,773,800,3310,1260,421,424,78,108,600,382,2760,1059,42574,4802,646,445,"N/A","N/A",10544,2568,77,129,4625,1103,1327,652,1055,716,22895,3206,3222,1538,5952,1542,0,185,1279,624,11231,2384,622,489,2764,1025,7939,2109,2614,840,921,689,979,507,396,370,7321,1791]
[null,null,null,null,null,null,null,null,273149,13136,4329,1544,1458,925,3493,1189,861,649,13883,2813,4790,2047,4914,1990,2180,1732,1801,687,26365,3750,16823,2851,1566,921,334,256,6378,2177,4532,2259,775,524,1595,748,1531,794,919,758,1259,972,9005,2221,3710,1158,6161,2547,1523,838,2377,1092,2623,1742,244,306,628,628,1627,807,754,525,11468,4262,1138,705,19891,3951,"N/A","N/A",206,232,9337,2484,1263,753,1333,772,12179,2356,290,198,25532,4732,351,186,9230,2122,12638,2381,1189,1040,445,291,26759,4229,5915,2630,2677,985,2266,980,604,687,2025,1218]
[null,null,null,null,null,null,null,null,38213,3616,83,142,70,105,1571,788,0,141,999,460,546,293,65,100,0,141,70,112,950,860,98,154,160,148,540,521,799,523,55,77,458,316,161,122,22,44,18,27,98,176,232,311,187,281,757,571,15257,2266,72,109,1490,1346,1776,709,950,764,854,572,0,141,140,231,161,228,331,331,231,243,"N/A","N/A",6,14,280,260,724,529,114,157,244,255,14,28,1754,822,746,694,1414,756,43,60,758,1014,403,309,1604,796,0,141,543,327,365,269,0,141]
[null,null,null,null,null,null,null,null,196391,9611,3705,2297,2207,1757,4929,1912,884,604,8995,1803,3180,1230,1355,887,1079,696,985,722,16366,2560,8052,2973,1198,591,412,295,9510,2157,13534,2157,1039,765,1166,617,13227,2976,2214,1011,1189,889,5026,2570,2189,808,16336,2656,1122,597,1017,865,3026,1068,276,292,1052,656,907,525,189,156,4703,2119,1361,817,8732,1741,5498,1525,453,346,"N/A","N/A",858,417,432,307,14147,2612,435,384,2445,1029,47,76,3542,1429,11760,2739,197,211,364,350,3193,1055,2862,2150,7820,2219,974,725,202,210,1403,910]
[null,null,null,null,null,null,null,null,108972,6570,1030,467,1279,600,2974,1435,5777,1187,8950,2184,4717,1556,0,149,380,288,151,148,5011,1525,2581,935,189,295,905,600,1100,487,1490,936,1088,689,7065,1535,1354,898,2562,1354,167,260,750,685,1233,906,1347,671,906,469,1850,752,5210,1349,798,710,300,208,1101,799,549,383,1523,748,1244,712,1981,936,1961,912,308,340,1148,533,"N/A","N/A",1261,771,494,285,0,149,569,346,108,154,2471,1035,25508,2960,2588,1465,197,316,1749,829,1574,575,368,298,1061,758,45,68,0,149]
[null,null,null,null,null,null,null,null,118925,7769,373,425,2513,953,7954,2060,165,158,31862,3767,4472,2133,381,457,0,193,696,919,1660,620,1032,523,2501,813,5093,1880,1676,1192,1380,1000,834,781,556,534,202,261,227,229,446,353,457,422,760,604,570,338,1792,799,186,237,403,269,2192,968,570,448,5935,2774,39,65,385,327,920,676,2379,1032,1482,1046,42,85,1411,789,725,546,"N/A","N/A",904,535,177,214,461,364,119,143,802,583,3347,1277,4793,2328,367,435,676,510,21224,3153,593,502,426,284,765,664,152,177]
[null,null,null,null,null,null,null,null,215500,8872,1926,1318,1658,857,3529,1256,573,315,7772,1558,2574,1488,3311,905,4814,1468,2921,830,14631,2565,4337,1703,245,180,359,350,3749,1137,1599,680,125,177,967,860,1233,604,694,431,988,675,17529,3084,5900,1368,2642,1235,1169,588,55,49,1171,575,135,169,214,187,1600,999,1138,609,33791,4576,1001,740,32898,4482,6380,1734,166,195,14319,2479,378,253,234,220,"N/A","N/A",771,472,3023,869,159,206,1273,533,6768,1688,1276,804,1012,873,11960,2213,1787,1202,6762,2075,1550,722,434,439,7847,2646]
[null,null,null,null,null,null,null,null,33446,3551,20,44,0,200,93,151,0,200,2146,811,332,315,4170,1101,0,200,313,381,2752,1143,168,211,120,145,0,200,385,382,0,200,0,200,27,47,286,405,24,45,279,249,482,325,11253,1937,230,169,131,131,0,200,210,158,0,200,188,250,25,48,611,385,1219,641,36,58,3603,1335,478,508,0,200,63,80,0,200,139,235,735,552,"N/A","N/A",481,609,0,200,120,199,823,433,0,200,53,76,1008,569,287,320,0,200,135,124,21,32,116,186]
[null,null,null,null,null,null,null,null,156705,9611,1665,635,1244,1016,2222,1160,839,526,5979,1473,1915,1059,1590,729,697,492,435,352,11552,2367,18570,3616,638,493,198,321,2125,1128,3802,1911,643,437,1064,855,1924,991,2709,2265,2077,942,3565,1205,2313,826,2966,1289,757,582,1407,802,1884,724,93,127,158,165,1025,834,917,696,6517,2181,1052,1085,10746,3642,24764,3907,656,650,4388,1326,555,354,255,202,6497,2067,538,332,"N/A","N/A",816,1252,3550,1136,5351,1482,566,425,298,244,9377,3040,1629,1165,1345,720,832,570,0,197,1070,890]
[null,null,null,null,null,null,null,null,26051,2891,0,147,855,1127,435,333,227,354,1494,663,1744,839,2,4,0,147,0,147,970,638,122,130,8,13,78,104,74,102,210,289,2441,932,403,295,0,147,0,147,0,147,60,65,61,101,892,747,3568,1023,34,48,474,274,248,208,2175,801,135,171,0,147,0,147,175,187,371,317,240,220,1725,823,64,77,21,36,667,583,515,633,0,147,158,159,"N/A","N/A",507,346,1715,1067,388,372,5,9,340,300,1026,681,131,216,314,413,979,735,134,235]
[null,null,null,null,null,null,null,null,177098,10625,12116,3309,1281,847,2250,907,3306,1731,8396,2447,2473,1156,936,900,176,222,180,203,15641,3639,16012,3114,1058,1052,787,817,7094,1891,5591,2209,617,556,2630,1972,13202,2695,2452,1206,1040,589,1743,867,1525,706,4507,1434,1178,896,10568,2321,2694,1254,308,278,432,389,735,443,271,287,783,507,751,640,6279,2008,5904,1834,7,16,6200,1742,2495,1410,1080,589,3329,999,26,55,4300,1280,0,193,"N/A","N/A",8716,2938,784,1131,133,133,8008,2159,1876,852,3248,1760,1622,727,358,382,717,499]
[null,null,null,null,null,null,null,null,507752,20202,9993,3132,6759,2614,18908,3870,13781,3771,62702,8792,16616,3638,2769,1124,181,168,1189,610,31259,6252,20362,3365,5040,2386,2387,1190,19672,3645,8264,2734,4934,2063,12699,3202,6040,2224,29348,5712,1293,1284,4969,2026,4813,1584,9501,2273,2803,948,6402,2032,12319,2205,1813,986,4794,2045,8266,4162,761,749,6797,2141,16762,3127,20274,4211,22660,6953,989,542,8728,1739,26284,4418,3827,1684,10449,2158,1763,1605,4470,1665,1264,757,10368,2623,"N/A","N/A",4610,2045,113,135,17734,4904,11630,2741,1729,938,4192,1322,2472,1676,4435,1611]
[null,null,null,null,null,null,null,null,87870,7490,126,171,2819,1292,7966,2419,361,402,15286,2837,5350,1845,142,168,0,181,0,181,2428,1105,1142,622,1436,876,5129,1135,1588,802,475,296,2791,2779,398,333,217,221,345,313,380,339,613,361,1503,1343,1670,1210,385,300,284,229,1553,769,1057,729,489,384,5391,1743,507,442,437,322,686,505,2129,924,842,611,175,218,1875,881,1338,691,4089,2693,944,450,351,571,60,100,47,74,863,529,3605,1278,"N/A","N/A",39,63,1369,668,3529,1319,0,181,1445,1512,2216,715,239,190]
[null,null,null,null,null,null,null,null,24431,2713,16,23,93,153,127,165,0,143,1112,537,382,296,1626,540,0,143,116,134,966,519,56,81,6,10,0,143,230,221,68,81,30,43,0,143,1243,1690,73,105,883,546,862,396,3318,657,284,246,315,349,0,143,23,26,147,189,0,143,17,37,2893,812,833,364,74,89,4780,921,328,248,0,143,214,247,11,13,26,38,935,525,341,220,124,208,39,66,193,185,493,334,81,96,"N/A","N/A",728,427,98,109,0,143,151,115,96,102,0,143]
[null,null,null,null,null,null,null,null,250653,11997,2515,990,1906,1287,2420,1030,445,319,14780,2760,5352,1834,2725,1001,2279,1465,10964,4084,19574,3694,9535,1889,3823,1460,652,411,7089,3237,2663,1228,221,209,1144,669,3908,1422,1638,936,1144,689,23925,4264,3767,1503,2982,1136,2294,1414,1344,730,1914,837,658,433,357,313,973,522,535,398,9073,2029,947,637,15893,3260,25575,4182,852,1019,5622,1519,2810,1873,1541,1069,14190,2998,1605,731,7936,2435,35,57,6189,1858,12944,2828,2092,994,423,437,"N/A","N/A",4160,1420,3839,1234,1258,880,143,166,516,466]
[null,null,null,null,null,null,null,null,215494,12552,1507,730,4328,1682,8362,2641,1413,1121,45597,5884,5195,2150,2901,1138,100,164,773,528,9370,2417,6363,2288,5239,2393,10604,2191,4298,1727,1089,521,1159,845,2544,1029,1368,911,1646,915,532,655,1191,923,2911,1011,3470,1605,2703,1971,615,444,2802,1017,2919,1013,682,456,5671,2919,309,248,2300,1441,872,527,5562,1947,4088,1854,217,200,3192,1400,1223,768,25525,4052,3397,1799,97,162,2727,1542,94,155,3206,1819,14196,3417,5298,1995,223,216,3839,1320,"N/A","N/A",215,271,1168,638,394,495,1025,878]
[null,null,null,null,null,null,null,null,47125,4317,477,339,306,455,79,129,0,182,1231,516,104,114,143,177,674,525,294,194,1919,666,1108,483,166,277,181,250,220,190,328,406,68,111,39,64,2249,1019,90,88,35,74,5352,1897,164,191,778,581,20,37,0,182,59,76,0,182,0,182,229,268,129,147,1213,679,81,90,1721,965,4683,1933,175,215,6757,1474,520,447,118,207,5208,1699,0,182,1098,671,36,65,1061,513,622,415,0,182,54,89,6317,1774,297,285,"N/A","N/A",470,555,252,395,79,123]
[null,null,null,null,null,null,null,null,99192,6959,323,262,236,193,3257,1696,253,216,5347,2126,1600,604,657,432,296,475,15,25,4937,1590,970,396,333,416,360,231,22285,3020,2480,1136,4161,1283,1160,1199,635,502,598,403,233,195,1306,586,489,356,3917,1160,18965,2405,238,211,1263,681,784,512,324,240,1163,682,3,7,606,477,526,553,2033,980,2939,1454,284,318,2610,1053,289,204,945,601,1563,750,144,157,1053,675,329,220,1051,638,2765,1112,900,1091,62,88,1267,916,1208,416,0,145,"N/A","N/A",30,46,975,943]
[null,null,null,null,null,null,null,null,31149,3430,260,284,590,661,2014,1234,244,405,2035,720,5599,1618,0,185,0,185,0,185,733,572,166,173,0,185,745,481,905,823,179,179,259,273,539,412,4,10,88,100,0,185,294,304,548,638,965,730,290,240,136,229,244,257,1901,789,1216,559,355,304,0,185,121,147,604,658,231,252,459,399,338,300,819,447,964,670,893,605,230,254,0,185,122,201,1175,730,4,7,1427,920,1710,948,0,185,138,169,1323,785,0,185,282,210,"N/A","N/A",16,27]
[null,null,null,null,null,null,null,null,20044,2902,8,15,57,94,54,90,93,158,519,484,0,214,370,365,0,214,0,214,4192,1203,232,300,110,172,0,214,1021,602,121,153,0,214,143,240,37,72,59,101,0,214,108,177,2258,1289,435,451,0,214,0,214,0,214,0,214,0,214,0,214,0,214,1922,1129,28,48,2314,761,638,565,0,214,328,499,0,214,0,214,2313,1063,624,688,4,7,0,214,15,31,360,291,0,214,0,214,684,777,0,214,8,15,989,654,0,214,"N/A","N/A"]

{"sheet":"2011","index":2,"n_rows":120,"n_cols":114,"rows_kept":120,"cut":false,"hidden":true,"merged":[[6,1,8,1],[6,2,7,3],[6,4,7,5],[6,6,7,7]]}
[]
[null,"Table 2  State-to-State Migration Flows*: 2011"]
[null,"Dataset: 2011 American Community Survey 1-Year Estimates"]
[null,"Universe: Population 1 year and over"]
[null,"Source: http://www.census.gov/hhes/migration/files/acs/st-to-st/State_to_State_Migrations_Table_2011.xls"]
[null,null,null,null,null,null,null,null,"ESTIMATES",null,null,null,null,null,null,null,null,null,null,null,null,null,null,null,null,null,null,null,null,null,null,null,null,null,null,null,null,null,null,null,null,null,null,null,null,null,null,null,null,null,null,null,null,null,null,null,null,null,null,null,null,"Margin of Error"]
[null,"Current residence in --","Population 1 year and over",null,"Same residence 1 year ago",null,"Different residence, same state 1 year ago",null,1,2,3,4,5,6,7,8,9,10,11,12,13,14,15,16,17,18,19,20,21,22,23,24,25,26,27,28,29,30,31,32,33,34,35,36,37,38,39,40,41,42,43,44,45,46,47,48,49,50,51,52,53,1,2,3,4,5,6,7,8,9,10,11,12,13,14,15,16,17,18,19,20,21,22,23,24,25,26,27,28,29,30,31,32,33,34,35,36,37,38,39,40,41,42,43,44,45,46,47,48,49,50,51,52,53]
[null,null,null,null,null,null,null,null,"State of Residence Last year (Estimate)",null,null,null,null,null,null,null,null,null,null,null,null,null,null,null,null,null,null,null,null,null,null,null,null,null,null,null,null,null,null,null,null,null,null,null,null,null,null,null,null,null,null,null,null,null,null,null,null,null,null,null,null,"State of Residence Last year (Margin of Error)"]
[null,null,"Estimate","MOE","Estimate","MOE","Estimate","MOE","TOTAL","Alabama","Alaska","Arizona","Arkansas","California","Colorado","Connecticut","Delaware","District of Columbia ","Florida","Georgia","Hawaii","Idaho","Illinois","Indiana","Iowa","Kansas","Kentucky","Louisiana","Maine","Maryland","Massachusetts","Michigan","Minnesota","Mississippi","Missouri","Montana","Nebraska","Nevada","New Hampshire","New Jersey","New Mexico","New York","North Carolina","North Dakota","Ohio","Oklahoma","Oregon","Pennsylvania","Rhode Island","South Carolina","South Dakota","Tennessee","Texas","Utah","Vermont","Virginia","Washington","West Virginia","Wisconsin","Wyoming","Puerto Rico","TOTAL","Alabama","Alaska","Arizona","Arkansas","California","Colorado","Connecticut","Delaware","District of Columbia ","Florida","Georgia","Hawaii","Idaho","Illinois","Indiana","Iowa","Kansas","Kentucky","Louisiana","Maine","Maryland","Massachusetts","Michigan","Minnesota","Mississippi","Missouri","Montana","Nebraska","Nevada","New Hampshire","New Jersey","New Mexico","New York","North Carolina","North Dakota","Ohio","Oklahoma","Oregon","Pennsylvania","Rhode Island","South Carolina","South Dakota","Tennessee","Texas","Utah","Vermont","Virginia","Washington","West Virginia","Wisconsin","Wyoming","Puerto Rico"]
[null,"United States",307900319,29996,261087925,263315,37998701,233440,6987416,106806,88850,211816,77226,562343,160623,91295,26631,49732,437202,248892,61940,57831,269008,143228,74516,94180,99256,86593,33729,165041,145869,186505,103253,68597,138404,31204,52809,115943,43277,216369,61431,377800,225147,26563,206049,81009,109795,215127,31065,121426,29383,154243,404839,73211,18172,229227,190644,45956,105370,31991,76218,77858,10575,10161,17644,6899,20646,10427,7653,3629,4949,19015,13318,7295,7401,13750,10568,6398,10699,7329,8952,4154,11278,10414,13304,6978,7559,11145,4179,6362,8686,4875,12474,5579,15333,14191,3090,11406,8616,8590,11482,4192,9952,4358,9679,17998,7130,2845,11582,11567,5684,8011,4631,8799]
[null,"Alabama",4745278,4078,4024442,22751,588293,20366,117726,"N/A",1771,1677,1642,3389,348,2921,232,399,20063,19346,1259,137,6991,1434,30,842,2686,2413,626,1606,112,2797,327,3945,1086,317,770,257,64,1996,119,1108,2697,284,2596,973,169,1075,0,2036,90,8710,7973,300,66,4935,2621,65,417,9,569,9414,"N/A",1098,1060,1063,1286,295,3231,301,359,4141,3711,1292,173,3376,634,52,632,856,972,378,987,146,1250,342,1492,536,463,638,333,109,2284,184,442,1820,333,958,840,182,474,190,973,98,2300,2240,390,108,2151,1272,110,457,15,601]
[null,"Alaska",711962,1401,571857,8892,100280,8388,35084,93,"N/A",2467,190,3098,1583,138,11,140,1188,556,1366,475,985,181,319,750,237,1077,0,216,141,771,593,554,921,248,5,532,520,128,226,940,470,0,319,616,2161,378,0,186,301,388,2492,662,68,1488,4548,89,23,246,1044,4168,113,"N/A",1902,258,1921,727,167,24,220,476,419,703,253,686,156,374,741,354,1276,149,155,120,435,568,904,1014,185,12,485,744,136,188,613,404,149,286,733,841,371,149,182,343,308,1105,731,105,1112,1520,75,35,272,962]
[null,"Arizona",6402301,5660,5107496,39045,1028366,36556,222877,833,5001,"N/A",1066,49635,10189,1875,0,389,3732,2206,2199,2190,10035,5855,4526,1708,2134,844,0,1918,743,9396,3297,1226,3872,2431,1393,8756,228,3379,4610,3880,2548,1159,4682,3219,4613,3436,72,1774,1657,1680,12688,10577,0,2233,13940,70,6473,2510,871,14358,587,2214,"N/A",740,8755,2958,1213,229,389,1842,1147,1109,1183,4129,1956,1745,883,1257,867,229,1096,430,5283,1064,1492,1689,1191,798,3417,229,1757,1448,1363,1269,891,2116,1761,1465,1476,131,1932,1589,647,2976,3336,229,1094,5479,118,2066,1288,639]
[null,"Arkansas",2906632,2928,2421746,18606,405831,18050,69845,691,560,439,"N/A",4077,746,519,79,0,3067,1446,13,179,3684,1362,851,2008,213,2120,30,133,781,1881,232,1731,7314,713,332,641,52,341,775,674,1664,214,174,3761,632,567,0,235,0,6462,14767,0,0,1245,1477,24,687,252,529,7292,573,669,381,"N/A",2327,451,654,141,192,1273,759,27,271,2143,1007,773,1142,311,1015,53,176,901,1130,396,864,2602,858,417,525,69,220,680,362,1220,248,176,1456,587,628,192,269,192,2269,2746,192,192,769,636,45,632,399,507]
[null,"California",37222678,9999,31213310,71183,5271168,68394,468428,2087,7358,35650,2648,"N/A",21245,3073,1302,3240,22094,13303,9864,4796,20834,4673,3324,2810,1201,3600,1658,7793,10244,12069,5687,2092,7677,2599,1955,36159,1222,8053,5904,25629,8708,1392,10474,5113,18165,8550,1103,5758,1004,8761,37087,8944,745,15753,36481,832,5668,2047,1344,17921,927,2501,4362,1019,"N/A",3867,1222,1343,1457,4333,3042,2683,1560,3496,1297,1701,1256,507,1751,1175,1924,2069,4117,1375,896,1995,1492,821,5100,869,2169,2207,3287,2611,898,3555,1763,2845,2017,545,2383,686,2325,5877,2725,504,2373,6266,463,1495,1810,635]
[null,"Colorado",5048443,4037,4048042,22888,763233,18937,202124,2340,3191,12338,1615,23234,"N/A",1567,501,298,8075,3250,1852,1578,6027,2116,3510,3718,1361,908,1358,3303,2157,3225,3055,879,4552,4079,4582,4061,489,2863,8797,3998,4756,2249,5527,3824,5543,3348,435,718,1340,3193,22390,3856,914,6281,5524,412,3995,2942,476,11431,1681,1622,3704,1191,3742,"N/A",838,556,301,2090,1254,832,766,1536,1289,1495,1495,1028,550,1235,1416,1085,1061,1092,621,1382,1579,1961,1432,396,1788,2308,1621,1686,1245,2388,2137,2105,1302,560,480,1037,1472,4287,1446,772,2671,2092,490,1774,923,556]
[null,"Connecticut",3548667,2644,3139496,16755,316883,15392,71502,101,180,1387,84,3699,1502,"N/A",62,607,4771,2000,587,133,1843,168,67,16,0,315,259,1267,8691,692,76,69,365,206,62,160,1221,3809,265,20015,1029,0,1383,217,117,3668,1488,997,0,123,1214,398,608,2555,2255,46,660,65,2105,6552,120,299,939,178,1455,618,"N/A",132,373,1275,988,523,224,965,214,120,36,198,238,193,744,1998,736,120,116,297,277,103,189,803,1324,225,4005,593,198,791,211,161,1639,645,476,198,141,646,359,354,1053,1469,77,898,110,1756]
[null,"Delaware",897187,1369,775414,8584,83156,6851,33912,81,329,541,0,699,169,66,"N/A",154,810,639,201,441,34,210,0,7,305,0,0,4238,806,43,201,0,713,0,12,0,0,6297,0,3141,388,0,664,27,0,8571,131,153,0,221,883,475,0,1064,482,198,55,463,1008,3955,135,544,728,192,594,218,94,"N/A",144,449,422,171,347,35,235,192,17,391,192,192,1274,558,71,299,192,684,192,28,192,192,1765,192,1083,256,192,608,45,192,1728,217,179,192,259,755,738,192,512,530,174,96,527,971]
[null,"District of Columbia ",611608,1403,489659,6701,66519,6073,48066,13,135,43,81,3797,452,981,128,"N/A",1254,937,372,68,1397,128,241,6,297,0,0,14129,2048,1108,409,83,112,38,79,238,145,1035,0,2313,1716,285,306,0,51,1589,50,357,104,421,1083,75,445,7975,476,120,946,0,0,4295,29,217,71,93,1233,321,472,125,"N/A",651,572,396,113,814,147,284,19,260,200,200,2971,789,554,457,99,184,64,110,282,139,605,200,697,760,360,224,200,64,757,63,329,129,358,491,118,489,1285,300,138,668,200,200]
[null,"Florida",18863948,8536,15742168,59355,2454255,53419,498597,12635,7405,8451,3025,22420,9383,11704,1264,891,"N/A",38658,3639,312,19152,11472,1846,2661,5441,6094,4689,15410,13701,19640,4663,5175,7114,559,3857,3527,4324,25206,1376,59288,23983,514,18191,2600,3315,20821,5002,11953,716,10451,25532,2343,2019,16614,6339,4964,7412,846,21611,22483,3566,3412,3258,1241,4065,2988,3121,949,495,"N/A",6270,2081,268,3962,3254,1137,1410,1674,2316,2049,3515,3380,3920,1888,1968,2753,424,2208,1810,1798,6219,781,7171,5251,600,3264,1168,2046,4267,2668,2956,1027,4102,4638,1891,1616,3087,2687,2202,2467,725,5621]
[null,"Georgia",9699859,5580,8095407,40769,1289450,37444,271077,18799,1079,4292,2112,14949,2325,709,619,364,42666,"N/A",1006,126,6080,2442,950,4513,3686,6541,408,3708,4436,6992,1808,5380,2514,246,4144,774,132,8371,791,14454,19138,201,6863,1632,727,5791,337,16914,536,16898,15760,793,361,9438,3701,1340,2727,504,1635,15123,5015,765,1849,1366,3387,1399,455,606,283,5232,"N/A",883,139,1774,1297,528,2909,1708,3121,269,1807,1979,2441,1416,3077,989,211,3300,559,150,3016,421,4681,3931,221,1986,1107,472,1896,504,5257,730,3610,3421,1061,334,3336,1532,778,1401,775,841]
[null,"Hawaii",1357806,1803,1160948,10743,122727,8676,57542,1268,844,2900,242,10173,950,731,784,222,3160,2519,"N/A",112,1884,402,478,125,18,179,106,341,92,1303,933,371,308,85,91,1548,107,564,354,4246,2307,32,970,685,2030,870,58,1681,0,636,3007,1040,0,2523,3790,312,147,14,238,5083,846,670,1208,260,2201,493,739,877,275,1311,956,"N/A",199,728,280,504,154,36,270,161,212,123,1067,750,391,219,140,95,795,141,697,366,2556,1256,54,677,502,1378,468,70,919,187,1018,1122,872,187,1318,1075,306,159,23,398]
[null,"Idaho",1559637,2674,1284530,13188,208434,13285,60336,263,4510,3543,224,9021,1813,0,0,0,1733,275,254,"N/A",390,296,318,479,120,51,0,0,396,615,566,62,384,1602,439,3581,129,84,141,419,263,1201,260,288,7170,343,0,55,842,296,1303,6059,0,905,8991,0,165,487,249,6293,259,2938,1771,188,2484,1022,195,195,195,1210,234,314,"N/A",342,352,424,503,170,110,195,195,625,524,352,106,304,828,591,1400,123,78,229,399,435,1099,212,243,1894,265,195,90,1132,356,952,2187,195,707,2313,195,174,340,412]
[null,"Illinois",12718402,5792,11076528,31383,1353853,28856,216204,2823,4119,7657,3185,13930,3271,1819,277,1440,17548,6042,1269,393,"N/A",23491,8420,2533,5569,1315,693,2565,3507,10274,4496,1521,13889,304,827,2454,590,3009,1573,6412,4057,105,8384,1002,792,3012,278,1582,1318,3223,11011,951,49,5233,3075,352,14507,58,2387,11862,1526,3153,1987,1513,2863,1390,959,303,708,3370,2192,735,356,"N/A",5269,1581,1130,1718,761,510,916,1540,2032,1177,581,2736,275,520,1187,334,1033,1619,1874,1663,115,1627,552,426,1197,266,783,1474,1222,2803,595,81,2524,1254,288,2936,76,715]
[null,"Indiana",6437155,3841,5478683,24180,809158,21392,127874,1562,371,3975,2016,7649,1930,1227,79,0,8595,2543,1057,1368,23071,"N/A",916,1321,10177,2241,275,480,952,7896,1168,469,1824,34,622,511,90,651,504,2518,3038,70,11109,844,505,3998,49,3306,235,3879,6326,123,530,1486,1028,216,2923,117,132,8918,1293,324,1427,1321,2229,759,698,134,190,3053,1176,717,1278,4221,"N/A",468,946,2220,1537,388,256,703,1777,568,366,1033,62,491,338,152,348,410,816,1840,94,2141,522,617,1871,84,1917,231,1292,2074,127,349,853,744,194,1307,170,220]
[null,"Iowa",3027718,2514,2573313,16682,370554,15638,70405,207,967,1411,433,3297,2891,424,0,0,707,1938,299,161,13725,349,"N/A",1776,387,228,26,487,466,1687,5634,408,3649,370,6490,2009,0,185,421,2361,1760,604,993,532,811,388,65,172,2842,623,2334,1482,38,720,856,115,2537,140,57,5539,259,651,726,317,1022,1129,628,155,155,455,1485,454,175,2238,204,"N/A",819,303,223,43,319,632,954,1117,306,1188,338,1780,1634,155,209,347,1104,1268,377,482,417,476,292,108,200,965,529,1235,940,71,854,577,181,850,117,115]
[null,"Kansas",2833584,2851,2372033,15236,362782,14847,83640,434,108,2028,998,4743,5030,412,74,128,1581,1146,287,264,2760,863,1715,"N/A",1167,519,481,3180,28,1947,679,1517,22033,270,1648,657,27,1189,769,780,1223,379,1616,5022,285,1494,180,1102,104,1066,6575,196,0,1986,772,0,893,1285,775,7144,310,84,858,697,2121,1611,519,85,141,790,666,282,358,1019,458,888,"N/A",770,338,527,2454,49,1003,418,1370,4568,255,701,359,37,724,810,411,840,558,901,1204,284,1815,261,670,147,496,1436,265,168,1018,459,168,575,791,1013]
[null,"Kentucky",4316297,3382,3686232,19523,505741,18525,110031,925,0,1818,1058,2130,221,176,0,201,7400,2725,63,36,4273,11071,536,253,"N/A",1399,71,2076,1019,3178,475,1248,2793,216,471,1358,52,1289,553,2174,3916,117,19617,1256,459,1490,640,1387,0,16852,4661,140,151,5154,1121,1174,581,57,192,9177,441,189,916,778,1154,197,251,189,248,1965,892,80,69,1415,2846,410,212,"N/A",906,137,1444,885,1248,415,868,1158,238,517,976,84,1472,370,1660,1965,195,3115,853,328,598,876,814,189,3762,1468,202,152,1719,614,566,414,93,262]
[null,"Louisiana",4518629,3250,3865118,18789,538691,17818,99138,3065,288,2010,2774,3957,1202,358,0,195,5193,4425,688,230,1189,1549,468,312,1520,"N/A",120,1221,439,1163,698,10255,1375,278,176,994,15,453,1028,1360,2134,277,2641,4235,1531,455,268,1573,37,2495,30292,179,87,2055,1075,110,339,357,393,7082,1401,266,1529,1144,898,983,264,198,168,2120,1541,808,269,417,827,441,466,1286,"N/A",163,1058,255,875,445,2829,565,364,198,623,26,269,867,849,1242,359,2281,3044,1577,473,395,1149,47,938,5028,275,149,1060,504,123,372,541,384]
[null,"Maine",1315833,1456,1120364,10400,157102,9401,33818,634,37,325,38,829,290,2481,238,239,4304,507,177,0,675,164,275,523,158,138,"N/A",52,4439,702,296,0,325,10,0,150,4302,694,144,2589,1439,19,483,25,471,915,234,587,42,394,1637,182,612,570,88,43,321,21,65,4248,541,43,301,67,428,222,668,228,177,1908,415,214,157,358,157,452,641,217,218,"N/A",105,1293,703,307,157,228,18,157,250,1394,498,191,1633,1059,31,530,48,406,418,282,429,89,513,1115,202,341,337,131,73,408,37,64]
[null,"Maryland",5759087,4326,5008452,20478,553895,18323,153979,228,671,945,423,8595,1796,1608,6652,18492,7825,7113,1170,389,2392,1318,110,689,848,860,1526,"N/A",3470,2077,810,1109,1469,73,0,1105,232,9627,797,9222,6686,0,3396,845,276,14158,197,2882,0,1942,3619,223,40,22089,1525,2027,353,80,779,9033,128,493,604,528,1773,837,903,1916,3025,1691,1789,815,366,1052,791,146,551,671,484,1245,"N/A",1341,1273,503,825,944,103,204,1033,160,1880,676,2041,2008,204,1110,592,247,3380,162,1696,204,1093,1102,230,69,3805,611,859,514,132,654]
[null,"Massachusetts",6515057,3680,5658768,20357,656441,18778,139830,1201,225,1017,167,11556,1388,9445,399,676,11396,3264,733,412,2991,640,138,969,180,977,4006,2762,"N/A",2629,862,356,1261,596,637,163,12010,8332,199,19431,3964,61,1757,90,178,6538,10182,1621,44,371,5203,548,2246,2984,1673,911,441,0,4413,8282,1083,345,518,201,2290,972,1884,579,358,2715,1666,860,695,899,456,136,867,203,1200,1526,2048,"N/A",1245,537,567,654,719,727,158,2630,1949,276,3914,1384,111,681,123,220,1883,2144,989,72,355,1491,411,944,1241,741,855,311,204,1542]
[null,"Michigan",9766574,4376,8340767,29076,1242917,25401,139158,3527,3456,3840,2054,7793,3425,1656,0,256,17712,4254,630,882,9897,7668,1709,1148,2578,955,599,1035,2861,"N/A",2671,715,2509,84,439,1215,73,1849,508,6087,3405,159,11224,917,647,2864,385,2185,571,3106,9935,642,0,2327,1430,417,4018,841,908,8465,2060,1793,1382,1024,1752,1462,1087,167,259,3844,1566,469,675,1863,1841,1026,867,1158,556,735,431,1135,"N/A",1085,558,1200,105,312,610,120,779,367,2170,1427,164,2069,570,324,1095,377,1094,599,973,2208,582,167,834,669,301,1002,655,857]
[null,"Minnesota",5277329,3380,4505462,20788,646176,19647,101029,123,893,2314,951,6638,2662,74,86,367,2820,840,901,402,8209,786,6175,606,755,573,321,424,970,5164,"N/A",549,1345,1457,1936,2682,21,631,540,2416,845,7574,1961,546,1800,870,0,447,5305,874,3062,919,177,1034,1413,92,19255,224,54,7052,150,619,1071,599,2072,1023,131,143,391,806,467,634,328,2632,470,1326,324,580,599,343,382,422,2149,"N/A",593,712,859,821,1858,26,522,319,913,520,1390,1059,399,1169,509,143,428,1596,489,1108,742,161,420,656,98,2960,178,91]
[null,"Mississippi",2943021,3088,2534036,16620,332934,15960,68511,8922,117,556,2315,4723,484,54,0,415,6152,3136,369,55,2068,611,650,66,1626,7139,0,265,1445,1610,614,"N/A",1581,0,118,84,65,269,1075,364,483,0,991,566,74,2568,41,398,6,7683,5243,332,0,1453,286,303,1136,0,318,5606,2639,102,405,1360,1290,453,74,206,434,2463,1397,429,82,853,411,603,90,841,1767,206,239,1561,900,615,"N/A",973,206,198,141,135,293,1040,449,299,206,536,362,107,1700,89,320,15,2248,1807,520,206,805,252,411,1061,206,411]
[null,"Missouri",5937896,4110,4963040,26160,801046,25054,149439,1395,2043,2356,6168,8386,3144,1516,0,215,4513,2964,871,560,20161,4404,4811,20884,1993,1728,291,716,463,2830,2026,1641,"N/A",845,4860,1544,769,1114,1016,2904,3669,977,3240,6073,777,1810,359,267,361,2676,10293,1697,88,2684,2518,196,1503,1120,709,9288,654,2471,1028,1528,1909,1163,1078,184,254,1398,972,517,439,3086,1588,1405,4170,803,905,295,317,306,1176,809,884,"N/A",541,1645,830,750,755,718,1260,1527,446,1684,2312,538,1085,424,237,296,1056,2994,946,195,1493,843,214,671,900,463]
[null,"Montana",987076,1359,828254,8593,122210,8386,33553,449,1118,1971,49,3033,2856,58,365,0,291,231,32,1543,765,646,417,845,0,0,71,57,10,353,969,0,158,"N/A",384,688,0,889,264,422,1173,360,321,96,1959,840,0,77,227,266,1329,1232,53,278,3835,14,146,2413,353,4015,318,921,1358,70,1110,1265,72,392,165,235,193,35,1005,526,646,307,492,165,165,127,71,18,295,634,165,220,"N/A",392,543,165,589,389,377,982,250,409,127,914,640,165,92,233,237,643,623,71,288,1160,28,184,1709,522]
[null,"Nebraska",1817126,2304,1505191,11978,253269,10841,52070,169,721,1646,161,5124,3245,381,0,29,1105,434,275,506,1415,615,9575,3040,352,222,122,318,0,683,1455,424,1848,64,"N/A",240,0,119,242,544,829,292,268,1255,1556,252,0,243,2999,226,5343,734,0,615,835,24,560,965,0,5507,271,785,898,146,1727,962,372,155,48,499,358,215,464,777,541,2602,1210,457,253,127,344,155,435,1009,430,771,88,"N/A",165,155,101,326,349,872,213,250,884,1249,179,155,285,1280,244,2737,507,155,478,593,40,427,421,155]
[null,"Nevada",2688336,3578,2084668,23272,480317,23514,110345,280,597,10142,310,40114,2714,189,184,983,2923,1731,4093,3929,1668,855,114,602,628,78,49,931,256,1663,1055,203,335,1137,32,"N/A",0,2118,2136,1516,1333,0,1354,258,1691,570,86,165,588,96,7249,3365,0,1740,4680,0,2672,933,153,9419,330,525,4338,358,5354,1470,163,226,1261,1608,909,2643,1734,1031,781,188,734,620,128,80,701,255,831,1329,279,237,740,37,"N/A",234,1709,1429,819,895,234,894,254,695,581,148,273,557,150,3923,2105,234,1369,1646,234,2369,702,258]
[null,"New Hampshire",1305678,2046,1141236,9064,122129,8186,37000,193,0,246,22,547,403,1617,20,68,1970,535,0,0,478,470,47,0,0,0,3080,222,15526,155,104,160,153,230,33,186,"N/A",294,186,1471,1297,47,248,0,198,1015,608,588,86,126,605,158,2138,880,428,0,0,162,0,3717,237,184,210,37,334,313,519,32,112,813,449,184,184,402,394,78,184,184,184,1064,177,2811,165,145,258,181,378,54,231,"N/A",247,179,510,649,79,223,184,267,569,301,757,102,159,438,271,991,575,497,184,184,218,184]
[null,"New Jersey",8719952,4595,7825661,21158,693380,21063,140194,189,1198,3784,57,5986,2203,1924,2100,781,12907,4268,264,256,3690,718,332,317,102,871,624,5335,4675,1889,1261,510,583,49,312,899,499,"N/A",355,40815,2482,61,1121,773,360,19733,463,1586,0,1412,3801,256,0,4458,2454,1252,214,15,4312,8607,209,790,2287,97,1519,1931,845,1025,409,3313,2025,307,262,1572,436,441,306,125,590,629,2324,1356,1056,1200,677,544,80,429,566,360,"N/A",537,4703,1416,103,608,707,331,2951,319,789,198,782,1818,229,198,1750,1946,1293,259,29,1535]
[null,"New Mexico",2055293,2718,1753413,15690,228218,13801,62130,410,416,7444,682,7066,5525,0,0,212,2806,676,81,355,466,2030,0,1333,87,184,510,2277,252,908,438,556,1183,544,353,2099,114,245,"N/A",1445,522,264,1742,234,916,492,0,145,240,899,13633,303,71,425,924,0,340,283,99,7330,494,446,3409,607,2324,1537,198,198,336,1557,406,128,326,315,2244,198,1078,152,244,384,1964,213,699,435,553,877,340,312,1159,130,229,"N/A",781,300,310,1115,203,655,284,198,204,281,577,3724,218,120,337,616,198,342,313,158]
[null,"New York",19248685,7023,17055260,37016,1756105,32216,282209,1812,6124,2821,1041,25761,3724,15123,1124,3702,29344,10584,1002,434,6914,2198,928,838,2414,1495,2915,5037,14646,3936,1824,401,1417,391,579,1785,2972,41450,461,"N/A",9336,374,5191,1425,2189,26596,1393,6947,112,2660,9151,773,3882,10800,2986,631,1878,688,10582,11956,1002,2270,1100,734,3856,1151,3667,588,1051,4718,2320,973,377,1720,958,783,397,1223,916,1114,1192,2367,947,678,266,595,282,553,1037,1172,4170,276,"N/A",1874,266,1717,887,977,3427,663,2791,121,1051,2132,482,1242,2343,1367,470,1014,645,3796]
[null,"North Carolina",9539412,5364,8070238,36924,1160510,33476,265291,5420,3991,4286,327,15373,3919,1975,954,1135,28044,16192,1806,675,5971,3228,654,4995,1637,2936,824,10485,9053,7530,1294,1273,2638,563,1056,1048,2078,10374,1737,18321,"N/A",189,10187,1390,1175,9450,444,20427,565,6057,6621,961,212,27302,3295,2780,2291,153,844,16660,2338,2185,2860,322,5531,1645,820,600,591,4471,3163,1362,615,2065,1379,530,4644,786,1135,663,2304,4920,2879,825,829,1150,549,1334,716,1738,2643,1297,3621,"N/A",272,3649,684,826,2770,384,3260,609,2083,2034,692,345,4012,1566,1517,1192,228,447]
[null,"North Dakota",675161,1047,559906,6503,79837,6140,32510,97,393,1313,249,1356,1229,0,84,0,459,364,138,1209,571,130,208,75,0,422,50,10,369,328,12244,80,330,1227,218,845,0,183,99,264,900,"N/A",286,59,264,652,0,1,1293,113,1862,429,0,166,404,0,1398,139,76,3641,125,365,613,293,1011,612,143,100,143,303,410,216,817,504,171,178,96,143,441,72,16,359,324,2374,143,284,612,170,860,143,306,112,233,678,"N/A",248,68,256,637,143,2,714,120,1029,427,143,202,312,143,601,102,110]
[null,"Ohio",11418944,4418,9764366,32087,1425709,29701,191778,1567,1637,6763,1952,9032,2690,1189,263,587,16492,4290,1044,312,7027,11588,1146,657,12744,1872,0,4982,2101,14330,1788,691,2003,101,1176,1851,1992,3936,255,8784,4572,204,"N/A",2333,1326,14292,369,3826,34,6468,11987,691,68,5425,1979,7548,2534,1280,1607,11799,705,1579,3193,1128,1771,1023,663,270,449,3173,1143,694,223,1504,2147,614,519,3507,1784,187,1578,1008,2896,784,462,873,172,616,1107,1509,1643,287,2659,1270,270,"N/A",1263,614,2842,353,1192,68,2336,4302,469,77,2020,965,1866,1620,793,1062]
[null,"Oklahoma",3742698,2585,3089041,15209,528498,15584,108878,591,1137,3770,6894,8233,3273,97,66,191,6056,3514,140,21,2179,2113,580,4626,1398,1934,271,432,160,1038,497,199,5781,803,1979,705,0,391,403,1858,1322,928,1608,"N/A",917,1116,152,2015,600,1700,31595,587,0,1013,1246,44,942,1763,105,7998,368,857,1522,2060,2583,1511,138,110,234,1588,1642,148,35,1297,1098,536,1250,747,727,425,312,103,848,341,202,1311,793,1196,532,163,333,259,925,800,805,791,"N/A",713,492,179,971,379,1101,4987,450,163,610,620,68,474,1572,139]
[null,"Oregon",3828714,3857,3128121,20096,549332,19087,127906,758,1935,7911,988,34214,2110,949,251,349,3384,1946,2491,6236,1350,1371,659,1263,71,0,269,453,1423,1652,1413,7,1172,1079,324,7222,427,1322,537,2056,1099,313,949,2034,"N/A",1407,0,370,417,673,4498,3443,176,1179,21862,66,914,914,4,9071,1071,1062,3054,1155,4555,659,564,264,291,1934,1914,1173,2097,663,1707,627,1355,118,203,320,482,768,1174,863,14,664,784,342,3426,404,771,449,850,740,340,789,1244,"N/A",775,203,292,395,420,2398,1781,203,619,3732,115,697,880,8]
[null,"Pennsylvania",12610486,5092,11099077,27780,1224564,25195,234291,1332,759,2278,582,10672,2491,4150,5177,1401,19299,4627,495,236,3902,4086,1176,2323,4013,615,608,17751,6284,4406,853,1238,1761,338,582,1057,1326,36133,325,29436,11254,195,13075,283,1594,"N/A",799,3438,142,3742,7006,1246,446,8419,3688,4631,2426,195,2723,11246,684,664,917,601,2349,1027,993,1304,584,3790,1185,369,223,1438,1429,960,1449,1826,294,328,3723,1711,1278,592,943,1063,308,439,501,520,4167,405,3921,3103,208,2133,220,1022,"N/A",558,1057,140,1402,1441,776,327,1530,1533,1483,1046,237,1294]
[null,"Rhode Island",1040022,1440,903786,8645,101689,7813,26769,0,0,214,0,1949,301,2613,0,0,2230,476,0,107,373,41,82,374,211,121,228,472,7715,178,27,0,109,0,0,0,941,1224,93,2776,259,0,60,0,57,1125,"N/A",223,0,210,207,181,621,485,262,199,2,23,293,2836,207,207,348,207,734,271,984,207,207,915,361,207,199,375,95,145,433,318,185,177,323,1532,117,60,207,163,207,207,207,745,501,153,1118,212,207,89,207,94,725,"N/A",232,207,187,153,267,328,448,277,253,5,47,292]
[null,"South Carolina",4624180,3871,3899705,25459,546666,21151,157644,2999,2421,1971,1333,6592,1000,1752,841,589,15476,16355,712,55,2371,3249,1379,1885,2454,878,652,3807,730,4483,471,2163,1522,915,204,1017,372,4241,598,11317,23102,271,6327,1008,833,3523,453,"N/A",62,3324,8623,181,91,7879,2510,1680,341,632,2166,12647,1543,1281,1391,1301,1789,598,1005,746,681,4230,2798,626,68,831,1601,1468,1445,1692,486,566,1261,447,1737,393,1979,1671,999,329,722,280,1445,609,3991,4356,213,2177,934,583,1139,360,"N/A",107,1252,4005,188,115,2193,1257,1114,291,647,1534]
[null,"South Dakota",814175,1297,688436,7824,94655,6542,27506,0,554,1422,659,1286,1021,0,0,0,101,69,0,186,267,285,4772,144,211,0,0,254,113,239,5342,129,354,232,1695,110,0,441,513,6,166,2060,84,40,15,57,7,529,"N/A",0,1156,560,0,79,557,0,481,1310,0,3893,155,492,1445,778,622,604,155,155,155,102,104,155,262,235,378,1898,212,208,155,155,222,179,201,1981,155,294,258,784,177,155,473,571,11,257,1025,102,46,26,77,12,706,"N/A",155,384,567,155,92,780,155,594,880,155]
[null,"Tennessee",6333466,4450,5342978,29750,794556,26578,170969,9326,531,1346,7393,7130,1372,150,155,307,15491,17507,179,0,8593,5645,387,1805,13884,1901,9,1135,1690,5983,445,9172,3795,43,631,883,132,1396,381,4921,9353,50,5944,3166,726,3360,14,5531,181,"N/A",7009,200,38,6098,2852,1385,1213,131,1083,13046,2717,465,1176,3038,2041,902,163,191,186,3282,4897,230,208,2245,1932,432,1529,2654,908,17,675,1886,2441,315,2752,1409,69,660,816,134,850,330,1493,2989,92,2044,3444,610,1716,31,1883,156,"N/A",1999,223,64,1279,2746,764,631,214,1191]
[null,"Texas",25327104,10987,20984855,65490,3648260,63784,514726,8747,6670,20073,16461,58992,19126,2927,884,2276,35777,17401,6106,4379,15064,10265,3236,12766,6616,25513,1357,9443,5035,15654,7691,6048,13473,537,3837,7793,459,7578,15225,26155,14956,809,12315,19302,3743,9107,1297,4075,1486,10788,"N/A",5234,349,13231,15325,663,5982,2500,5225,23860,2609,2828,5295,3965,7044,3821,1710,658,1540,6888,3608,2623,3119,3097,3693,1628,4731,2648,5283,1052,3323,1644,4327,2576,2921,3950,423,2060,2927,334,2982,2786,6509,4396,652,2730,4804,1552,2433,1223,1969,1045,3114,"N/A",2551,344,3158,3090,563,2396,1485,2173]
[null,"Utah",2769627,2949,2295961,19215,373984,17246,85217,486,2151,6585,422,18237,3986,562,0,132,1643,1052,1701,7538,1447,545,290,1146,611,494,0,342,959,1099,939,143,511,1241,195,4315,34,506,1707,1937,1653,2,2584,150,2037,1496,0,309,128,549,4507,"N/A",122,2413,4825,270,158,1058,0,7587,558,1259,2560,455,4113,1191,590,192,141,960,595,997,3248,825,398,250,829,529,402,192,301,638,724,634,163,372,623,178,1358,42,485,1068,1299,1181,5,1124,218,1026,808,192,259,146,419,1517,"N/A",205,1459,2196,268,153,609,192]
[null,"Vermont",621354,940,537304,5021,60719,4634,20463,0,580,310,0,819,529,2105,107,27,366,101,143,0,386,258,0,7,627,41,322,361,2378,335,206,0,69,0,0,15,2244,962,56,3723,250,0,383,0,124,389,401,21,0,327,185,182,"N/A",740,156,53,137,38,19,1946,145,441,325,145,508,493,608,135,53,199,99,85,145,245,210,145,13,660,74,200,233,606,345,255,145,86,145,145,26,783,305,105,904,193,145,485,145,128,231,411,36,145,498,147,212,"N/A",420,159,81,115,62,45]
[null,"Virginia",7996552,5256,6789620,30962,889751,30111,257130,4930,3202,4679,645,19371,4908,5376,961,6854,17773,8715,2917,434,4000,2703,1503,892,3630,2496,2855,22051,5386,7323,834,1682,2277,617,256,1717,1344,7327,1014,12455,22753,462,9570,853,3499,12009,1897,6612,908,7482,11655,1426,173,"N/A",4615,9041,858,190,1222,14025,2057,1687,2151,606,4241,2334,2730,652,1711,3494,1962,1400,430,1213,1067,899,645,1551,1642,1930,3143,2316,3026,361,1191,1178,714,289,961,798,2046,604,2816,4584,729,2217,477,1935,2497,1477,2032,841,2452,3004,641,138,"N/A",1717,2596,745,274,779]
[null,"Washington",6748474,4248,5565069,27197,919925,27221,208507,1821,5266,12397,756,38421,3938,1026,0,358,6094,8705,5940,10895,2062,2303,1000,2820,1271,1016,1313,1899,1580,3720,1543,1110,3307,2125,673,4925,824,2006,1569,4512,3870,189,2686,765,29168,2296,463,1519,227,2342,15491,4789,119,4233,"N/A",157,1491,1507,1083,13639,1049,2233,3133,565,4474,1215,533,201,254,1777,3348,2264,4263,821,1315,465,1740,936,1018,1689,808,757,1212,898,762,2181,934,441,1696,605,987,1254,1322,1452,304,1217,573,5436,1378,319,1267,225,1116,4361,1640,196,1698,"N/A",186,892,870,1061]
[null,"West Virginia",1836614,1681,1609110,9854,172262,8430,50068,221,598,50,225,1442,124,594,89,300,2949,1296,147,120,1331,210,0,0,515,326,45,7515,236,459,0,0,309,60,78,293,160,1431,0,2017,3865,0,8545,97,132,4205,284,1857,0,546,1574,114,23,5561,83,"N/A",42,0,680,4934,228,566,95,361,1085,160,401,102,231,1076,898,248,127,1134,200,184,184,259,313,75,2257,196,263,184,184,345,101,140,235,223,611,184,866,1241,184,1913,113,203,1569,344,1316,184,449,1047,216,33,1534,137,"N/A",69,184,450]
[null,"Wisconsin",5647213,2653,4846550,18735,675623,19411,109439,708,432,4045,335,6637,2592,993,219,123,4338,1745,1108,566,25521,4017,3306,418,1040,850,12,147,733,5623,17927,983,2090,143,483,663,480,378,714,2213,2120,1383,1358,118,1057,1294,368,377,590,744,1984,890,342,2573,1555,1090,"N/A",14,728,8715,761,323,1532,285,2054,1457,1397,276,170,1103,1106,1597,434,4568,2027,1757,446,570,563,21,141,578,1353,2244,924,1117,93,405,345,364,352,502,835,967,1273,628,119,680,781,407,312,487,527,836,652,311,1465,1071,1630,"N/A",23,715]
[null,"Wyoming",561389,1021,462808,7194,66648,5771,30651,51,761,369,174,2539,6905,11,0,0,1525,46,0,2140,450,6,342,286,83,114,0,0,152,849,357,70,241,1105,1784,427,0,7,76,113,395,237,22,462,960,284,13,219,1043,69,1398,2140,4,451,1803,0,168,"N/A",0,4428,62,597,276,191,1151,2099,22,189,189,1206,80,189,1161,409,14,323,364,140,204,189,189,226,545,355,117,274,531,957,656,189,16,101,149,457,313,40,555,851,254,28,307,1077,66,927,1003,8,634,1343,189,260,"N/A",189]
[null,"Puerto Rico",3669195,3034,3403602,12450,238263,11889,22649,35,378,229,0,207,0,1849,13,212,6614,247,0,13,624,784,0,38,0,0,0,70,1412,88,0,27,101,0,0,0,0,2150,51,2615,200,0,0,79,0,1978,490,3,113,224,444,0,0,1077,41,14,229,0,"N/A",3662,59,457,363,210,222,210,928,25,315,2336,195,210,24,537,895,210,62,210,210,210,124,904,127,210,35,165,210,210,210,210,1149,94,1171,195,210,210,117,210,1059,718,6,139,368,334,210,210,1097,42,25,373,210,"N/A"]
[null,null,null,null,null,null,null,null,null,106841,89228,212045,77226,562550,160623,93144,26644,49944,443816,249139,61940,57844,269632,144012,74516,94218,99256,86593,33729,165111,147281,186593,103253,68624,138505,31204,52809,115943,43277,218519,61482,380415,225347,26563,206049,81088,109795,217105,31555,121429,29496,154467,405283,73211,18172,230304,190685,45970,105599,31991,76218]
[null,null,null,null,null,null,null,null,null,24,30,11,33,1,16,29,50,42,2,6,38,40,5,19,35,28,27,31,45,15,18,14,26,37,20,48,41,22,44,9,39,4,8,51,12,32,23,10,47,21,49,17,3,36,52,7,13,43,25,46,34]
[]
[null,null,null,null,null,null,null,null,1,1.5,2,2.5,3,3.5,4,4.5,5,5.5,6,6.5,7,7.5,8,8.5,9,9.5,10,10.5,11,11.5,12,12.5,13,13.5,14,14.5,15,15.5,16,16.5,17,17.5,18,18.5,19,19.5,20,20.5,21,21.5,22,22.5,23,23.5,24,24.5,25,25.5,26,26.5,27,27.5,28,28.5,29,29.5,30,30.5,31,31.5,32,32.5,33,33.5,34,34.5,35,35.5,36,36.5,37,37.5,38,38.5,39,39.5,40,40.5,41,41.5,42,42.5,43,43.5,44,44.5,45,45.5,46,46.5,47,47.5,48,48.5,49,49.5,50,50.5,51,51.5,52,52.5,53,53.5]
[null,null,null,null,null,null,null,null,"Estimate","MOE","Estimate","MOE","Estimate","MOE","Estimate","MOE","Estimate","MOE","Estimate","MOE","Estimate","MOE","Estimate","MOE","Estimate","MOE","Estimate","MOE","Estimate","MOE","Estimate","MOE","Estimate","MOE","Estimate","MOE","Estimate","MOE","Estimate","MOE","Estimate","MOE","Estimate","MOE","Estimate","MOE","Estimate","MOE","Estimate","MOE","Estimate","MOE","Estimate","MOE","Estimate","MOE","Estimate","MOE","Estimate","MOE","Estimate","MOE","Estimate","MOE","Estimate","MOE","Estimate","MOE","Estimate","MOE","Estimate","MOE","Estimate","MOE","Estimate","MOE","Estimate","MOE","Estimate","MOE","Estimate","MOE","Estimate","MOE","Estimate","MOE","Estimate","MOE","Estimate","MOE","Estimate","MOE","Estimate","MOE","Estimate","MOE","Estimate","MOE","Estimate","MOE","Estimate","MOE","Estimate","MOE","Estimate","MOE","Estimate","MOE","Estimate","MOE","Estimate","MOE","Estimate","MOE"]
[null,null,null,null,null,null,null,null,6987416,77858,106806,10575,88850,10161,211816,17644,77226,6899,562343,20646,160623,10427,91295,7653,26631,3629,49732,4949,437202,19015,248892,13318,61940,7295,57831,7401,269008,13750,143228,10568,74516,6398,94180,10699,99256,7329,86593,8952,33729,4154,165041,11278,145869,10414,186505,13304,103253,6978,68597,7559,138404,11145,31204,4179,52809,6362,115943,8686,43277,4875,216369,12474,61431,5579,377800,15333,225147,14191,26563,3090,206049,11406,81009,8616,109795,8590,215127,11482,31065,4192,121426,9952,29383,4358,154243,9679,404839,17998,73211,7130,18172,2845,229227,11582,190644,11567,45956,5684,105370,8011,31991,4631,76218,8799]
[null,null,null,null,null,null,null,null,117726,9414,"N/A","N/A",1771,1098,1677,1060,1642,1063,3389,1286,348,295,2921,3231,232,301,399,359,20063,4141,19346,3711,1259,1292,137,173,6991,3376,1434,634,30,52,842,632,2686,856,2413,972,626,378,1606,987,112,146,2797,1250,327,342,3945,1492,1086,536,317,463,770,638,257,333,64,109,1996,2284,119,184,1108,442,2697,1820,284,333,2596,958,973,840,169,182,1075,474,0,190,2036,973,90,98,8710,2300,7973,2240,300,390,66,108,4935,2151,2621,1272,65,110,417,457,9,15,569,601]
[null,null,null,null,null,null,null,null,35084,4168,93,113,"N/A","N/A",2467,1902,190,258,3098,1921,1583,727,138,167,11,24,140,220,1188,476,556,419,1366,703,475,253,985,686,181,156,319,374,750,741,237,354,1077,1276,0,149,216,155,141,120,771,435,593,568,554,904,921,1014,248,185,5,12,532,485,520,744,128,136,226,188,940,613,470,404,0,149,319,286,616,733,2161,841,378,371,0,149,186,182,301,343,388,308,2492,1105,662,731,68,105,1488,1112,4548,1520,89,75,23,35,246,272,1044,962]
[null,null,null,null,null,null,null,null,222877,14358,833,587,5001,2214,"N/A","N/A",1066,740,49635,8755,10189,2958,1875,1213,0,229,389,389,3732,1842,2206,1147,2199,1109,2190,1183,10035,4129,5855,1956,4526,1745,1708,883,2134,1257,844,867,0,229,1918,1096,743,430,9396,5283,3297,1064,1226,1492,3872,1689,2431,1191,1393,798,8756,3417,228,229,3379,1757,4610,1448,3880,1363,2548,1269,1159,891,4682,2116,3219,1761,4613,1465,3436,1476,72,131,1774,1932,1657,1589,1680,647,12688,2976,10577,3336,0,229,2233,1094,13940,5479,70,118,6473,2066,2510,1288,871,639]
[null,null,null,null,null,null,null,null,69845,7292,691,573,560,669,439,381,"N/A","N/A",4077,2327,746,451,519,654,79,141,0,192,3067,1273,1446,759,13,27,179,271,3684,2143,1362,1007,851,773,2008,1142,213,311,2120,1015,30,53,133,176,781,901,1881,1130,232,396,1731,864,7314,2602,713,858,332,417,641,525,52,69,341,220,775,680,674,362,1664,1220,214,248,174,176,3761,1456,632,587,567,628,0,192,235,269,0,192,6462,2269,14767,2746,0,192,0,192,1245,769,1477,636,24,45,687,632,252,399,529,507]
[null,null,null,null,null,null,null,null,468428,17921,2087,927,7358,2501,35650,4362,2648,1019,"N/A","N/A",21245,3867,3073,1222,1302,1343,3240,1457,22094,4333,13303,3042,9864,2683,4796,1560,20834,3496,4673,1297,3324,1701,2810,1256,1201,507,3600,1751,1658,1175,7793,1924,10244,2069,12069,4117,5687,1375,2092,896,7677,1995,2599,1492,1955,821,36159,5100,1222,869,8053,2169,5904,2207,25629,3287,8708,2611,1392,898,10474,3555,5113,1763,18165,2845,8550,2017,1103,545,5758,2383,1004,686,8761,2325,37087,5877,8944,2725,745,504,15753,2373,36481,6266,832,463,5668,1495,2047,1810,1344,635]
[null,null,null,null,null,null,null,null,202124,11431,2340,1681,3191,1622,12338,3704,1615,1191,23234,3742,"N/A","N/A",1567,838,501,556,298,301,8075,2090,3250,1254,1852,832,1578,766,6027,1536,2116,1289,3510,1495,3718,1495,1361,1028,908,550,1358,1235,3303,1416,2157,1085,3225,1061,3055,1092,879,621,4552,1382,4079,1579,4582,1961,4061,1432,489,396,2863,1788,8797,2308,3998,1621,4756,1686,2249,1245,5527,2388,3824,2137,5543,2105,3348,1302,435,560,718,480,1340,1037,3193,1472,22390,4287,3856,1446,914,772,6281,2671,5524,2092,412,490,3995,1774,2942,923,476,556]
[null,null,null,null,null,null,null,null,71502,6552,101,120,180,299,1387,939,84,178,3699,1455,1502,618,"N/A","N/A",62,132,607,373,4771,1275,2000,988,587,523,133,224,1843,965,168,214,67,120,16,36,0,198,315,238,259,193,1267,744,8691,1998,692,736,76,120,69,116,365,297,206,277,62,103,160,189,1221,803,3809,1324,265,225,20015,4005,1029,593,0,198,1383,791,217,211,117,161,3668,1639,1488,645,997,476,0,198,123,141,1214,646,398,359,608,354,2555,1053,2255,1469,46,77,660,898,65,110,2105,1756]
[null,null,null,null,null,null,null,null,33912,3955,81,135,329,544,541,728,0,192,699,594,169,218,66,94,"N/A","N/A",154,144,810,449,639,422,201,171,441,347,34,35,210,235,0,192,7,17,305,391,0,192,0,192,4238,1274,806,558,43,71,201,299,0,192,713,684,0,192,12,28,0,192,0,192,6297,1765,0,192,3141,1083,388,256,0,192,664,608,27,45,0,192,8571,1728,131,217,153,179,0,192,221,259,883,755,475,738,0,192,1064,512,482,530,198,174,55,96,463,527,1008,971]
[null,null,null,null,null,null,null,null,48066,4295,13,29,135,217,43,71,81,93,3797,1233,452,321,981,472,128,125,"N/A","N/A",1254,651,937,572,372,396,68,113,1397,814,128,147,241,284,6,19,297,260,0,200,0,200,14129,2971,2048,789,1108,554,409,457,83,99,112,184,38,64,79,110,238,282,145,139,1035,605,0,200,2313,697,1716,760,285,360,306,224,0,200,51,64,1589,757,50,63,357,329,104,129,421,358,1083,491,75,118,445,489,7975,1285,476,300,120,138,946,668,0,200,0,200]
[null,null,null,null,null,null,null,null,498597,22483,12635,3566,7405,3412,8451,3258,3025,1241,22420,4065,9383,2988,11704,3121,1264,949,891,495,"N/A","N/A",38658,6270,3639,2081,312,268,19152,3962,11472,3254,1846,1137,2661,1410,5441,1674,6094,2316,4689,2049,15410,3515,13701,3380,19640,3920,4663,1888,5175,1968,7114,2753,559,424,3857,2208,3527,1810,4324,1798,25206,6219,1376,781,59288,7171,23983,5251,514,600,18191,3264,2600,1168,3315,2046,20821,4267,5002,2668,11953,2956,716,1027,10451,4102,25532,4638,2343,1891,2019,1616,16614,3087,6339,2687,4964,2202,7412,2467,846,725,21611,5621]
[null,null,null,null,null,null,null,null,271077,15123,18799,5015,1079,765,4292,1849,2112,1366,14949,3387,2325,1399,709,455,619,606,364,283,42666,5232,"N/A","N/A",1006,883,126,139,6080,1774,2442,1297,950,528,4513,2909,3686,1708,6541,3121,408,269,3708,1807,4436,1979,6992,2441,1808,1416,5380,3077,2514,989,246,211,4144,3300,774,559,132,150,8371,3016,791,421,14454,4681,19138,3931,201,221,6863,1986,1632,1107,727,472,5791,1896,337,504,16914,5257,536,730,16898,3610,15760,3421,793,1061,361,334,9438,3336,3701,1532,1340,778,2727,1401,504,775,1635,841]
[null,null,null,null,null,null,null,null,57542,5083,1268,846,844,670,2900,1208,242,260,10173,2201,950,493,731,739,784,877,222,275,3160,1311,2519,956,"N/A","N/A",112,199,1884,728,402,280,478,504,125,154,18,36,179,270,106,161,341,212,92,123,1303,1067,933,750,371,391,308,219,85,140,91,95,1548,795,107,141,564,697,354,366,4246,2556,2307,1256,32,54,970,677,685,502,2030,1378,870,468,58,70,1681,919,0,187,636,1018,3007,1122,1040,872,0,187,2523,1318,3790,1075,312,306,147,159,14,23,238,398]
[null,null,null,null,null,null,null,null,60336,6293,263,259,4510,2938,3543,1771,224,188,9021,2484,1813,1022,0,195,0,195,0,195,1733,1210,275,234,254,314,"N/A","N/A",390,342,296,352,318,424,479,503,120,170,51,110,0,195,0,195,396,625,615,524,566,352,62,106,384,304,1602,828,439,591,3581,1400,129,123,84,78,141,229,419,399,263,435,1201,1099,260,212,288,243,7170,1894,343,265,0,195,55,90,842,1132,296,356,1303,952,6059,2187,0,195,905,707,8991,2313,0,195,165,174,487,340,249,412]
[null,null,null,null,null,null,null,null,216204,11862,2823,1526,4119,3153,7657,1987,3185,1513,13930,2863,3271,1390,1819,959,277,303,1440,708,17548,3370,6042,2192,1269,735,393,356,"N/A","N/A",23491,5269,8420,1581,2533,1130,5569,1718,1315,761,693,510,2565,916,3507,1540,10274,2032,4496,1177,1521,581,13889,2736,304,275,827,520,2454,1187,590,334,3009,1033,1573,1619,6412,1874,4057,1663,105,115,8384,1627,1002,552,792,426,3012,1197,278,266,1582,783,1318,1474,3223,1222,11011,2803,951,595,49,81,5233,2524,3075,1254,352,288,14507,2936,58,76,2387,715]
[null,null,null,null,null,null,null,null,127874,8918,1562,1293,371,324,3975,1427,2016,1321,7649,2229,1930,759,1227,698,79,134,0,190,8595,3053,2543,1176,1057,717,1368,1278,23071,4221,"N/A","N/A",916,468,1321,946,10177,2220,2241,1537,275,388,480,256,952,703,7896,1777,1168,568,469,366,1824,1033,34,62,622,491,511,338,90,152,651,348,504,410,2518,816,3038,1840,70,94,11109,2141,844,522,505,617,3998,1871,49,84,3306,1917,235,231,3879,1292,6326,2074,123,127,530,349,1486,853,1028,744,216,194,2923,1307,117,170,132,220]
[null,null,null,null,null,null,null,null,70405,5539,207,259,967,651,1411,726,433,317,3297,1022,2891,1129,424,628,0,155,0,155,707,455,1938,1485,299,454,161,175,13725,2238,349,204,"N/A","N/A",1776,819,387,303,228,223,26,43,487,319,466,632,1687,954,5634,1117,408,306,3649,1188,370,338,6490,1780,2009,1634,0,155,185,209,421,347,2361,1104,1760,1268,604,377,993,482,532,417,811,476,388,292,65,108,172,200,2842,965,623,529,2334,1235,1482,940,38,71,720,854,856,577,115,181,2537,850,140,117,57,115]
[null,null,null,null,null,null,null,null,83640,7144,434,310,108,84,2028,858,998,697,4743,2121,5030,1611,412,519,74,85,128,141,1581,790,1146,666,287,282,264,358,2760,1019,863,458,1715,888,"N/A","N/A",1167,770,519,338,481,527,3180,2454,28,49,1947,1003,679,418,1517,1370,22033,4568,270,255,1648,701,657,359,27,37,1189,724,769,810,780,411,1223,840,379,558,1616,901,5022,1204,285,284,1494,1815,180,261,1102,670,104,147,1066,496,6575,1436,196,265,0,168,1986,1018,772,459,0,168,893,575,1285,791,775,1013]
[null,null,null,null,null,null,null,null,110031,9177,925,441,0,189,1818,916,1058,778,2130,1154,221,197,176,251,0,189,201,248,7400,1965,2725,892,63,80,36,69,4273,1415,11071,2846,536,410,253,212,"N/A","N/A",1399,906,71,137,2076,1444,1019,885,3178,1248,475,415,1248,868,2793,1158,216,238,471,517,1358,976,52,84,1289,1472,553,370,2174,1660,3916,1965,117,195,19617,3115,1256,853,459,328,1490,598,640,876,1387,814,0,189,16852,3762,4661,1468,140,202,151,152,5154,1719,1121,614,1174,566,581,414,57,93,192,262]
[null,null,null,null,null,null,null,null,99138,7082,3065,1401,288,266,2010,1529,2774,1144,3957,898,1202,983,358,264,0,198,195,168,5193,2120,4425,1541,688,808,230,269,1189,417,1549,827,468,441,312,466,1520,1286,"N/A","N/A",120,163,1221,1058,439,255,1163,875,698,445,10255,2829,1375,565,278,364,176,198,994,623,15,26,453,269,1028,867,1360,849,2134,1242,277,359,2641,2281,4235,3044,1531,1577,455,473,268,395,1573,1149,37,47,2495,938,30292,5028,179,275,87,149,2055,1060,1075,504,110,123,339,372,357,541,393,384]
[null,null,null,null,null,null,null,null,33818,4248,634,541,37,43,325,301,38,67,829,428,290,222,2481,668,238,228,239,177,4304,1908,507,415,177,214,0,157,675,358,164,157,275,452,523,641,158,217,138,218,"N/A","N/A",52,105,4439,1293,702,703,296,307,0,157,325,228,10,18,0,157,150,250,4302,1394,694,498,144,191,2589,1633,1439,1059,19,31,483,530,25,48,471,406,915,418,234,282,587,429,42,89,394,513,1637,1115,182,202,612,341,570,337,88,131,43,73,321,408,21,37,65,64]
[null,null,null,null,null,null,null,null,153979,9033,228,128,671,493,945,604,423,528,8595,1773,1796,837,1608,903,6652,1916,18492,3025,7825,1691,7113,1789,1170,815,389,366,2392,1052,1318,791,110,146,689,551,848,671,860,484,1526,1245,"N/A","N/A",3470,1341,2077,1273,810,503,1109,825,1469,944,73,103,0,204,1105,1033,232,160,9627,1880,797,676,9222,2041,6686,2008,0,204,3396,1110,845,592,276,247,14158,3380,197,162,2882,1696,0,204,1942,1093,3619,1102,223,230,40,69,22089,3805,1525,611,2027,859,353,514,80,132,779,654]
[null,null,null,null,null,null,null,null,139830,8282,1201,1083,225,345,1017,518,167,201,11556,2290,1388,972,9445,1884,399,579,676,358,11396,2715,3264,1666,733,860,412,695,2991,899,640,456,138,136,969,867,180,203,977,1200,4006,1526,2762,2048,"N/A","N/A",2629,1245,862,537,356,567,1261,654,596,719,637,727,163,158,12010,2630,8332,1949,199,276,19431,3914,3964,1384,61,111,1757,681,90,123,178,220,6538,1883,10182,2144,1621,989,44,72,371,355,5203,1491,548,411,2246,944,2984,1241,1673,741,911,855,441,311,0,204,4413,1542]
[null,null,null,null,null,null,null,null,139158,8465,3527,2060,3456,1793,3840,1382,2054,1024,7793,1752,3425,1462,1656,1087,0,167,256,259,17712,3844,4254,1566,630,469,882,675,9897,1863,7668,1841,1709,1026,1148,867,2578,1158,955,556,599,735,1035,431,2861,1135,"N/A","N/A",2671,1085,715,558,2509,1200,84,105,439,312,1215,610,73,120,1849,779,508,367,6087,2170,3405,1427,159,164,11224,2069,917,570,647,324,2864,1095,385,377,2185,1094,571,599,3106,973,9935,2208,642,582,0,167,2327,834,1430,669,417,301,4018,1002,841,655,908,857]
[null,null,null,null,null,null,null,null,101029,7052,123,150,893,619,2314,1071,951,599,6638,2072,2662,1023,74,131,86,143,367,391,2820,806,840,467,901,634,402,328,8209,2632,786,470,6175,1326,606,324,755,580,573,599,321,343,424,382,970,422,5164,2149,"N/A","N/A",549,593,1345,712,1457,859,1936,821,2682,1858,21,26,631,522,540,319,2416,913,845,520,7574,1390,1961,1059,546,399,1800,1169,870,509,0,143,447,428,5305,1596,874,489,3062,1108,919,742,177,161,1034,420,1413,656,92,98,19255,2960,224,178,54,91]
[null,null,null,null,null,null,null,null,68511,5606,8922,2639,117,102,556,405,2315,1360,4723,1290,484,453,54,74,0,206,415,434,6152,2463,3136,1397,369,429,55,82,2068,853,611,411,650,603,66,90,1626,841,7139,1767,0,206,265,239,1445,1561,1610,900,614,615,"N/A","N/A",1581,973,0,206,118,198,84,141,65,135,269,293,1075,1040,364,449,483,299,0,206,991,536,566,362,74,107,2568,1700,41,89,398,320,6,15,7683,2248,5243,1807,332,520,0,206,1453,805,286,252,303,411,1136,1061,0,206,318,411]
[null,null,null,null,null,null,null,null,149439,9288,1395,654,2043,2471,2356,1028,6168,1528,8386,1909,3144,1163,1516,1078,0,184,215,254,4513,1398,2964,972,871,517,560,439,20161,3086,4404,1588,4811,1405,20884,4170,1993,803,1728,905,291,295,716,317,463,306,2830,1176,2026,809,1641,884,"N/A","N/A",845,541,4860,1645,1544,830,769,750,1114,755,1016,718,2904,1260,3669,1527,977,446,3240,1684,6073,2312,777,538,1810,1085,359,424,267,237,361,296,2676,1056,10293,2994,1697,946,88,195,2684,1493,2518,843,196,214,1503,671,1120,900,709,463]
[null,null,null,null,null,null,null,null,33553,4015,449,318,1118,921,1971,1358,49,70,3033,1110,2856,1265,58,72,365,392,0,165,291,235,231,193,32,35,1543,1005,765,526,646,646,417,307,845,492,0,165,0,165,71,127,57,71,10,18,353,295,969,634,0,165,158,220,"N/A","N/A",384,392,688,543,0,165,889,589,264,389,422,377,1173,982,360,250,321,409,96,127,1959,914,840,640,0,165,77,92,227,233,266,237,1329,643,1232,623,53,71,278,288,3835,1160,14,28,146,184,2413,1709,353,522]
[null,null,null,null,null,null,null,null,52070,5507,169,271,721,785,1646,898,161,146,5124,1727,3245,962,381,372,0,155,29,48,1105,499,434,358,275,215,506,464,1415,777,615,541,9575,2602,3040,1210,352,457,222,253,122,127,318,344,0,155,683,435,1455,1009,424,430,1848,771,64,88,"N/A","N/A",240,165,0,155,119,101,242,326,544,349,829,872,292,213,268,250,1255,884,1556,1249,252,179,0,155,243,285,2999,1280,226,244,5343,2737,734,507,0,155,615,478,835,593,24,40,560,427,965,421,0,155]
[null,null,null,null,null,null,null,null,110345,9419,280,330,597,525,10142,4338,310,358,40114,5354,2714,1470,189,163,184,226,983,1261,2923,1608,1731,909,4093,2643,3929,1734,1668,1031,855,781,114,188,602,734,628,620,78,128,49,80,931,701,256,255,1663,831,1055,1329,203,279,335,237,1137,740,32,37,"N/A","N/A",0,234,2118,1709,2136,1429,1516,819,1333,895,0,234,1354,894,258,254,1691,695,570,581,86,148,165,273,588,557,96,150,7249,3923,3365,2105,0,234,1740,1369,4680,1646,0,234,2672,2369,933,702,153,258]
[null,null,null,null,null,null,null,null,37000,3717,193,237,0,184,246,210,22,37,547,334,403,313,1617,519,20,32,68,112,1970,813,535,449,0,184,0,184,478,402,470,394,47,78,0,184,0,184,0,184,3080,1064,222,177,15526,2811,155,165,104,145,160,258,153,181,230,378,33,54,186,231,"N/A","N/A",294,247,186,179,1471,510,1297,649,47,79,248,223,0,184,198,267,1015,569,608,301,588,757,86,102,126,159,605,438,158,271,2138,991,880,575,428,497,0,184,0,184,162,218,0,184]
[null,null,null,null,null,null,null,null,140194,8607,189,209,1198,790,3784,2287,57,97,5986,1519,2203,1931,1924,845,2100,1025,781,409,12907,3313,4268,2025,264,307,256,262,3690,1572,718,436,332,441,317,306,102,125,871,590,624,629,5335,2324,4675,1356,1889,1056,1261,1200,510,677,583,544,49,80,312,429,899,566,499,360,"N/A","N/A",355,537,40815,4703,2482,1416,61,103,1121,608,773,707,360,331,19733,2951,463,319,1586,789,0,198,1412,782,3801,1818,256,229,0,198,4458,1750,2454,1946,1252,1293,214,259,15,29,4312,1535]
[null,null,null,null,null,null,null,null,62130,7330,410,494,416,446,7444,3409,682,607,7066,2324,5525,1537,0,198,0,198,212,336,2806,1557,676,406,81,128,355,326,466,315,2030,2244,0,198,1333,1078,87,152,184,244,510,384,2277,1964,252,213,908,699,438,435,556,553,1183,877,544,340,353,312,2099,1159,114,130,245,229,"N/A","N/A",1445,781,522,300,264,310,1742,1115,234,203,916,655,492,284,0,198,145,204,240,281,899,577,13633,3724,303,218,71,120,425,337,924,616,0,198,340,342,283,313,99,158]
[null,null,null,null,null,null,null,null,282209,11956,1812,1002,6124,2270,2821,1100,1041,734,25761,3856,3724,1151,15123,3667,1124,588,3702,1051,29344,4718,10584,2320,1002,973,434,377,6914,1720,2198,958,928,783,838,397,2414,1223,1495,916,2915,1114,5037,1192,14646,2367,3936,947,1824,678,401,266,1417,595,391,282,579,553,1785,1037,2972,1172,41450,4170,461,276,"N/A","N/A",9336,1874,374,266,5191,1717,1425,887,2189,977,26596,3427,1393,663,6947,2791,112,121,2660,1051,9151,2132,773,482,3882,1242,10800,2343,2986,1367,631,470,1878,1014,688,645,10582,3796]
[null,null,null,null,null,null,null,null,265291,16660,5420,2338,3991,2185,4286,2860,327,322,15373,5531,3919,1645,1975,820,954,600,1135,591,28044,4471,16192,3163,1806,1362,675,615,5971,2065,3228,1379,654,530,4995,4644,1637,786,2936,1135,824,663,10485,2304,9053,4920,7530,2879,1294,825,1273,829,2638,1150,563,549,1056,1334,1048,716,2078,1738,10374,2643,1737,1297,18321,3621,"N/A","N/A",189,272,10187,3649,1390,684,1175,826,9450,2770,444,384,20427,3260,565,609,6057,2083,6621,2034,961,692,212,345,27302,4012,3295,1566,2780,1517,2291,1192,153,228,844,447]
[null,null,null,null,null,null,null,null,32510,3641,97,125,393,365,1313,613,249,293,1356,1011,1229,612,0,143,84,100,0,143,459,303,364,410,138,216,1209,817,571,504,130,171,208,178,75,96,0,143,422,441,50,72,10,16,369,359,328,324,12244,2374,80,143,330,284,1227,612,218,170,845,860,0,143,183,306,99,112,264,233,900,678,"N/A","N/A",286,248,59,68,264,256,652,637,0,143,1,2,1293,714,113,120,1862,1029,429,427,0,143,166,202,404,312,0,143,1398,601,139,102,76,110]
[null,null,null,null,null,null,null,null,191778,11799,1567,705,1637,1579,6763,3193,1952,1128,9032,1771,2690,1023,1189,663,263,270,587,449,16492,3173,4290,1143,1044,694,312,223,7027,1504,11588,2147,1146,614,657,519,12744,3507,1872,1784,0,187,4982,1578,2101,1008,14330,2896,1788,784,691,462,2003,873,101,172,1176,616,1851,1107,1992,1509,3936,1643,255,287,8784,2659,4572,1270,204,270,"N/A","N/A",2333,1263,1326,614,14292,2842,369,353,3826,1192,34,68,6468,2336,11987,4302,691,469,68,77,5425,2020,1979,965,7548,1866,2534,1620,1280,793,1607,1062]
[null,null,null,null,null,null,null,null,108878,7998,591,368,1137,857,3770,1522,6894,2060,8233,2583,3273,1511,97,138,66,110,191,234,6056,1588,3514,1642,140,148,21,35,2179,1297,2113,1098,580,536,4626,1250,1398,747,1934,727,271,425,432,312,160,103,1038,848,497,341,199,202,5781,1311,803,793,1979,1196,705,532,0,163,391,333,403,259,1858,925,1322,800,928,805,1608,791,"N/A","N/A",917,713,1116,492,152,179,2015,971,600,379,1700,1101,31595,4987,587,450,0,163,1013,610,1246,620,44,68,942,474,1763,1572,105,139]
[null,null,null,null,null,null,null,null,127906,9071,758,1071,1935,1062,7911,3054,988,1155,34214,4555,2110,659,949,564,251,264,349,291,3384,1934,1946,1914,2491,1173,6236,2097,1350,663,1371,1707,659,627,1263,1355,71,118,0,203,269,320,453,482,1423,768,1652,1174,1413,863,7,14,1172,664,1079,784,324,342,7222,3426,427,404,1322,771,537,449,2056,850,1099,740,313,340,949,789,2034,1244,"N/A","N/A",1407,775,0,203,370,292,417,395,673,420,4498,2398,3443,1781,176,203,1179,619,21862,3732,66,115,914,697,914,880,4,8]
[null,null,null,null,null,null,null,null,234291,11246,1332,684,759,664,2278,917,582,601,10672,2349,2491,1027,4150,993,5177,1304,1401,584,19299,3790,4627,1185,495,369,236,223,3902,1438,4086,1429,1176,960,2323,1449,4013,1826,615,294,608,328,17751,3723,6284,1711,4406,1278,853,592,1238,943,1761,1063,338,308,582,439,1057,501,1326,520,36133,4167,325,405,29436,3921,11254,3103,195,208,13075,2133,283,220,1594,1022,"N/A","N/A",799,558,3438,1057,142,140,3742,1402,7006,1441,1246,776,446,327,8419,1530,3688,1533,4631,1483,2426,1046,195,237,2723,1294]
[null,null,null,null,null,null,null,null,26769,2836,0,207,0,207,214,348,0,207,1949,734,301,271,2613,984,0,207,0,207,2230,915,476,361,0,207,107,199,373,375,41,95,82,145,374,433,211,318,121,185,228,177,472,323,7715,1532,178,117,27,60,0,207,109,163,0,207,0,207,0,207,941,745,1224,501,93,153,2776,1118,259,212,0,207,60,89,0,207,57,94,1125,725,"N/A","N/A",223,232,0,207,210,187,207,153,181,267,621,328,485,448,262,277,199,253,2,5,23,47,293,292]
[null,null,null,null,null,null,null,null,157644,12647,2999,1543,2421,1281,1971,1391,1333,1301,6592,1789,1000,598,1752,1005,841,746,589,681,15476,4230,16355,2798,712,626,55,68,2371,831,3249,1601,1379,1468,1885,1445,2454,1692,878,486,652,566,3807,1261,730,447,4483,1737,471,393,2163,1979,1522,1671,915,999,204,329,1017,722,372,280,4241,1445,598,609,11317,3991,23102,4356,271,213,6327,2177,1008,934,833,583,3523,1139,453,360,"N/A","N/A",62,107,3324,1252,8623,4005,181,188,91,115,7879,2193,2510,1257,1680,1114,341,291,632,647,2166,1534]
[null,null,null,null,null,null,null,null,27506,3893,0,155,554,492,1422,1445,659,778,1286,622,1021,604,0,155,0,155,0,155,101,102,69,104,0,155,186,262,267,235,285,378,4772,1898,144,212,211,208,0,155,0,155,254,222,113,179,239,201,5342,1981,129,155,354,294,232,258,1695,784,110,177,0,155,441,473,513,571,6,11,166,257,2060,1025,84,102,40,46,15,26,57,77,7,12,529,706,"N/A","N/A",0,155,1156,384,560,567,0,155,79,92,557,780,0,155,481,594,1310,880,0,155]
[null,null,null,null,null,null,null,null,170969,13046,9326,2717,531,465,1346,1176,7393,3038,7130,2041,1372,902,150,163,155,191,307,186,15491,3282,17507,4897,179,230,0,208,8593,2245,5645,1932,387,432,1805,1529,13884,2654,1901,908,9,17,1135,675,1690,1886,5983,2441,445,315,9172,2752,3795,1409,43,69,631,660,883,816,132,134,1396,850,381,330,4921,1493,9353,2989,50,92,5944,2044,3166,3444,726,610,3360,1716,14,31,5531,1883,181,156,"N/A","N/A",7009,1999,200,223,38,64,6098,1279,2852,2746,1385,764,1213,631,131,214,1083,1191]
[null,null,null,null,null,null,null,null,514726,23860,8747,2609,6670,2828,20073,5295,16461,3965,58992,7044,19126,3821,2927,1710,884,658,2276,1540,35777,6888,17401,3608,6106,2623,4379,3119,15064,3097,10265,3693,3236,1628,12766,4731,6616,2648,25513,5283,1357,1052,9443,3323,5035,1644,15654,4327,7691,2576,6048,2921,13473,3950,537,423,3837,2060,7793,2927,459,334,7578,2982,15225,2786,26155,6509,14956,4396,809,652,12315,2730,19302,4804,3743,1552,9107,2433,1297,1223,4075,1969,1486,1045,10788,3114,"N/A","N/A",5234,2551,349,344,13231,3158,15325,3090,663,563,5982,2396,2500,1485,5225,2173]
[null,null,null,null,null,null,null,null,85217,7587,486,558,2151,1259,6585,2560,422,455,18237,4113,3986,1191,562,590,0,192,132,141,1643,960,1052,595,1701,997,7538,3248,1447,825,545,398,290,250,1146,829,611,529,494,402,0,192,342,301,959,638,1099,724,939,634,143,163,511,372,1241,623,195,178,4315,1358,34,42,506,485,1707,1068,1937,1299,1653,1181,2,5,2584,1124,150,218,2037,1026,1496,808,0,192,309,259,128,146,549,419,4507,1517,"N/A","N/A",122,205,2413,1459,4825,2196,270,268,158,153,1058,609,0,192]
[null,null,null,null,null,null,null,null,20463,1946,0,145,580,441,310,325,0,145,819,508,529,493,2105,608,107,135,27,53,366,199,101,99,143,85,0,145,386,245,258,210,0,145,7,13,627,660,41,74,322,200,361,233,2378,606,335,345,206,255,0,145,69,86,0,145,0,145,15,26,2244,783,962,305,56,105,3723,904,250,193,0,145,383,485,0,145,124,128,389,231,401,411,21,36,0,145,327,498,185,147,182,212,"N/A","N/A",740,420,156,159,53,81,137,115,38,62,19,45]
[null,null,null,null,null,null,null,null,257130,14025,4930,2057,3202,1687,4679,2151,645,606,19371,4241,4908,2334,5376,2730,961,652,6854,1711,17773,3494,8715,1962,2917,1400,434,430,4000,1213,2703,1067,1503,899,892,645,3630,1551,2496,1642,2855,1930,22051,3143,5386,2316,7323,3026,834,361,1682,1191,2277,1178,617,714,256,289,1717,961,1344,798,7327,2046,1014,604,12455,2816,22753,4584,462,729,9570,2217,853,477,3499,1935,12009,2497,1897,1477,6612,2032,908,841,7482,2452,11655,3004,1426,641,173,138,"N/A","N/A",4615,1717,9041,2596,858,745,190,274,1222,779]
[null,null,null,null,null,null,null,null,208507,13639,1821,1049,5266,2233,12397,3133,756,565,38421,4474,3938,1215,1026,533,0,201,358,254,6094,1777,8705,3348,5940,2264,10895,4263,2062,821,2303,1315,1000,465,2820,1740,1271,936,1016,1018,1313,1689,1899,808,1580,757,3720,1212,1543,898,1110,762,3307,2181,2125,934,673,441,4925,1696,824,605,2006,987,1569,1254,4512,1322,3870,1452,189,304,2686,1217,765,573,29168,5436,2296,1378,463,319,1519,1267,227,225,2342,1116,15491,4361,4789,1640,119,196,4233,1698,"N/A","N/A",157,186,1491,892,1507,870,1083,1061]
[null,null,null,null,null,null,null,null,50068,4934,221,228,598,566,50,95,225,361,1442,1085,124,160,594,401,89,102,300,231,2949,1076,1296,898,147,248,120,127,1331,1134,210,200,0,184,0,184,515,259,326,313,45,75,7515,2257,236,196,459,263,0,184,0,184,309,345,60,101,78,140,293,235,160,223,1431,611,0,184,2017,866,3865,1241,0,184,8545,1913,97,113,132,203,4205,1569,284,344,1857,1316,0,184,546,449,1574,1047,114,216,23,33,5561,1534,83,137,"N/A","N/A",42,69,0,184,680,450]
[null,null,null,null,null,null,null,null,109439,8715,708,761,432,323,4045,1532,335,285,6637,2054,2592,1457,993,1397,219,276,123,170,4338,1103,1745,1106,1108,1597,566,434,25521,4568,4017,2027,3306,1757,418,446,1040,570,850,563,12,21,147,141,733,578,5623,1353,17927,2244,983,924,2090,1117,143,93,483,405,663,345,480,364,378,352,714,502,2213,835,2120,967,1383,1273,1358,628,118,119,1057,680,1294,781,368,407,377,312,590,487,744,527,1984,836,890,652,342,311,2573,1465,1555,1071,1090,1630,"N/A","N/A",14,23,728,715]
[null,null,null,null,null,null,null,null,30651,4428,51,62,761,597,369,276,174,191,2539,1151,6905,2099,11,22,0,189,0,189,1525,1206,46,80,0,189,2140,1161,450,409,6,14,342,323,286,364,83,140,114,204,0,189,0,189,152,226,849,545,357,355,70,117,241,274,1105,531,1784,957,427,656,0,189,7,16,76,101,113,149,395,457,237,313,22,40,462,555,960,851,284,254,13,28,219,307,1043,1077,69,66,1398,927,2140,1003,4,8,451,634,1803,1343,0,189,168,260,"N/A","N/A",0,189]
[null,null,null,null,null,null,null,null,22649,3662,35,59,378,457,229,363,0,210,207,222,0,210,1849,928,13,25,212,315,6614,2336,247,195,0,210,13,24,624,537,784,895,0,210,38,62,0,210,0,210,0,210,70,124,1412,904,88,127,0,210,27,35,101,165,0,210,0,210,0,210,0,210,2150,1149,51,94,2615,1171,200,195,0,210,0,210,79,117,0,210,1978,1059,490,718,3,6,113,139,224,368,444,334,0,210,0,210,1077,1097,41,42,14,25,229,373,0,210,"N/A","N/A"]

{"sheet":"2010","index":3,"n_rows":120,"n_cols":114,"rows_kept":120,"cut":false,"hidden":true,"merged":[[6,1,8,1],[6,2,7,3],[6,4,7,5],[6,6,7,7]]}
[]
[null,"Table 3  State-to-State Migration Flows*: 2010"]
[null,"Dataset: 2010 American Community Survey 1-Year Estimates"]
[null,"Universe: Population 1 year and over"]
[null,"Source: http://www.census.gov/hhes/migration/files/acs/st-to-st/State_to_State_Migrations_Table_2010.xls"]
[null,null,null,null,null,null,null,null,"ESTIMATES",null,null,null,null,null,null,null,null,null,null,null,null,null,null,null,null,null,null,null,null,null,null,null,null,null,null,null,null,null,null,null,null,null,null,null,null,null,null,null,null,null,null,null,null,null,null,null,null,null,null,null,null,"Margin of Error"]
[null,"Current residence in --","Population 1 year and over",null,"Same residence 1 year ago",null,"Different residence, same state 1 year ago",null,1,2,3,4,5,6,7,8,9,10,11,12,13,14,15,16,17,18,19,20,21,22,23,24,25,26,27,28,29,30,31,32,33,34,35,36,37,38,39,40,41,42,43,44,45,46,47,48,49,50,51,52,53,1,2,3,4,5,6,7,8,9,10,11,12,13,14,15,16,17,18,19,20,21,22,23,24,25,26,27,28,29,30,31,32,33,34,35,36,37,38,39,40,41,42,43,44,45,46,47,48,49,50,51,52,53]
[null,null,null,null,null,null,null,null,"State of Residence Last year (Estimate)",null,null,null,null,null,null,null,null,null,null,null,null,null,null,null,null,null,null,null,null,null,null,null,null,null,null,null,null,null,null,null,null,null,null,null,null,null,null,null,null,null,null,null,null,null,null,null,null,null,null,null,null,"State of Residence Last year (Margin of Error)"]
[null,null,"Estimate","MOE","Estimate","MOE","Estimate","MOE","TOTAL","Alabama","Alaska","Arizona","Arkansas","California","Colorado","Connecticut","Delaware","District of Columbia ","Florida","Georgia","Hawaii","Idaho","Illinois","Indiana","Iowa","Kansas","Kentucky","Louisiana","Maine","Maryland","Massachusetts","Michigan","Minnesota","Mississippi","Missouri","Montana","Nebraska","Nevada","New Hampshire","New Jersey","New Mexico","New York","North Carolina","North Dakota","Ohio","Oklahoma","Oregon","Pennsylvania","Rhode Island","South Carolina","South Dakota","Tennessee","Texas","Utah","Vermont","Virginia","Washington","West Virginia","Wisconsin","Wyoming","Puerto Rico","TOTAL","Alabama","Alaska","Arizona","Arkansas","California","Colorado","Connecticut","Delaware","District of Columbia ","Florida","Georgia","Hawaii","Idaho","Illinois","Indiana","Iowa","Kansas","Kentucky","Louisiana","Maine","Maryland","Massachusetts","Michigan","Minnesota","Mississippi","Missouri","Montana","Nebraska","Nevada","New Hampshire","New Jersey","New Mexico","New York","North Carolina","North Dakota","Ohio","Oklahoma","Oregon","Pennsylvania","Rhode Island","South Carolina","South Dakota","Tennessee","Texas","Utah","Vermont","Virginia","Washington","West Virginia","Wisconsin","Wyoming","Puerto Rico"]
[null,"United States",305628607,29823,258552348,236128,38582885,213239,6743229,99221,94692,176768,64264,573988,140620,89360,30055,56052,427853,244992,49218,53122,277579,130170,66922,90681,92999,88131,32209,159866,144152,178207,104765,68363,148055,35870,43531,109409,38399,193972,50438,363139,207025,24450,188013,90616,100185,209810,24948,117569,27915,143135,411641,75541,18380,232002,166162,49349,111240,28186,59885,69387,8532,9780,9764,6502,20898,8392,8104,4817,5274,16117,13712,5580,6197,14177,9685,5441,7300,8240,8540,4475,9741,8102,11238,7734,7286,11141,4482,5996,10422,4262,11560,5032,16245,11068,3757,11207,7414,8825,10357,3127,9315,3665,9159,16805,7183,3009,11248,10010,5605,9166,3185,6923]
[null,"Alabama",4729509,3716,3987155,21708,620465,21448,108723,"N/A",3013,676,1481,3827,1278,454,811,211,15062,21644,267,304,2503,3945,669,649,1967,1901,97,716,435,2334,386,7233,1373,229,169,265,0,356,650,3686,2371,169,2222,880,485,1477,0,2368,31,7409,6500,1336,0,2490,1171,41,1155,27,228,8781,"N/A",1452,606,1038,1660,778,694,694,186,3138,3955,440,399,1224,1979,882,516,1192,868,158,458,396,1294,358,2367,1180,182,286,297,273,285,749,2920,945,213,931,609,435,696,273,1142,62,1926,2016,1129,273,1026,756,73,895,52,265]
[null,"Alaska",702974,1600,565031,7596,95878,7984,36326,477,"N/A",1354,47,3906,1930,0,0,14,2315,1251,1705,895,388,9,262,106,1440,100,574,704,107,923,530,263,0,616,215,240,316,413,421,255,698,69,156,1455,1793,126,0,121,531,477,4123,1274,353,714,2421,0,158,81,19,3708,790,"N/A",805,78,1041,866,246,246,23,1026,902,1289,524,293,24,349,107,1506,171,655,460,183,814,409,386,246,507,259,247,368,501,446,206,587,89,213,971,1104,164,246,153,817,341,1774,926,429,681,790,246,198,131,30]
[null,"Arizona",6332786,4439,5069002,35057,1001991,32027,222725,416,3109,"N/A",689,47164,7687,479,738,0,7712,4261,1966,2147,12250,2690,3008,1935,1705,2014,241,1284,1449,6354,5421,272,4567,1343,1750,10342,64,1782,4419,6618,4463,826,5225,2910,5430,5535,403,2310,1351,3061,14705,7164,664,3413,12645,595,5556,593,599,11873,305,1297,"N/A",415,6018,2494,386,774,305,2149,1828,928,984,3263,1358,1405,1008,928,1697,308,1052,975,1796,1542,238,1621,1038,1130,3881,105,762,1430,2661,1627,612,1513,1310,1887,2842,336,1189,843,1643,3301,3154,498,1613,2459,563,1827,393,771]
[null,"Arkansas",2888304,2453,2387806,18627,412997,17485,79127,1405,934,777,"N/A",4457,2535,451,0,154,3578,3921,129,618,3221,722,85,3611,2540,4012,0,306,190,1506,222,2764,7320,85,394,67,0,77,0,289,1561,0,1137,8607,239,731,0,1496,243,2653,13707,361,0,494,264,0,821,443,87,7901,1001,798,557,"N/A",1991,1149,315,273,264,1239,2077,166,754,1474,498,143,1704,1895,1625,273,254,196,674,153,1337,2181,159,538,104,273,130,273,336,900,273,811,3434,174,570,273,983,264,1121,2911,322,273,382,228,273,503,513,146]
[null,"California",36907897,10889,30790221,71574,5413287,66460,444749,3364,9579,33854,4172,"N/A",15662,4631,643,3683,20362,8820,9528,5719,16482,6550,3163,3857,3394,2989,1796,10626,11969,10435,5095,2757,6921,3009,3062,27724,1614,10108,4632,20981,9593,392,8170,5708,20913,9948,526,5016,1604,4349,36582,10653,525,14232,30544,1446,6031,1336,1223,18415,1977,2911,4816,1340,"N/A",3236,1802,408,1306,4008,2545,2191,1572,2806,1860,1259,1813,1797,1207,1139,2848,2774,2487,1319,1338,2357,1511,1860,4878,1059,2848,1266,2977,2005,343,2399,1591,3580,1991,264,2183,1117,1174,5299,2235,369,2597,4481,919,2181,664,1128]
[null,"Colorado",4988190,3936,4042039,25546,725413,23003,186366,954,2225,12287,1034,26089,"N/A",459,486,479,8849,6445,2355,839,6950,3296,2140,4308,1961,968,532,1532,2242,4587,2878,1277,1978,2042,4065,4131,791,1259,3921,4594,2940,802,2838,3464,4330,3928,192,1231,1847,1628,22253,4748,350,2739,7583,623,2499,4418,874,9897,803,1220,2324,739,4183,"N/A",360,486,381,2300,2553,1220,572,1968,1584,1179,1577,1194,664,385,978,778,1679,1093,883,803,1490,1455,1784,521,537,1326,1518,1376,598,1325,1440,1962,1124,248,796,826,706,4494,1658,246,1077,3004,493,1153,1439,880]
[null,"Connecticut",3541146,2779,3100742,16358,342904,15404,77333,896,0,664,334,4479,547,"N/A",149,331,9207,748,182,147,3391,1074,108,0,400,0,528,1531,8510,770,934,67,42,0,0,507,1049,3475,112,20727,1345,0,1296,145,640,1955,1728,1140,0,430,1887,0,458,1735,2084,442,1092,47,2027,6651,891,281,484,517,1653,487,"N/A",227,343,2532,467,171,130,1847,798,131,281,430,281,447,814,2107,486,659,111,68,281,281,424,628,1175,189,3325,587,281,710,171,592,808,796,627,281,389,1100,281,419,691,1631,674,1321,78,1233]
[null,"Delaware",889812,1573,764640,9145,90001,8498,30759,128,68,60,0,353,178,714,"N/A",432,2362,585,0,0,612,0,0,28,163,0,294,4969,689,61,55,0,539,73,0,106,139,3678,59,4251,424,0,325,0,0,7318,149,195,0,146,178,0,0,1051,377,0,0,0,954,4030,211,111,78,265,290,249,693,"N/A",467,996,575,265,265,583,265,265,47,273,265,406,1144,538,102,92,265,842,120,265,183,246,935,98,1555,466,265,339,265,265,2368,241,272,265,248,313,265,265,538,280,265,265,265,1095]
[null,"District of Columbia ",596747,1124,474676,8281,63766,6163,51244,360,591,662,155,4205,656,926,0,"N/A",1100,1597,0,0,615,711,392,83,94,0,76,13503,1376,126,87,0,272,0,62,0,137,1924,61,3852,1897,98,598,0,601,2378,249,380,0,591,1180,0,199,7915,284,860,391,0,0,4828,418,529,466,195,1255,637,592,292,"N/A",609,795,292,292,373,461,377,137,155,292,121,2647,540,153,105,292,371,292,103,292,136,694,100,1325,1089,165,359,292,520,771,206,339,292,543,605,292,245,1638,220,754,325,292,292]
[null,"Florida",18647600,7733,15554008,45602,2459530,38387,482889,15830,5887,3907,3611,22130,6428,11183,3099,1110,"N/A",35615,2021,884,17432,9030,2921,4136,6321,7232,5497,13241,13900,21359,5439,7929,7984,338,1544,7050,3645,22344,900,55011,19108,794,21047,3466,1655,19935,1982,10759,430,12882,24039,2833,1442,20080,3573,5634,8081,191,12968,22701,3829,2502,1463,1562,3867,1941,2730,1603,564,"N/A",5500,990,747,3007,2849,1091,2062,1902,2781,1861,2929,2269,4622,2349,3596,2232,289,1314,3281,1193,3256,872,6848,3464,720,3825,1518,1187,3976,813,2906,473,2482,5038,1249,935,4137,1239,2872,2929,258,4149]
[null,"Georgia",9587237,5924,8015409,37393,1278548,36794,249459,13840,3645,2554,599,8909,3224,2619,837,1708,49901,"N/A",1040,414,9736,2649,1096,1355,6525,3645,0,5382,3910,6857,1169,2380,3072,52,148,1155,162,4151,826,12472,15361,0,9323,2070,843,6294,43,15562,557,14445,11424,380,361,8393,4495,358,3416,102,1010,15858,2473,1932,1303,436,2412,2058,1473,753,1278,5558,"N/A",658,478,3665,1023,821,1097,2248,1604,300,1767,2127,1831,718,959,1087,92,139,684,161,1203,509,2568,3426,300,2446,1458,626,1914,70,3592,540,3273,2574,291,458,2087,2034,295,2022,118,742]
[null,"Hawaii",1346274,1690,1140572,10422,134315,9295,53581,749,743,1398,0,12677,1073,307,0,0,4599,2013,"N/A",42,715,192,68,387,95,88,89,990,1283,627,476,234,170,150,0,1925,496,443,11,1339,1510,69,625,57,1834,553,644,322,267,142,6694,467,0,2644,2705,483,1168,18,0,6065,542,609,849,275,2325,667,392,275,275,2610,1185,"N/A",70,412,209,118,345,159,151,145,737,944,548,350,368,171,261,275,1184,685,417,19,794,994,116,515,94,958,478,829,378,380,205,2760,369,275,1136,883,782,1133,33,275]
[null,"Idaho",1550967,1954,1279856,12606,209272,10887,55638,376,3264,3086,45,8932,1372,0,0,144,612,313,123,"N/A",169,132,773,422,315,59,202,44,115,427,465,37,425,1509,0,2110,109,97,694,155,134,96,325,711,3202,172,0,0,296,1153,1746,8014,0,611,10876,133,233,1410,233,6079,369,1813,2015,73,2415,867,267,267,233,508,280,206,"N/A",236,133,470,415,272,102,272,73,135,363,613,61,345,584,267,1061,147,148,811,169,164,112,261,702,1259,206,267,267,375,995,951,2403,267,662,2438,158,292,723,374]
[null,"Illinois",12680126,5467,11009852,32636,1404525,28126,203959,1397,1764,5921,1194,16205,3850,2264,56,1047,8051,6781,1224,313,"N/A",21918,9141,1970,2921,1419,55,1985,2811,11865,4300,1093,16703,928,546,2541,206,2331,996,8479,5504,1112,5103,1459,1224,5190,838,1565,292,3999,12245,658,260,3831,1642,812,15364,586,2055,11573,596,1078,1897,665,3236,1360,1125,57,581,1715,2524,776,258,"N/A",4147,1866,991,831,687,93,1210,1111,2138,1815,861,3325,937,373,1214,202,1262,709,2555,2479,788,1201,777,789,1822,643,787,264,1131,3113,427,257,1241,707,523,2866,432,820]
[null,"Indiana",6414862,4257,5431015,24897,833086,22796,127353,1502,177,2210,1548,8959,1362,544,0,181,5496,1623,267,772,27950,"N/A",1885,1582,10643,749,30,1641,103,9361,916,270,3893,164,705,227,114,1876,188,2564,2828,0,13272,681,423,2668,174,584,216,3093,6335,444,45,3673,571,669,1762,413,572,8463,1110,143,914,1104,2863,658,404,267,156,1564,913,316,604,4658,"N/A",1191,996,2402,599,50,950,135,1837,385,255,2531,201,654,239,134,1526,229,952,1141,267,2750,563,380,1128,284,405,258,1261,1643,432,73,1633,340,562,893,403,457]
[null,"Iowa",3013053,2381,2553210,15158,375650,12448,72557,330,519,1483,247,2847,2554,114,0,53,1364,973,866,315,17016,1710,"N/A",1520,334,315,0,134,189,1439,7564,117,6031,836,4783,623,381,472,492,273,1123,601,632,679,1071,378,0,591,1992,1617,4131,146,45,303,538,0,2705,111,149,5707,202,407,623,190,1227,865,155,228,85,573,472,651,415,2840,917,"N/A",741,377,384,228,156,175,652,1722,138,2253,743,1799,371,531,405,490,270,744,617,421,491,568,242,228,442,980,1222,1470,156,81,329,365,228,1206,119,176]
[null,"Kansas",2820894,2731,2341401,17752,372161,15608,95059,44,1050,2238,1596,6125,6022,85,238,0,2863,1916,128,398,2943,1544,1875,"N/A",1048,890,0,1369,100,806,1562,167,23384,289,2678,1318,76,1743,873,2390,1083,225,1509,7568,514,563,39,137,352,1152,9217,238,75,1648,1175,0,1233,573,68,7804,75,697,878,1073,1459,2519,140,275,248,1848,1039,154,407,1096,859,1184,"N/A",1402,580,248,1103,120,457,1147,146,3524,318,875,1245,130,1236,580,1235,649,373,1127,2302,610,537,79,211,227,821,2824,298,126,934,792,248,898,531,88]
[null,"Kentucky",4296639,3389,3638259,20337,519887,18955,118443,2161,3017,2598,558,3779,329,698,38,147,10119,6397,520,71,4659,11906,656,1109,"N/A",437,0,1395,1036,4672,930,1442,3153,0,858,76,0,1147,122,2057,3758,0,15598,1153,181,2618,289,1286,163,11153,5758,905,525,3671,716,2297,1993,292,179,8947,871,2024,1483,547,1387,363,710,64,210,2893,2093,520,119,1887,2334,788,1031,"N/A",435,271,995,738,1897,781,917,1147,271,809,129,271,807,189,1057,1216,271,2549,900,220,1480,381,741,262,3003,1631,721,515,1981,599,1276,1413,462,240]
[null,"Louisiana",4483529,3720,3826390,25103,547291,22645,97889,5740,1504,1960,2382,5751,1215,89,0,264,9394,5766,342,202,2131,948,625,706,1656,"N/A",162,963,995,1301,569,7032,2852,40,119,1552,462,171,294,2161,1443,438,1100,1074,281,1350,0,1130,0,1853,26134,473,0,1278,1509,210,237,31,402,8319,2537,922,1204,1114,1933,567,120,281,228,2799,1868,502,205,1394,651,656,483,1093,"N/A",269,699,702,886,513,2217,1534,72,193,785,427,249,256,822,686,514,774,675,277,747,281,706,281,621,3903,380,281,733,1126,254,229,67,285]
[null,"Maine",1313902,1878,1136780,8034,146735,7677,27758,402,424,254,67,1066,478,1361,174,55,3025,844,62,0,311,259,337,56,484,115,"N/A",243,3521,122,91,0,201,275,204,345,4058,902,234,2339,1001,55,315,124,0,375,379,148,0,249,458,390,420,654,381,0,0,500,204,3059,311,439,290,112,740,377,689,229,89,924,817,102,230,251,379,561,92,643,211,"N/A",223,958,133,109,230,260,335,283,344,1966,508,298,962,1161,89,362,215,230,287,284,160,230,231,327,427,368,307,533,230,230,766,355]
[null,"Maryland",5716785,3648,4917637,22981,588879,20180,164484,1641,2672,1124,273,8206,2501,1603,8340,23202,6564,3454,422,357,3300,431,160,781,396,1376,53,"N/A",1983,3572,820,403,1147,86,54,979,1369,9058,238,10736,5787,0,3277,607,723,13467,782,1710,49,2669,5883,655,350,24765,1542,4363,324,230,612,9180,1004,1268,770,418,2230,1523,798,3099,3764,1906,1271,439,415,1310,330,190,822,362,695,96,"N/A",730,1269,543,383,633,106,88,800,1276,2330,287,2103,2059,289,1497,541,654,3147,626,852,81,1332,1511,451,328,4735,1004,1701,241,299,678]
[null,"Massachusetts",6489250,3528,5583650,23686,706624,22760,140162,583,1891,1572,206,14971,1051,13270,131,1539,11118,1409,682,79,2842,1891,307,0,340,0,4666,3660,"N/A",1624,2185,453,1957,388,46,792,9911,4709,161,20002,2798,0,2163,158,228,5316,6965,1659,0,918,7073,207,1526,4542,1627,0,546,0,3085,8906,382,1205,1170,343,3388,527,2422,214,649,2520,612,598,128,1071,857,253,285,397,285,1266,1356,"N/A",931,2035,534,1987,356,77,705,1876,1295,271,3186,1277,285,975,204,217,1681,1573,1086,285,591,2465,159,673,1704,791,285,404,285,1219]
[null,"Michigan",9762127,4595,8310098,29394,1291901,28130,116149,2403,1040,3197,636,6726,2031,277,167,471,11646,3913,313,66,10651,7816,758,640,2353,1342,645,620,1206,"N/A",1275,656,2921,312,213,1874,437,1676,669,3135,2444,53,9783,2276,537,3134,653,1446,706,4453,7184,545,45,2073,1427,446,6291,568,1432,8123,1803,758,1076,434,2018,695,303,160,272,2178,1925,337,79,1903,2004,493,469,1473,747,477,428,574,"N/A",646,474,1486,235,214,1028,357,861,411,871,903,71,1851,1296,341,1226,702,869,521,1559,2265,388,77,807,666,319,1731,429,1082]
[null,"Minnesota",5244256,3049,4480630,17843,647946,16565,89872,266,1169,4165,279,6233,2521,211,176,306,2575,1776,227,231,6641,1120,4948,1067,402,519,172,1259,1092,2631,"N/A",196,1549,1020,734,540,183,513,151,1309,1673,7316,1035,284,738,730,123,1597,3237,1155,2619,1013,0,2371,1328,200,17929,343,39,6022,342,851,1655,321,1680,1122,259,171,353,951,1237,253,314,2137,433,2094,576,273,402,199,797,531,1867,"N/A",169,898,547,415,364,142,416,137,650,808,1621,669,299,390,459,148,1554,922,1037,1241,792,211,1485,604,211,2252,280,62]
[null,"Mississippi",2931228,3253,2510729,16977,340266,16300,72321,8306,1192,187,4941,3000,1167,71,0,0,4814,4014,276,121,3030,1403,114,330,407,7390,0,649,107,2495,863,"N/A",959,314,0,408,0,403,633,1026,2227,0,1312,663,0,750,145,1860,56,8158,5755,232,0,572,508,94,879,490,814,5412,2433,1055,188,2495,1221,854,140,287,287,1372,1632,383,172,1391,1445,136,360,350,1780,287,529,154,1469,996,"N/A",544,278,287,323,287,398,669,524,1080,287,783,520,287,499,241,982,99,2173,1663,229,287,350,492,177,630,422,728]
[null,"Missouri",5920858,4730,4968921,23164,786726,21904,145226,819,1051,2988,4381,9840,1903,243,314,478,8317,2492,380,830,21277,3351,4708,23427,2552,2238,171,1359,1395,2610,1701,1183,"N/A",220,2636,1060,108,1320,150,2630,1825,848,2163,4647,314,1639,0,954,512,3311,12884,1319,498,3206,1107,177,1331,359,867,7633,561,822,1145,1133,2218,781,282,322,322,2320,1119,294,909,3689,1123,1328,3689,1075,2007,179,812,931,954,810,510,"N/A",192,1240,648,180,804,147,1474,760,1186,847,1478,204,755,259,578,445,1272,3043,664,524,1413,748,231,693,496,658]
[null,"Montana",978507,1744,821709,7063,117752,6986,35630,212,650,1909,672,5756,2185,128,71,0,1373,46,0,1458,1094,251,169,60,321,85,76,51,59,648,1323,242,564,"N/A",340,548,0,0,660,246,1072,1677,89,182,1620,419,0,110,295,111,2101,964,0,497,3250,0,357,1689,11,3807,332,561,1125,487,1903,870,148,120,237,1173,87,237,859,789,233,198,93,490,118,102,86,97,534,603,356,481,"N/A",424,386,237,237,688,282,1127,1012,118,174,861,319,237,150,258,193,1013,618,237,401,1281,237,267,672,19]
[null,"Nebraska",1802697,2153,1497138,11336,247005,9960,51290,232,35,2322,674,4430,4182,361,177,0,1775,1202,257,127,1820,639,5536,2484,153,89,0,77,100,726,2254,823,2723,112,"N/A",232,0,143,831,111,442,777,1232,702,506,345,0,65,2936,77,4445,537,0,772,1230,73,1046,1478,0,4521,262,46,1501,587,1419,1393,562,235,228,992,870,213,135,1218,453,1473,869,166,166,228,100,167,440,1114,865,1319,160,"N/A",180,228,171,805,115,284,978,966,393,385,347,228,105,1369,129,1562,495,228,604,793,89,585,545,228]
[null,"Nevada",2667364,3181,2030410,22983,517261,21311,102677,150,511,7818,530,35472,2935,648,0,0,3579,1187,4363,1686,1711,739,543,453,569,733,0,485,1275,2202,805,946,1747,770,1129,"N/A",59,1528,1220,1204,957,37,1554,886,2629,1567,167,312,1203,706,5224,4500,197,1832,3290,56,419,144,502,8786,246,659,2342,421,5381,1969,868,309,309,2182,1333,2688,984,927,545,371,654,668,757,309,402,752,861,528,748,1218,742,951,"N/A",97,1205,715,753,531,64,852,600,1056,752,223,291,803,681,2241,2410,328,1429,1219,101,244,144,618]
[null,"New Hampshire",1303865,1720,1118359,9822,141213,9061,39367,152,0,544,0,1692,240,3134,0,298,1659,0,51,66,850,23,109,57,0,19,3242,49,13752,230,240,25,295,486,0,95,"N/A",540,276,2462,471,0,28,0,508,674,988,51,0,372,1570,279,2566,745,261,0,268,0,56,4220,235,257,383,257,969,250,1187,257,389,699,257,83,113,741,37,124,100,257,33,983,81,2615,222,270,41,387,638,257,123,"N/A",365,394,997,439,257,35,257,544,406,677,85,257,387,1644,223,1011,807,434,257,418,257,93]
[null,"New Jersey",8709933,4515,7841470,25935,684482,23318,127369,616,383,1625,258,8777,807,2503,1543,431,9841,4588,385,91,2656,402,332,442,91,249,95,4231,2626,1070,322,450,727,122,261,874,705,"N/A",421,41374,3052,0,1584,32,613,22225,332,1134,0,852,3434,178,57,2670,964,358,586,0,2732,8536,406,407,847,346,2628,590,1323,702,335,2289,2901,422,148,995,471,331,403,147,264,112,2100,973,578,274,478,417,206,361,616,380,"N/A",281,5068,1042,281,1069,51,578,3517,376,598,281,631,1520,205,98,1099,617,353,571,281,1263]
[null,"New Mexico",2039549,2727,1735950,14043,220663,12854,73605,751,969,6117,77,6547,2852,25,391,56,3259,1977,122,755,526,465,0,751,739,65,94,1968,2076,1460,179,719,138,1003,530,4192,79,160,"N/A",784,1793,79,1712,1182,1659,809,46,152,204,1269,18511,1601,309,290,3004,0,407,752,632,7703,550,801,2902,109,2252,1095,41,444,95,1428,1097,185,565,362,458,285,581,1131,87,155,1112,1567,843,231,630,211,1419,726,2452,130,200,"N/A",581,844,150,883,854,1403,526,81,182,322,801,3785,1033,435,249,1315,285,339,727,678]
[null,"New York",19171916,7371,16976205,41292,1779540,36331,269427,1310,5070,2649,362,25177,3135,15338,2603,1983,30553,7676,259,198,6533,2497,477,1189,804,1321,2270,5912,16855,4779,1649,872,1870,237,886,2077,2636,35333,829,"N/A",13322,0,6510,2298,2284,20514,1913,7161,521,1730,9692,910,2900,8881,2503,444,2354,151,6740,14924,924,2375,799,249,4560,1173,2651,1828,820,4156,1970,195,198,2144,1311,319,712,500,847,1705,1583,3094,1496,1086,381,961,210,564,810,1065,4610,596,"N/A",3003,275,1610,1033,1098,3022,1041,2607,509,835,2018,988,908,1939,976,285,1588,148,2049]
[null,"North Carolina",9443000,5070,7982017,29580,1141001,25307,263256,3044,1618,2847,550,16699,1842,3752,479,1691,28983,15943,1567,724,5657,4132,1077,2192,4419,2180,2259,9881,4052,5789,1839,1187,1932,230,516,698,2130,7195,1186,19406,"N/A",243,8661,1453,1796,11155,97,23196,362,8685,14329,790,350,25662,2874,3025,2012,870,1950,13976,1381,1103,1062,306,3085,1052,1748,354,548,4184,3370,871,564,1875,1280,806,1266,1984,1222,990,2730,1420,2071,844,818,965,274,357,639,1440,1847,1065,3099,"N/A",402,2362,717,1013,2465,161,4788,304,2249,3409,551,244,3825,1166,1129,910,819,1463]
[null,"North Dakota",665654,1209,556222,6833,75720,5430,30100,109,1066,662,168,1411,873,30,0,175,492,799,53,69,39,45,289,114,97,374,0,121,52,298,12350,0,197,1236,328,382,0,144,380,188,637,"N/A",134,108,313,392,0,0,1038,273,2513,462,0,25,696,0,749,219,0,3890,108,823,481,206,873,614,47,211,275,376,837,84,82,54,77,376,154,85,422,211,94,84,250,2469,211,208,733,316,357,211,183,517,224,680,"N/A",167,120,439,377,211,211,510,270,1293,431,211,39,344,211,480,206,211]
[null,"Ohio",11405101,4931,9745227,23258,1453401,23324,172633,1289,1556,4715,434,8997,2859,1307,15,972,16495,9502,436,564,7092,9438,1270,1016,9159,743,291,3828,3686,15130,2298,89,1171,460,1531,2240,175,2465,515,5988,5985,26,"N/A",1228,342,12012,444,2479,207,4987,7465,485,182,6769,2567,7814,1771,144,2140,10673,751,1531,2132,504,1767,1134,819,25,768,2765,2685,331,694,1635,2077,757,494,1874,511,238,1666,1712,3104,1327,105,569,450,983,1351,205,1028,380,1895,1492,53,"N/A",1044,306,2269,314,1021,215,2031,2241,318,173,1705,905,2197,934,187,1360]
[null,"Oklahoma",3716264,3181,3065497,21363,528824,18463,106511,1612,1397,2759,5873,9429,3184,68,109,0,5438,3159,773,611,2679,957,1108,5024,877,2208,298,382,465,1047,599,1733,4102,448,829,1079,69,890,2723,1118,1991,139,1385,"N/A",398,1316,119,596,83,1872,28238,428,93,2286,2035,221,551,1713,209,8108,1283,1554,1013,1827,2426,1286,129,164,253,1371,1688,864,668,1529,550,660,2088,607,808,278,407,481,478,369,789,1427,342,530,598,131,890,1280,743,1219,136,681,"N/A",300,1283,137,377,135,895,4132,454,109,1049,1130,270,396,1012,222]
[null,"Oregon",3794008,3282,3110896,20156,545841,17758,116700,400,2027,5264,246,34190,2050,270,0,217,2273,688,2323,4129,1565,317,161,678,0,0,0,595,1471,1159,668,735,1786,3386,777,2805,317,544,981,2538,1040,592,1541,821,"N/A",1689,0,989,741,787,3826,2879,456,1124,22793,358,1981,523,821,7898,290,910,1539,217,4899,924,273,277,239,1051,572,1117,1397,862,319,176,685,277,277,277,405,1154,783,442,770,992,1956,574,1436,280,582,679,1146,758,521,902,683,"N/A",1185,277,1271,581,455,1484,1047,405,593,3575,308,1181,336,847]
[null,"Pennsylvania",12577555,4619,11053022,29699,1239199,26490,235580,369,2185,3668,807,12077,3657,4007,4608,1621,18212,4644,332,380,4490,2018,227,1426,1675,625,1621,18281,4455,4961,1491,563,1725,339,551,1810,729,42456,1250,30481,7611,521,14545,1254,918,"N/A",377,1315,966,1611,7778,1048,215,10558,2495,4258,1300,1069,6275,12249,368,1301,1451,601,2875,1375,1559,1169,866,3129,1340,292,408,1429,739,319,1201,766,382,895,2839,1178,2285,873,498,788,290,410,1177,531,5218,883,3719,2053,517,3377,749,545,"N/A",327,651,927,626,2650,684,214,2596,1141,1674,1081,936,2169]
[null,"Rhode Island",1042240,1435,900283,9035,99603,7344,32059,136,0,324,0,1697,59,4090,0,146,1336,382,274,0,1210,206,48,0,0,0,447,977,8639,77,47,0,47,0,0,297,333,1868,0,4583,1376,62,0,199,0,560,"N/A",61,48,71,678,0,72,1399,160,150,0,0,276,4070,214,291,286,291,791,98,1497,291,240,778,377,546,291,768,334,79,291,291,291,350,676,1836,125,78,291,78,291,291,259,322,649,291,1398,1080,103,291,331,291,461,"N/A",105,78,118,500,291,122,908,206,233,291,291,353]
[null,"South Carolina",4577399,3786,3870879,23788,537961,21768,152441,1741,1670,1457,365,4691,1867,3998,249,38,16060,17486,813,233,4253,2174,703,514,2211,2059,603,5184,3765,3709,818,1175,1371,0,0,1173,486,4908,1390,7912,20749,118,3883,1458,1020,4689,154,"N/A",95,3816,4965,455,478,9786,3070,1190,1057,382,269,10548,721,1199,870,280,1983,1378,2132,274,63,3907,3100,521,207,1651,884,870,612,1215,986,448,2183,1826,1403,463,681,797,296,296,793,296,1660,1444,2045,3397,196,1190,1353,951,1531,179,"N/A",109,1732,1539,437,500,2245,1589,536,639,524,229]
[null,"South Dakota",805616,1372,680993,6027,96805,5853,25777,325,25,745,61,1338,807,0,0,0,251,24,75,457,80,439,3520,571,82,129,0,0,407,144,4615,201,252,560,2260,38,0,0,38,758,262,2020,160,296,122,209,0,0,"N/A",0,1334,0,0,224,1564,0,736,648,0,3187,333,44,533,120,703,447,223,223,223,242,44,123,289,134,381,1429,471,103,196,223,223,471,127,1629,213,210,364,1028,63,223,223,67,469,231,1029,174,289,136,268,223,223,"N/A",223,812,223,223,217,973,223,533,549,223]
[null,"Tennessee",6282706,4009,5299496,24505,801355,21988,159778,8897,343,2291,4736,8019,1858,765,248,394,14168,11065,243,333,3162,4764,1052,2506,11188,2602,84,1450,1733,5529,1504,9029,4342,290,187,2433,197,2230,621,4800,7102,0,4462,669,430,2562,805,4765,63,"N/A",8701,2062,0,8650,1412,2201,2831,0,0,11597,2131,300,1160,1836,2431,1182,713,254,484,3004,2592,402,374,1151,1593,864,2041,3378,1490,138,701,904,1806,1160,2461,1588,243,177,1517,238,1219,543,1691,1676,287,2091,482,497,1256,913,2102,112,"N/A",2089,1241,287,2526,911,1455,1402,287,287]
[null,"Texas",24899075,8102,20500156,52416,3740344,51566,486558,8636,11613,16521,15251,68959,16361,924,704,460,26668,16671,3718,2033,20169,6985,3946,11598,5153,31149,1318,4724,7139,13775,6088,7773,12061,1027,4893,8324,1067,7058,11752,16624,12183,2452,8317,22969,4373,7161,975,5249,1936,13044,"N/A",4123,52,13713,8847,2221,5927,1874,4180,20955,2633,3256,3719,3182,7058,3311,551,533,400,4238,3792,1263,1171,3942,2350,1452,2743,1839,5628,889,1564,2275,3091,2182,2477,2517,614,2391,2790,637,2884,2780,4092,3708,1624,1971,4302,1618,2092,613,1965,836,3538,"N/A",1574,88,2694,2397,1231,1723,1022,2074]
[null,"Utah",2724064,2775,2240636,18397,388410,17535,77780,93,1798,8147,316,12187,3987,119,0,138,2097,966,932,7692,1831,517,483,299,235,46,148,426,246,261,914,127,1255,1929,118,4549,0,247,518,1462,1167,0,1527,886,2525,557,0,838,875,459,5305,"N/A",297,3005,3792,0,338,2126,383,6769,114,1320,2522,262,2104,1226,148,267,168,1007,644,930,2177,767,475,348,340,266,98,237,302,253,243,545,134,929,1099,121,1568,267,240,480,752,840,267,1163,947,1094,347,267,716,1215,385,1508,"N/A",494,2000,1538,267,323,1168,446]
[null,"Vermont",619363,779,534975,5691,59032,4857,22529,0,184,65,0,1001,326,1287,87,9,2063,496,49,0,370,0,91,0,176,0,824,300,3599,201,85,0,51,236,0,58,2760,751,0,4056,539,30,50,0,100,524,227,134,153,125,565,0,"N/A",400,128,0,377,52,0,2945,211,181,76,211,506,238,585,111,15,1237,395,71,211,415,211,93,211,146,211,365,294,1075,209,116,211,86,207,211,75,827,390,211,1050,455,50,65,211,122,339,154,157,214,104,449,211,"N/A",361,115,211,488,86,211]
[null,"Virginia",7930773,4735,6752310,28251,870491,21599,259507,2671,3296,3807,1233,17088,3229,2468,1265,10593,18165,11927,2347,1159,7576,2892,1135,2103,2051,2148,1494,24822,4104,5733,462,1858,4262,866,523,748,372,6825,1098,17525,23829,201,7708,781,2137,11796,1543,8339,98,5842,12938,1551,676,"N/A",4373,6779,2648,423,1306,12319,1201,1952,1454,1034,3674,1571,921,828,2299,3554,3210,1394,787,2202,1856,758,1418,1056,926,932,4371,1347,2245,292,1007,2141,1090,475,469,515,1687,735,3087,4041,325,2181,611,2081,2546,1150,2247,179,1776,3212,822,599,"N/A",1700,2481,1525,429,872]
[null,"Washington",6661321,4568,5464985,26926,946923,24983,191784,1322,5644,5971,658,39468,4883,642,202,243,5378,3107,4246,12661,3931,1912,1685,1694,886,1011,717,629,1448,2871,1323,737,3727,5094,323,5310,282,721,1012,4140,2143,515,2727,1986,26235,2893,220,3047,866,789,11338,4020,981,7266,"N/A",62,2180,638,0,12094,1150,2055,2284,531,5451,1316,450,198,260,1314,1650,1482,3237,1438,1321,993,1174,626,588,653,445,796,1443,656,784,2288,1449,245,1954,305,604,599,1494,1189,426,1146,1131,4414,1410,197,1800,729,511,3003,1681,803,2764,"N/A",107,1074,524,277]
[null,"West Virginia",1833535,1890,1625125,9824,166168,9198,39609,41,1326,0,0,760,608,84,556,480,1842,485,0,88,356,366,0,161,851,60,0,4249,191,657,0,44,160,39,0,25,107,906,0,611,2552,268,7925,229,0,4908,238,647,0,1160,968,112,208,4999,192,"N/A",150,0,182,4590,69,1210,269,269,511,553,148,506,466,825,354,269,158,338,311,269,198,732,117,269,1182,169,379,269,75,190,62,269,42,185,537,269,416,985,399,2201,363,269,1396,292,493,269,833,650,144,205,1573,199,"N/A",188,269,232]
[null,"Wisconsin",5623196,3124,4824045,20412,691592,17462,93065,552,798,1854,518,4506,1890,359,351,98,4492,1656,550,902,20299,2563,2300,752,287,331,448,1088,992,6317,16741,810,1716,154,853,1049,69,632,123,1291,1817,497,1674,89,1444,2211,0,1142,235,856,3039,476,75,771,1013,256,"N/A",129,521,6949,523,549,674,299,1080,806,356,522,118,1416,684,532,771,3115,921,936,696,215,302,427,700,1121,1567,2575,987,890,164,685,897,116,422,115,512,1007,373,1063,137,768,1428,218,626,159,469,983,398,123,543,634,229,"N/A",104,478]
[null,"Wyoming",556954,1133,444614,8794,82255,8679,28046,172,0,1511,0,2784,4390,0,0,0,396,745,25,942,415,132,462,532,519,107,0,51,252,570,218,0,421,2528,1711,416,0,0,707,146,34,233,56,62,14,95,0,220,258,495,1990,3226,75,580,556,0,0,"N/A",0,4226,257,269,915,269,1647,1357,269,269,269,347,553,41,849,444,217,641,514,743,144,269,92,470,597,277,269,418,1395,1394,383,269,269,527,144,84,228,90,79,25,118,269,235,183,638,1143,1437,137,459,469,269,269,"N/A",269]
[null,"Puerto Rico",3676493,2933,3392179,13112,247593,12844,31732,629,156,288,0,1177,388,899,0,0,11262,207,0,0,1642,109,0,112,254,109,0,59,2004,89,50,170,221,0,0,0,0,1244,364,4768,146,0,69,0,0,1516,684,109,0,30,977,882,0,392,0,141,585,0,"N/A",4381,711,259,356,285,949,492,653,285,285,2512,334,285,285,1175,173,285,184,211,130,285,106,960,149,83,198,258,285,285,285,285,830,603,1546,240,285,127,285,285,772,829,173,285,56,742,1289,285,320,285,135,815,285,"N/A"]
[null,null,null,null,null,null,null,null,null,99850,94848,177056,64264,575165,141008,90259,30055,56052,439115,245199,49218,53122,279221,130279,66922,90793,93253,88240,32209,159925,146156,178296,104815,68533,148276,35870,43531,109409,38399,195216,50802,367907,207171,24450,188082,90616,100185,211326,25632,117678,27915,143165,412618,76423,18380,232394,166162,49490,111825,28186,59885]
[null,null,null,null,null,null,null,null,null,26,27,13,36,1,19,31,47,38,2,6,42,39,5,20,35,29,28,32,46,15,17,12,24,34,16,45,43,23,44,10,40,4,9,51,11,30,25,8,50,21,49,18,3,33,52,7,14,41,22,48,37]
[]
[null,null,null,null,null,null,null,null,1,1.5,2,2.5,3,3.5,4,4.5,5,5.5,6,6.5,7,7.5,8,8.5,9,9.5,10,10.5,11,11.5,12,12.5,13,13.5,14,14.5,15,15.5,16,16.5,17,17.5,18,18.5,19,19.5,20,20.5,21,21.5,22,22.5,23,23.5,24,24.5,25,25.5,26,26.5,27,27.5,28,28.5,29,29.5,30,30.5,31,31.5,32,32.5,33,33.5,34,34.5,35,35.5,36,36.5,37,37.5,38,38.5,39,39.5,40,40.5,41,41.5,42,42.5,43,43.5,44,44.5,45,45.5,46,46.5,47,47.5,48,48.5,49,49.5,50,50.5,51,51.5,52,52.5,53,53.5]
[null,null,null,null,null,null,null,null,"Estimate","MOE","Estimate","MOE","Estimate","MOE","Estimate","MOE","Estimate","MOE","Estimate","MOE","Estimate","MOE","Estimate","MOE","Estimate","MOE","Estimate","MOE","Estimate","MOE","Estimate","MOE","Estimate","MOE","Estimate","MOE","Estimate","MOE","Estimate","MOE","Estimate","MOE","Estimate","MOE","Estimate","MOE","Estimate","MOE","Estimate","MOE","Estimate","MOE","Estimate","MOE","Estimate","MOE","Estimate","MOE","Estimate","MOE","Estimate","MOE","Estimate","MOE","Estimate","MOE","Estimate","MOE","Estimate","MOE","Estimate","MOE","Estimate","MOE","Estimate","MOE","Estimate","MOE","Estimate","MOE","Estimate","MOE","Estimate","MOE","Estimate","MOE","Estimate","MOE","Estimate","MOE","Estimate","MOE","Estimate","MOE","Estimate","MOE","Estimate","MOE","Estimate","MOE","Estimate","MOE","Estimate","MOE","Estimate","MOE","Estimate","MOE","Estimate","MOE","Estimate","MOE","Estimate","MOE"]
[null,null,null,null,null,null,null,null,6743229,69387,99221,8532,94692,9780,176768,9764,64264,6502,573988,20898,140620,8392,89360,8104,30055,4817,56052,5274,427853,16117,244992,13712,49218,5580,53122,6197,277579,14177,130170,9685,66922,5441,90681,7300,92999,8240,88131,8540,32209,4475,159866,9741,144152,8102,178207,11238,104765,7734,68363,7286,148055,11141,35870,4482,43531,5996,109409,10422,38399,4262,193972,11560,50438,5032,363139,16245,207025,11068,24450,3757,188013,11207,90616,7414,100185,8825,209810,10357,24948,3127,117569,9315,27915,3665,143135,9159,411641,16805,75541,7183,18380,3009,232002,11248,166162,10010,49349,5605,111240,9166,28186,3185,59885,6923]
[null,null,null,null,null,null,null,null,108723,8781,"N/A","N/A",3013,1452,676,606,1481,1038,3827,1660,1278,778,454,694,811,694,211,186,15062,3138,21644,3955,267,440,304,399,2503,1224,3945,1979,669,882,649,516,1967,1192,1901,868,97,158,716,458,435,396,2334,1294,386,358,7233,2367,1373,1180,229,182,169,286,265,297,0,273,356,285,650,749,3686,2920,2371,945,169,213,2222,931,880,609,485,435,1477,696,0,273,2368,1142,31,62,7409,1926,6500,2016,1336,1129,0,273,2490,1026,1171,756,41,73,1155,895,27,52,228,265]
[null,null,null,null,null,null,null,null,36326,3708,477,790,"N/A","N/A",1354,805,47,78,3906,1041,1930,866,0,246,0,246,14,23,2315,1026,1251,902,1705,1289,895,524,388,293,9,24,262,349,106,107,1440,1506,100,171,574,655,704,460,107,183,923,814,530,409,263,386,0,246,616,507,215,259,240,247,316,368,413,501,421,446,255,206,698,587,69,89,156,213,1455,971,1793,1104,126,164,0,246,121,153,531,817,477,341,4123,1774,1274,926,353,429,714,681,2421,790,0,246,158,198,81,131,19,30]
[null,null,null,null,null,null,null,null,222725,11873,416,305,3109,1297,"N/A","N/A",689,415,47164,6018,7687,2494,479,386,738,774,0,305,7712,2149,4261,1828,1966,928,2147,984,12250,3263,2690,1358,3008,1405,1935,1008,1705,928,2014,1697,241,308,1284,1052,1449,975,6354,1796,5421,1542,272,238,4567,1621,1343,1038,1750,1130,10342,3881,64,105,1782,762,4419,1430,6618,2661,4463,1627,826,612,5225,1513,2910,1310,5430,1887,5535,2842,403,336,2310,1189,1351,843,3061,1643,14705,3301,7164,3154,664,498,3413,1613,12645,2459,595,563,5556,1827,593,393,599,771]
[null,null,null,null,null,null,null,null,79127,7901,1405,1001,934,798,777,557,"N/A","N/A",4457,1991,2535,1149,451,315,0,273,154,264,3578,1239,3921,2077,129,166,618,754,3221,1474,722,498,85,143,3611,1704,2540,1895,4012,1625,0,273,306,254,190,196,1506,674,222,153,2764,1337,7320,2181,85,159,394,538,67,104,0,273,77,130,0,273,289,336,1561,900,0,273,1137,811,8607,3434,239,174,731,570,0,273,1496,983,243,264,2653,1121,13707,2911,361,322,0,273,494,382,264,228,0,273,821,503,443,513,87,146]
[null,null,null,null,null,null,null,null,444749,18415,3364,1977,9579,2911,33854,4816,4172,1340,"N/A","N/A",15662,3236,4631,1802,643,408,3683,1306,20362,4008,8820,2545,9528,2191,5719,1572,16482,2806,6550,1860,3163,1259,3857,1813,3394,1797,2989,1207,1796,1139,10626,2848,11969,2774,10435,2487,5095,1319,2757,1338,6921,2357,3009,1511,3062,1860,27724,4878,1614,1059,10108,2848,4632,1266,20981,2977,9593,2005,392,343,8170,2399,5708,1591,20913,3580,9948,1991,526,264,5016,2183,1604,1117,4349,1174,36582,5299,10653,2235,525,369,14232,2597,30544,4481,1446,919,6031,2181,1336,664,1223,1128]
[null,null,null,null,null,null,null,null,186366,9897,954,803,2225,1220,12287,2324,1034,739,26089,4183,"N/A","N/A",459,360,486,486,479,381,8849,2300,6445,2553,2355,1220,839,572,6950,1968,3296,1584,2140,1179,4308,1577,1961,1194,968,664,532,385,1532,978,2242,778,4587,1679,2878,1093,1277,883,1978,803,2042,1490,4065,1455,4131,1784,791,521,1259,537,3921,1326,4594,1518,2940,1376,802,598,2838,1325,3464,1440,4330,1962,3928,1124,192,248,1231,796,1847,826,1628,706,22253,4494,4748,1658,350,246,2739,1077,7583,3004,623,493,2499,1153,4418,1439,874,880]
[null,null,null,null,null,null,null,null,77333,6651,896,891,0,281,664,484,334,517,4479,1653,547,487,"N/A","N/A",149,227,331,343,9207,2532,748,467,182,171,147,130,3391,1847,1074,798,108,131,0,281,400,430,0,281,528,447,1531,814,8510,2107,770,486,934,659,67,111,42,68,0,281,0,281,507,424,1049,628,3475,1175,112,189,20727,3325,1345,587,0,281,1296,710,145,171,640,592,1955,808,1728,796,1140,627,0,281,430,389,1887,1100,0,281,458,419,1735,691,2084,1631,442,674,1092,1321,47,78,2027,1233]
[null,null,null,null,null,null,null,null,30759,4030,128,211,68,111,60,78,0,265,353,290,178,249,714,693,"N/A","N/A",432,467,2362,996,585,575,0,265,0,265,612,583,0,265,0,265,28,47,163,273,0,265,294,406,4969,1144,689,538,61,102,55,92,0,265,539,842,73,120,0,265,106,183,139,246,3678,935,59,98,4251,1555,424,466,0,265,325,339,0,265,0,265,7318,2368,149,241,195,272,0,265,146,248,178,313,0,265,0,265,1051,538,377,280,0,265,0,265,0,265,954,1095]
[null,null,null,null,null,null,null,null,51244,4828,360,418,591,529,662,466,155,195,4205,1255,656,637,926,592,0,292,"N/A","N/A",1100,609,1597,795,0,292,0,292,615,373,711,461,392,377,83,137,94,155,0,292,76,121,13503,2647,1376,540,126,153,87,105,0,292,272,371,0,292,62,103,0,292,137,136,1924,694,61,100,3852,1325,1897,1089,98,165,598,359,0,292,601,520,2378,771,249,206,380,339,0,292,591,543,1180,605,0,292,199,245,7915,1638,284,220,860,754,391,325,0,292,0,292]
[null,null,null,null,null,null,null,null,482889,22701,15830,3829,5887,2502,3907,1463,3611,1562,22130,3867,6428,1941,11183,2730,3099,1603,1110,564,"N/A","N/A",35615,5500,2021,990,884,747,17432,3007,9030,2849,2921,1091,4136,2062,6321,1902,7232,2781,5497,1861,13241,2929,13900,2269,21359,4622,5439,2349,7929,3596,7984,2232,338,289,1544,1314,7050,3281,3645,1193,22344,3256,900,872,55011,6848,19108,3464,794,720,21047,3825,3466,1518,1655,1187,19935,3976,1982,813,10759,2906,430,473,12882,2482,24039,5038,2833,1249,1442,935,20080,4137,3573,1239,5634,2872,8081,2929,191,258,12968,4149]
[null,null,null,null,null,null,null,null,249459,15858,13840,2473,3645,1932,2554,1303,599,436,8909,2412,3224,2058,2619,1473,837,753,1708,1278,49901,5558,"N/A","N/A",1040,658,414,478,9736,3665,2649,1023,1096,821,1355,1097,6525,2248,3645,1604,0,300,5382,1767,3910,2127,6857,1831,1169,718,2380,959,3072,1087,52,92,148,139,1155,684,162,161,4151,1203,826,509,12472,2568,15361,3426,0,300,9323,2446,2070,1458,843,626,6294,1914,43,70,15562,3592,557,540,14445,3273,11424,2574,380,291,361,458,8393,2087,4495,2034,358,295,3416,2022,102,118,1010,742]
[null,null,null,null,null,null,null,null,53581,6065,749,542,743,609,1398,849,0,275,12677,2325,1073,667,307,392,0,275,0,275,4599,2610,2013,1185,"N/A","N/A",42,70,715,412,192,209,68,118,387,345,95,159,88,151,89,145,990,737,1283,944,627,548,476,350,234,368,170,171,150,261,0,275,1925,1184,496,685,443,417,11,19,1339,794,1510,994,69,116,625,515,57,94,1834,958,553,478,644,829,322,378,267,380,142,205,6694,2760,467,369,0,275,2644,1136,2705,883,483,782,1168,1133,18,33,0,275]
[null,null,null,null,null,null,null,null,55638,6079,376,369,3264,1813,3086,2015,45,73,8932,2415,1372,867,0,267,0,267,144,233,612,508,313,280,123,206,"N/A","N/A",169,236,132,133,773,470,422,415,315,272,59,102,202,272,44,73,115,135,427,363,465,613,37,61,425,345,1509,584,0,267,2110,1061,109,147,97,148,694,811,155,169,134,164,96,112,325,261,711,702,3202,1259,172,206,0,267,0,267,296,375,1153,995,1746,951,8014,2403,0,267,611,662,10876,2438,133,158,233,292,1410,723,233,374]
[null,null,null,null,null,null,null,null,203959,11573,1397,596,1764,1078,5921,1897,1194,665,16205,3236,3850,1360,2264,1125,56,57,1047,581,8051,1715,6781,2524,1224,776,313,258,"N/A","N/A",21918,4147,9141,1866,1970,991,2921,831,1419,687,55,93,1985,1210,2811,1111,11865,2138,4300,1815,1093,861,16703,3325,928,937,546,373,2541,1214,206,202,2331,1262,996,709,8479,2555,5504,2479,1112,788,5103,1201,1459,777,1224,789,5190,1822,838,643,1565,787,292,264,3999,1131,12245,3113,658,427,260,257,3831,1241,1642,707,812,523,15364,2866,586,432,2055,820]
[null,null,null,null,null,null,null,null,127353,8463,1502,1110,177,143,2210,914,1548,1104,8959,2863,1362,658,544,404,0,267,181,156,5496,1564,1623,913,267,316,772,604,27950,4658,"N/A","N/A",1885,1191,1582,996,10643,2402,749,599,30,50,1641,950,103,135,9361,1837,916,385,270,255,3893,2531,164,201,705,654,227,239,114,134,1876,1526,188,229,2564,952,2828,1141,0,267,13272,2750,681,563,423,380,2668,1128,174,284,584,405,216,258,3093,1261,6335,1643,444,432,45,73,3673,1633,571,340,669,562,1762,893,413,403,572,457]
[null,null,null,null,null,null,null,null,72557,5707,330,202,519,407,1483,623,247,190,2847,1227,2554,865,114,155,0,228,53,85,1364,573,973,472,866,651,315,415,17016,2840,1710,917,"N/A","N/A",1520,741,334,377,315,384,0,228,134,156,189,175,1439,652,7564,1722,117,138,6031,2253,836,743,4783,1799,623,371,381,531,472,405,492,490,273,270,1123,744,601,617,632,421,679,491,1071,568,378,242,0,228,591,442,1992,980,1617,1222,4131,1470,146,156,45,81,303,329,538,365,0,228,2705,1206,111,119,149,176]
[null,null,null,null,null,null,null,null,95059,7804,44,75,1050,697,2238,878,1596,1073,6125,1459,6022,2519,85,140,238,275,0,248,2863,1848,1916,1039,128,154,398,407,2943,1096,1544,859,1875,1184,"N/A","N/A",1048,1402,890,580,0,248,1369,1103,100,120,806,457,1562,1147,167,146,23384,3524,289,318,2678,875,1318,1245,76,130,1743,1236,873,580,2390,1235,1083,649,225,373,1509,1127,7568,2302,514,610,563,537,39,79,137,211,352,227,1152,821,9217,2824,238,298,75,126,1648,934,1175,792,0,248,1233,898,573,531,68,88]
[null,null,null,null,null,null,null,null,118443,8947,2161,871,3017,2024,2598,1483,558,547,3779,1387,329,363,698,710,38,64,147,210,10119,2893,6397,2093,520,520,71,119,4659,1887,11906,2334,656,788,1109,1031,"N/A","N/A",437,435,0,271,1395,995,1036,738,4672,1897,930,781,1442,917,3153,1147,0,271,858,809,76,129,0,271,1147,807,122,189,2057,1057,3758,1216,0,271,15598,2549,1153,900,181,220,2618,1480,289,381,1286,741,163,262,11153,3003,5758,1631,905,721,525,515,3671,1981,716,599,2297,1276,1993,1413,292,462,179,240]
[null,null,null,null,null,null,null,null,97889,8319,5740,2537,1504,922,1960,1204,2382,1114,5751,1933,1215,567,89,120,0,281,264,228,9394,2799,5766,1868,342,502,202,205,2131,1394,948,651,625,656,706,483,1656,1093,"N/A","N/A",162,269,963,699,995,702,1301,886,569,513,7032,2217,2852,1534,40,72,119,193,1552,785,462,427,171,249,294,256,2161,822,1443,686,438,514,1100,774,1074,675,281,277,1350,747,0,281,1130,706,0,281,1853,621,26134,3903,473,380,0,281,1278,733,1509,1126,210,254,237,229,31,67,402,285]
[null,null,null,null,null,null,null,null,27758,3059,402,311,424,439,254,290,67,112,1066,740,478,377,1361,689,174,229,55,89,3025,924,844,817,62,102,0,230,311,251,259,379,337,561,56,92,484,643,115,211,"N/A","N/A",243,223,3521,958,122,133,91,109,0,230,201,260,275,335,204,283,345,344,4058,1966,902,508,234,298,2339,962,1001,1161,55,89,315,362,124,215,0,230,375,287,379,284,148,160,0,230,249,231,458,327,390,427,420,368,654,307,381,533,0,230,0,230,500,766,204,355]
[null,null,null,null,null,null,null,null,164484,9180,1641,1004,2672,1268,1124,770,273,418,8206,2230,2501,1523,1603,798,8340,3099,23202,3764,6564,1906,3454,1271,422,439,357,415,3300,1310,431,330,160,190,781,822,396,362,1376,695,53,96,"N/A","N/A",1983,730,3572,1269,820,543,403,383,1147,633,86,106,54,88,979,800,1369,1276,9058,2330,238,287,10736,2103,5787,2059,0,289,3277,1497,607,541,723,654,13467,3147,782,626,1710,852,49,81,2669,1332,5883,1511,655,451,350,328,24765,4735,1542,1004,4363,1701,324,241,230,299,612,678]
[null,null,null,null,null,null,null,null,140162,8906,583,382,1891,1205,1572,1170,206,343,14971,3388,1051,527,13270,2422,131,214,1539,649,11118,2520,1409,612,682,598,79,128,2842,1071,1891,857,307,253,0,285,340,397,0,285,4666,1266,3660,1356,"N/A","N/A",1624,931,2185,2035,453,534,1957,1987,388,356,46,77,792,705,9911,1876,4709,1295,161,271,20002,3186,2798,1277,0,285,2163,975,158,204,228,217,5316,1681,6965,1573,1659,1086,0,285,918,591,7073,2465,207,159,1526,673,4542,1704,1627,791,0,285,546,404,0,285,3085,1219]
[null,null,null,null,null,null,null,null,116149,8123,2403,1803,1040,758,3197,1076,636,434,6726,2018,2031,695,277,303,167,160,471,272,11646,2178,3913,1925,313,337,66,79,10651,1903,7816,2004,758,493,640,469,2353,1473,1342,747,645,477,620,428,1206,574,"N/A","N/A",1275,646,656,474,2921,1486,312,235,213,214,1874,1028,437,357,1676,861,669,411,3135,871,2444,903,53,71,9783,1851,2276,1296,537,341,3134,1226,653,702,1446,869,706,521,4453,1559,7184,2265,545,388,45,77,2073,807,1427,666,446,319,6291,1731,568,429,1432,1082]
[null,null,null,null,null,null,null,null,89872,6022,266,342,1169,851,4165,1655,279,321,6233,1680,2521,1122,211,259,176,171,306,353,2575,951,1776,1237,227,253,231,314,6641,2137,1120,433,4948,2094,1067,576,402,273,519,402,172,199,1259,797,1092,531,2631,1867,"N/A","N/A",196,169,1549,898,1020,547,734,415,540,364,183,142,513,416,151,137,1309,650,1673,808,7316,1621,1035,669,284,299,738,390,730,459,123,148,1597,1554,3237,922,1155,1037,2619,1241,1013,792,0,211,2371,1485,1328,604,200,211,17929,2252,343,280,39,62]
[null,null,null,null,null,null,null,null,72321,5412,8306,2433,1192,1055,187,188,4941,2495,3000,1221,1167,854,71,140,0,287,0,287,4814,1372,4014,1632,276,383,121,172,3030,1391,1403,1445,114,136,330,360,407,350,7390,1780,0,287,649,529,107,154,2495,1469,863,996,"N/A","N/A",959,544,314,278,0,287,408,323,0,287,403,398,633,669,1026,524,2227,1080,0,287,1312,783,663,520,0,287,750,499,145,241,1860,982,56,99,8158,2173,5755,1663,232,229,0,287,572,350,508,492,94,177,879,630,490,422,814,728]
[null,null,null,null,null,null,null,null,145226,7633,819,561,1051,822,2988,1145,4381,1133,9840,2218,1903,781,243,282,314,322,478,322,8317,2320,2492,1119,380,294,830,909,21277,3689,3351,1123,4708,1328,23427,3689,2552,1075,2238,2007,171,179,1359,812,1395,931,2610,954,1701,810,1183,510,"N/A","N/A",220,192,2636,1240,1060,648,108,180,1320,804,150,147,2630,1474,1825,760,848,1186,2163,847,4647,1478,314,204,1639,755,0,259,954,578,512,445,3311,1272,12884,3043,1319,664,498,524,3206,1413,1107,748,177,231,1331,693,359,496,867,658]
[null,null,null,null,null,null,null,null,35630,3807,212,332,650,561,1909,1125,672,487,5756,1903,2185,870,128,148,71,120,0,237,1373,1173,46,87,0,237,1458,859,1094,789,251,233,169,198,60,93,321,490,85,118,76,102,51,86,59,97,648,534,1323,603,242,356,564,481,"N/A","N/A",340,424,548,386,0,237,0,237,660,688,246,282,1072,1127,1677,1012,89,118,182,174,1620,861,419,319,0,237,110,150,295,258,111,193,2101,1013,964,618,0,237,497,401,3250,1281,0,237,357,267,1689,672,11,19]
[null,null,null,null,null,null,null,null,51290,4521,232,262,35,46,2322,1501,674,587,4430,1419,4182,1393,361,562,177,235,0,228,1775,992,1202,870,257,213,127,135,1820,1218,639,453,5536,1473,2484,869,153,166,89,166,0,228,77,100,100,167,726,440,2254,1114,823,865,2723,1319,112,160,"N/A","N/A",232,180,0,228,143,171,831,805,111,115,442,284,777,978,1232,966,702,393,506,385,345,347,0,228,65,105,2936,1369,77,129,4445,1562,537,495,0,228,772,604,1230,793,73,89,1046,585,1478,545,0,228]
[null,null,null,null,null,null,null,null,102677,8786,150,246,511,659,7818,2342,530,421,35472,5381,2935,1969,648,868,0,309,0,309,3579,2182,1187,1333,4363,2688,1686,984,1711,927,739,545,543,371,453,654,569,668,733,757,0,309,485,402,1275,752,2202,861,805,528,946,748,1747,1218,770,742,1129,951,"N/A","N/A",59,97,1528,1205,1220,715,1204,753,957,531,37,64,1554,852,886,600,2629,1056,1567,752,167,223,312,291,1203,803,706,681,5224,2241,4500,2410,197,328,1832,1429,3290,1219,56,101,419,244,144,144,502,618]
[null,null,null,null,null,null,null,null,39367,4220,152,235,0,257,544,383,0,257,1692,969,240,250,3134,1187,0,257,298,389,1659,699,0,257,51,83,66,113,850,741,23,37,109,124,57,100,0,257,19,33,3242,983,49,81,13752,2615,230,222,240,270,25,41,295,387,486,638,0,257,95,123,"N/A","N/A",540,365,276,394,2462,997,471,439,0,257,28,35,0,257,508,544,674,406,988,677,51,85,0,257,372,387,1570,1644,279,223,2566,1011,745,807,261,434,0,257,268,418,0,257,56,93]
[null,null,null,null,null,null,null,null,127369,8536,616,406,383,407,1625,847,258,346,8777,2628,807,590,2503,1323,1543,702,431,335,9841,2289,4588,2901,385,422,91,148,2656,995,402,471,332,331,442,403,91,147,249,264,95,112,4231,2100,2626,973,1070,578,322,274,450,478,727,417,122,206,261,361,874,616,705,380,"N/A","N/A",421,281,41374,5068,3052,1042,0,281,1584,1069,32,51,613,578,22225,3517,332,376,1134,598,0,281,852,631,3434,1520,178,205,57,98,2670,1099,964,617,358,353,586,571,0,281,2732,1263]
[null,null,null,null,null,null,null,null,73605,7703,751,550,969,801,6117,2902,77,109,6547,2252,2852,1095,25,41,391,444,56,95,3259,1428,1977,1097,122,185,755,565,526,362,465,458,0,285,751,581,739,1131,65,87,94,155,1968,1112,2076,1567,1460,843,179,231,719,630,138,211,1003,1419,530,726,4192,2452,79,130,160,200,"N/A","N/A",784,581,1793,844,79,150,1712,883,1182,854,1659,1403,809,526,46,81,152,182,204,322,1269,801,18511,3785,1601,1033,309,435,290,249,3004,1315,0,285,407,339,752,727,632,678]
[null,null,null,null,null,null,null,null,269427,14924,1310,924,5070,2375,2649,799,362,249,25177,4560,3135,1173,15338,2651,2603,1828,1983,820,30553,4156,7676,1970,259,195,198,198,6533,2144,2497,1311,477,319,1189,712,804,500,1321,847,2270,1705,5912,1583,16855,3094,4779,1496,1649,1086,872,381,1870,961,237,210,886,564,2077,810,2636,1065,35333,4610,829,596,"N/A","N/A",13322,3003,0,275,6510,1610,2298,1033,2284,1098,20514,3022,1913,1041,7161,2607,521,509,1730,835,9692,2018,910,988,2900,908,8881,1939,2503,976,444,285,2354,1588,151,148,6740,2049]
[null,null,null,null,null,null,null,null,263256,13976,3044,1381,1618,1103,2847,1062,550,306,16699,3085,1842,1052,3752,1748,479,354,1691,548,28983,4184,15943,3370,1567,871,724,564,5657,1875,4132,1280,1077,806,2192,1266,4419,1984,2180,1222,2259,990,9881,2730,4052,1420,5789,2071,1839,844,1187,818,1932,965,230,274,516,357,698,639,2130,1440,7195,1847,1186,1065,19406,3099,"N/A","N/A",243,402,8661,2362,1453,717,1796,1013,11155,2465,97,161,23196,4788,362,304,8685,2249,14329,3409,790,551,350,244,25662,3825,2874,1166,3025,1129,2012,910,870,819,1950,1463]
[null,null,null,null,null,null,null,null,30100,3890,109,108,1066,823,662,481,168,206,1411,873,873,614,30,47,0,211,175,275,492,376,799,837,53,84,69,82,39,54,45,77,289,376,114,154,97,85,374,422,0,211,121,94,52,84,298,250,12350,2469,0,211,197,208,1236,733,328,316,382,357,0,211,144,183,380,517,188,224,637,680,"N/A","N/A",134,167,108,120,313,439,392,377,0,211,0,211,1038,510,273,270,2513,1293,462,431,0,211,25,39,696,344,0,211,749,480,219,206,0,211]
[null,null,null,null,null,null,null,null,172633,10673,1289,751,1556,1531,4715,2132,434,504,8997,1767,2859,1134,1307,819,15,25,972,768,16495,2765,9502,2685,436,331,564,694,7092,1635,9438,2077,1270,757,1016,494,9159,1874,743,511,291,238,3828,1666,3686,1712,15130,3104,2298,1327,89,105,1171,569,460,450,1531,983,2240,1351,175,205,2465,1028,515,380,5988,1895,5985,1492,26,53,"N/A","N/A",1228,1044,342,306,12012,2269,444,314,2479,1021,207,215,4987,2031,7465,2241,485,318,182,173,6769,1705,2567,905,7814,2197,1771,934,144,187,2140,1360]
[null,null,null,null,null,null,null,null,106511,8108,1612,1283,1397,1554,2759,1013,5873,1827,9429,2426,3184,1286,68,129,109,164,0,253,5438,1371,3159,1688,773,864,611,668,2679,1529,957,550,1108,660,5024,2088,877,607,2208,808,298,278,382,407,465,481,1047,478,599,369,1733,789,4102,1427,448,342,829,530,1079,598,69,131,890,890,2723,1280,1118,743,1991,1219,139,136,1385,681,"N/A","N/A",398,300,1316,1283,119,137,596,377,83,135,1872,895,28238,4132,428,454,93,109,2286,1049,2035,1130,221,270,551,396,1713,1012,209,222]
[null,null,null,null,null,null,null,null,116700,7898,400,290,2027,910,5264,1539,246,217,34190,4899,2050,924,270,273,0,277,217,239,2273,1051,688,572,2323,1117,4129,1397,1565,862,317,319,161,176,678,685,0,277,0,277,0,277,595,405,1471,1154,1159,783,668,442,735,770,1786,992,3386,1956,777,574,2805,1436,317,280,544,582,981,679,2538,1146,1040,758,592,521,1541,902,821,683,"N/A","N/A",1689,1185,0,277,989,1271,741,581,787,455,3826,1484,2879,1047,456,405,1124,593,22793,3575,358,308,1981,1181,523,336,821,847]
[null,null,null,null,null,null,null,null,235580,12249,369,368,2185,1301,3668,1451,807,601,12077,2875,3657,1375,4007,1559,4608,1169,1621,866,18212,3129,4644,1340,332,292,380,408,4490,1429,2018,739,227,319,1426,1201,1675,766,625,382,1621,895,18281,2839,4455,1178,4961,2285,1491,873,563,498,1725,788,339,290,551,410,1810,1177,729,531,42456,5218,1250,883,30481,3719,7611,2053,521,517,14545,3377,1254,749,918,545,"N/A","N/A",377,327,1315,651,966,927,1611,626,7778,2650,1048,684,215,214,10558,2596,2495,1141,4258,1674,1300,1081,1069,936,6275,2169]
[null,null,null,null,null,null,null,null,32059,4070,136,214,0,291,324,286,0,291,1697,791,59,98,4090,1497,0,291,146,240,1336,778,382,377,274,546,0,291,1210,768,206,334,48,79,0,291,0,291,0,291,447,350,977,676,8639,1836,77,125,47,78,0,291,47,78,0,291,0,291,297,259,333,322,1868,649,0,291,4583,1398,1376,1080,62,103,0,291,199,331,0,291,560,461,"N/A","N/A",61,105,48,78,71,118,678,500,0,291,72,122,1399,908,160,206,150,233,0,291,0,291,276,353]
[null,null,null,null,null,null,null,null,152441,10548,1741,721,1670,1199,1457,870,365,280,4691,1983,1867,1378,3998,2132,249,274,38,63,16060,3907,17486,3100,813,521,233,207,4253,1651,2174,884,703,870,514,612,2211,1215,2059,986,603,448,5184,2183,3765,1826,3709,1403,818,463,1175,681,1371,797,0,296,0,296,1173,793,486,296,4908,1660,1390,1444,7912,2045,20749,3397,118,196,3883,1190,1458,1353,1020,951,4689,1531,154,179,"N/A","N/A",95,109,3816,1732,4965,1539,455,437,478,500,9786,2245,3070,1589,1190,536,1057,639,382,524,269,229]
[null,null,null,null,null,null,null,null,25777,3187,325,333,25,44,745,533,61,120,1338,703,807,447,0,223,0,223,0,223,251,242,24,44,75,123,457,289,80,134,439,381,3520,1429,571,471,82,103,129,196,0,223,0,223,407,471,144,127,4615,1629,201,213,252,210,560,364,2260,1028,38,63,0,223,0,223,38,67,758,469,262,231,2020,1029,160,174,296,289,122,136,209,268,0,223,0,223,"N/A","N/A",0,223,1334,812,0,223,0,223,224,217,1564,973,0,223,736,533,648,549,0,223]
[null,null,null,null,null,null,null,null,159778,11597,8897,2131,343,300,2291,1160,4736,1836,8019,2431,1858,1182,765,713,248,254,394,484,14168,3004,11065,2592,243,402,333,374,3162,1151,4764,1593,1052,864,2506,2041,11188,3378,2602,1490,84,138,1450,701,1733,904,5529,1806,1504,1160,9029,2461,4342,1588,290,243,187,177,2433,1517,197,238,2230,1219,621,543,4800,1691,7102,1676,0,287,4462,2091,669,482,430,497,2562,1256,805,913,4765,2102,63,112,"N/A","N/A",8701,2089,2062,1241,0,287,8650,2526,1412,911,2201,1455,2831,1402,0,287,0,287]
[null,null,null,null,null,null,null,null,486558,20955,8636,2633,11613,3256,16521,3719,15251,3182,68959,7058,16361,3311,924,551,704,533,460,400,26668,4238,16671,3792,3718,1263,2033,1171,20169,3942,6985,2350,3946,1452,11598,2743,5153,1839,31149,5628,1318,889,4724,1564,7139,2275,13775,3091,6088,2182,7773,2477,12061,2517,1027,614,4893,2391,8324,2790,1067,637,7058,2884,11752,2780,16624,4092,12183,3708,2452,1624,8317,1971,22969,4302,4373,1618,7161,2092,975,613,5249,1965,1936,836,13044,3538,"N/A","N/A",4123,1574,52,88,13713,2694,8847,2397,2221,1231,5927,1723,1874,1022,4180,2074]
[null,null,null,null,null,null,null,null,77780,6769,93,114,1798,1320,8147,2522,316,262,12187,2104,3987,1226,119,148,0,267,138,168,2097,1007,966,644,932,930,7692,2177,1831,767,517,475,483,348,299,340,235,266,46,98,148,237,426,302,246,253,261,243,914,545,127,134,1255,929,1929,1099,118,121,4549,1568,0,267,247,240,518,480,1462,752,1167,840,0,267,1527,1163,886,947,2525,1094,557,347,0,267,838,716,875,1215,459,385,5305,1508,"N/A","N/A",297,494,3005,2000,3792,1538,0,267,338,323,2126,1168,383,446]
[null,null,null,null,null,null,null,null,22529,2945,0,211,184,181,65,76,0,211,1001,506,326,238,1287,585,87,111,9,15,2063,1237,496,395,49,71,0,211,370,415,0,211,91,93,0,211,176,146,0,211,824,365,300,294,3599,1075,201,209,85,116,0,211,51,86,236,207,0,211,58,75,2760,827,751,390,0,211,4056,1050,539,455,30,50,50,65,0,211,100,122,524,339,227,154,134,157,153,214,125,104,565,449,0,211,"N/A","N/A",400,361,128,115,0,211,377,488,52,86,0,211]
[null,null,null,null,null,null,null,null,259507,12319,2671,1201,3296,1952,3807,1454,1233,1034,17088,3674,3229,1571,2468,921,1265,828,10593,2299,18165,3554,11927,3210,2347,1394,1159,787,7576,2202,2892,1856,1135,758,2103,1418,2051,1056,2148,926,1494,932,24822,4371,4104,1347,5733,2245,462,292,1858,1007,4262,2141,866,1090,523,475,748,469,372,515,6825,1687,1098,735,17525,3087,23829,4041,201,325,7708,2181,781,611,2137,2081,11796,2546,1543,1150,8339,2247,98,179,5842,1776,12938,3212,1551,822,676,599,"N/A","N/A",4373,1700,6779,2481,2648,1525,423,429,1306,872]
[null,null,null,null,null,null,null,null,191784,12094,1322,1150,5644,2055,5971,2284,658,531,39468,5451,4883,1316,642,450,202,198,243,260,5378,1314,3107,1650,4246,1482,12661,3237,3931,1438,1912,1321,1685,993,1694,1174,886,626,1011,588,717,653,629,445,1448,796,2871,1443,1323,656,737,784,3727,2288,5094,1449,323,245,5310,1954,282,305,721,604,1012,599,4140,1494,2143,1189,515,426,2727,1146,1986,1131,26235,4414,2893,1410,220,197,3047,1800,866,729,789,511,11338,3003,4020,1681,981,803,7266,2764,"N/A","N/A",62,107,2180,1074,638,524,0,277]
[null,null,null,null,null,null,null,null,39609,4590,41,69,1326,1210,0,269,0,269,760,511,608,553,84,148,556,506,480,466,1842,825,485,354,0,269,88,158,356,338,366,311,0,269,161,198,851,732,60,117,0,269,4249,1182,191,169,657,379,0,269,44,75,160,190,39,62,0,269,25,42,107,185,906,537,0,269,611,416,2552,985,268,399,7925,2201,229,363,0,269,4908,1396,238,292,647,493,0,269,1160,833,968,650,112,144,208,205,4999,1573,192,199,"N/A","N/A",150,188,0,269,182,232]
[null,null,null,null,null,null,null,null,93065,6949,552,523,798,549,1854,674,518,299,4506,1080,1890,806,359,356,351,522,98,118,4492,1416,1656,684,550,532,902,771,20299,3115,2563,921,2300,936,752,696,287,215,331,302,448,427,1088,700,992,1121,6317,1567,16741,2575,810,987,1716,890,154,164,853,685,1049,897,69,116,632,422,123,115,1291,512,1817,1007,497,373,1674,1063,89,137,1444,768,2211,1428,0,218,1142,626,235,159,856,469,3039,983,476,398,75,123,771,543,1013,634,256,229,"N/A","N/A",129,104,521,478]
[null,null,null,null,null,null,null,null,28046,4226,172,257,0,269,1511,915,0,269,2784,1647,4390,1357,0,269,0,269,0,269,396,347,745,553,25,41,942,849,415,444,132,217,462,641,532,514,519,743,107,144,0,269,51,92,252,470,570,597,218,277,0,269,421,418,2528,1395,1711,1394,416,383,0,269,0,269,707,527,146,144,34,84,233,228,56,90,62,79,14,25,95,118,0,269,220,235,258,183,495,638,1990,1143,3226,1437,75,137,580,459,556,469,0,269,0,269,"N/A","N/A",0,269]
[null,null,null,null,null,null,null,null,31732,4381,629,711,156,259,288,356,0,285,1177,949,388,492,899,653,0,285,0,285,11262,2512,207,334,0,285,0,285,1642,1175,109,173,0,285,112,184,254,211,109,130,0,285,59,106,2004,960,89,149,50,83,170,198,221,258,0,285,0,285,0,285,0,285,1244,830,364,603,4768,1546,146,240,0,285,69,127,0,285,0,285,1516,772,684,829,109,173,0,285,30,56,977,742,882,1289,0,285,392,320,0,285,141,135,585,815,0,285,"N/A","N/A"]

{"sheet":"Dashboard","index":4,"n_rows":0,"n_cols":0,"rows_kept":0,"cut":false,"hidden":false,"merged":[]}

{"sheet":"DataTab","index":5,"n_rows":79,"n_cols":69,"rows_kept":79,"cut":false,"hidden":false,"merged":[[67,15,67,18],[0,0,1,0],[57,0,58,0],[0,1,1,1],[0,2,1,2],[0,3,1,3]]}
["State","Total","Rank \n(1=Most; 52=Least)","Case #","Coming from:",null,null,null,"Alabama","Alaska","Arizona","Arkansas","California","Colorado","Connecticut","Delaware","District of Columbia ","Florida","Georgia","Hawaii","Idaho","Illinois","Indiana","Iowa","Kansas","Kentucky","Louisiana","Maine","Maryland","Massachusetts","Michigan","Minnesota","Mississippi","Missouri","Montana","Nebraska","Nevada","New Hampshire","New Jersey","New Mexico","New York","North Carolina","North Dakota","Ohio","Oklahoma","Oregon","Pennsylvania","Rhode Island","South Carolina","South Dakota","Tennessee","Texas","Utah","Vermont","Virginia","Washington","West Virginia","Wisconsin","Wyoming","Puerto Rico",null,null,{"$f":"INDEX($I$1:$BH$1,MATCH(BK4,$I$2:$BH$2,0))","v":"Indiana"},{"$f":"INDEX($I$1:$BH$1,MATCH(BL4,$I$2:$BH$2,0))","v":"Texas"},"Wisconsin","Missouri","Florida","Other 47 Territories",{"$f":"IF(COUNTA(E4:E55)>18,\"No analysis, too many states selected. \",\"The five states with the most migration to \"&BJ2&\" during this time period were: \"&BK1&\" (\"&TEXT(BK4,\"#,###\")&\"), \"&BL1&\" (\"&TEXT(BL4,\"#,###\")&\"), \"&BM1&\" (\"&TEXT(BM4,\"#,###\")&\"), \"&BN1&\" (\"&TEXT(BN4,\"#,###\")&\"), and \"&BO1&\" (\"&TEXT(BO4,\"#,###\")&\").\")","v":"The five states with the most migration to IL during this time period were: Indiana (16,907), Texas (16,780), Wisconsin (14,414), Missouri (13,264), and Florida (12,687)."}]
[null,null,null,null,"State(s)",null,"Total:",null,{"$f":"SUM(I4:I57)","v":883},2250,7139,1587,14940,3036,955,234,1066,12687,8745,869,1384,0,16907,8529,2009,2923,1229,526,1865,3296,12583,6537,2744,13264,228,1302,1478,283,2366,1359,{"$f":"SUM(AO4:AO57)","v":7561},3761,196,6872,1491,954,4588,462,1583,394,4648,16780,1154,156,4311,2704,1221,14414,302,2049,null,{"$f":"BJ4&BJ5&BJ6&BJ7&BJ8&BJ9&BJ10&BJ11&BJ12&BJ13&BJ14&BJ15&BJ16&BJ17&BJ18&BJ19&BJ20&BJ21&BJ22&BJ23&BJ24&BJ25&BJ26&BJ27&BJ28&BJ29&BJ30&BJ31&BJ32&BJ33&BJ34&BJ35&BJ36&BJ37&BJ38&BJ39&BJ40&BJ41&BJ42&BJ43&BJ44&BJ45&BJ46&BJ47&BJ48&BJ49&BJ50&BJ51&BJ52&BJ53&BJ54&BJ55&BJ56","v":"IL"},1,2,3,4,5]
[null,"Total","Rank (1=Most; 52=Least)","Case #","Row Labels",null,null,null,"Sum of Alabama","Sum of Alaska","Sum of Arizona","Sum of Arkansas","Sum of California","Sum of Colorado","Sum of Connecticut","Sum of Delaware","Sum of District of Columbia ","Sum of Florida","Sum of Georgia","Sum of Hawaii","Sum of Idaho","Sum of Illinois","Sum of Indiana","Sum of Iowa","Sum of Kansas","Sum of Kentucky","Sum of Louisiana","Sum of Maine","Sum of Maryland","Sum of Massachusetts","Sum of Michigan","Sum of Minnesota","Sum of Mississippi","Sum of Missouri","Sum of Montana","Sum of Nebraska","Sum of Nevada","Sum of New Hampshire","Sum of New Jersey","Sum of New Mexico","Sum of New York","Sum of North Carolina","Sum of North Dakota","Sum of Ohio","Sum of Oklahoma","Sum of Oregon","Sum of Pennsylvania","Sum of Rhode Island","Sum of South Carolina","Sum of South Dakota","Sum of Tennessee","Sum of Texas","Sum of Utah","Sum of Vermont","Sum of Virginia","Sum of Washington","Sum of West Virginia","Sum of Wisconsin","Sum of Wyoming","Sum of Puerto Rico"]
["Alabama",{"$f":"HLOOKUP(A4,$I$1:$BH$2,2,FALSE)","v":883},{"$f":"RANK(B4,$B$4:$B$55,0)","v":41},{"$f":"ROUNDUP(C4/5.2,0)","v":8},"IL",{"$f":"IF(ISBLANK(E4),\"\",VLOOKUP(E4,StateListAbbrev!$A$2:$B$53,2,FALSE))","v":"Illinois"},{"$f":"IF(ISBLANK(E4),\"\",VLOOKUP(F4,'2012'!$A$10:$B$62,2,FALSE))","v":16},null,{"$f":"IFERROR(HLOOKUP(I$3,Pivot!$B$3:$BB$56,DataTab!$G4,FALSE),\"\")","v":883},{"$f":"IFERROR(HLOOKUP(J$3,Pivot!$B$3:$BB$56,DataTab!$G4,FALSE),\"\")","v":2250},{"$f":"IFERROR(HLOOKUP(K$3,Pivot!$B$3:$BB$56,DataTab!$G4,FALSE),\"\")","v":7139},{"$f":"IFERROR(HLOOKUP(L$3,Pivot!$B$3:$BB$56,DataTab!$G4,FALSE),\"\")","v":1587},{"$f":"IFERROR(HLOOKUP(M$3,Pivot!$B$3:$BB$56,DataTab!$G4,FALSE),\"\")","v":14940},{"$f":"IFERROR(HLOOKUP(N$3,Pivot!$B$3:$BB$56,DataTab!$G4,FALSE),\"\")","v":3036},{"$f":"IFERROR(HLOOKUP(O$3,Pivot!$B$3:$BB$56,DataTab!$G4,FALSE),\"\")","v":955},{"$f":"IFERROR(HLOOKUP(P$3,Pivot!$B$3:$BB$56,DataTab!$G4,FALSE),\"\")","v":234},{"$f":"IFERROR(HLOOKUP(Q$3,Pivot!$B$3:$BB$56,DataTab!$G4,FALSE),\"\")","v":1066},{"$f":"IFERROR(HLOOKUP(R$3,Pivot!$B$3:$BB$56,DataTab!$G4,FALSE),\"\")","v":12687},{"$f":"IFERROR(HLOOKUP(S$3,Pivot!$B$3:$BB$56,DataTab!$G4,FALSE),\"\")","v":8745},{"$f":"IFERROR(HLOOKUP(T$3,Pivot!$B$3:$BB$56,DataTab!$G4,FALSE),\"\")","v":869},{"$f":"IFERROR(HLOOKUP(U$3,Pivot!$B$3:$BB$56,DataTab!$G4,FALSE),\"\")","v":1384},{"$f":"IFERROR(HLOOKUP(V$3,Pivot!$B$3:$BB$56,DataTab!$G4,FALSE),\"\")","v":0},{"$f":"IFERROR(HLOOKUP(W$3,Pivot!$B$3:$BB$56,DataTab!$G4,FALSE),\"\")","v":16907},{"$f":"IFERROR(HLOOKUP(X$3,Pivot!$B$3:$BB$56,DataTab!$G4,FALSE),\"\")","v":8529},{"$f":"IFERROR(HLOOKUP(Y$3,Pivot!$B$3:$BB$56,DataTab!$G4,FALSE),\"\")","v":2009},{"$f":"IFERROR(HLOOKUP(Z$3,Pivot!$B$3:$BB$56,DataTab!$G4,FALSE),\"\")","v":2923},{"$f":"IFERROR(HLOOKUP(AA$3,Pivot!$B$3:$BB$56,DataTab!$G4,FALSE),\"\")","v":1229},{"$f":"IFERROR(HLOOKUP(AB$3,Pivot!$B$3:$BB$56,DataTab!$G4,FALSE),\"\")","v":526},{"$f":"IFERROR(HLOOKUP(AC$3,Pivot!$B$3:$BB$56,DataTab!$G4,FALSE),\"\")","v":1865},{"$f":"IFERROR(HLOOKUP(AD$3,Pivot!$B$3:$BB$56,DataTab!$G4,FALSE),\"\")","v":3296},{"$f":"IFERROR(HLOOKUP(AE$3,Pivot!$B$3:$BB$56,DataTab!$G4,FALSE),\"\")","v":12583},{"$f":"IFERROR(HLOOKUP(AF$3,Pivot!$B$3:$BB$56,DataTab!$G4,FALSE),\"\")","v":6537},{"$f":"IFERROR(HLOOKUP(AG$3,Pivot!$B$3:$BB$56,DataTab!$G4,FALSE),\"\")","v":2744},{"$f":"IFERROR(HLOOKUP(AH$3,Pivot!$B$3:$BB$56,DataTab!$G4,FALSE),\"\")","v":13264},{"$f":"IFERROR(HLOOKUP(AI$3,Pivot!$B$3:$BB$56,DataTab!$G4,FALSE),\"\")","v":228},{"$f":"IFERROR(HLOOKUP(AJ$3,Pivot!$B$3:$BB$56,DataTab!$G4,FALSE),\"\")","v":1302},{"$f":"IFERROR(HLOOKUP(AK$3,Pivot!$B$3:$BB$56,DataTab!$G4,FALSE),\"\")","v":1478},{"$f":"IFERROR(HLOOKUP(AL$3,Pivot!$B$3:$BB$56,DataTab!$G4,FALSE),\"\")","v":283},{"$f":"IFERROR(HLOOKUP(AM$3,Pivot!$B$3:$BB$56,DataTab!$G4,FALSE),\"\")","v":2366},{"$f":"IFERROR(HLOOKUP(AN$3,Pivot!$B$3:$BB$56,DataTab!$G4,FALSE),\"\")","v":1359},{"$f":"IFERROR(HLOOKUP(AO$3,Pivot!$B$3:$BB$56,DataTab!$G4,FALSE),\"\")","v":7561},{"$f":"IFERROR(HLOOKUP(AP$3,Pivot!$B$3:$BB$56,DataTab!$G4,FALSE),\"\")","v":3761},{"$f":"IFERROR(HLOOKUP(AQ$3,Pivot!$B$3:$BB$56,DataTab!$G4,FALSE),\"\")","v":196},{"$f":"IFERROR(HLOOKUP(AR$3,Pivot!$B$3:$BB$56,DataTab!$G4,FALSE),\"\")","v":6872},{"$f":"IFERROR(HLOOKUP(AS$3,Pivot!$B$3:$BB$56,DataTab!$G4,FALSE),\"\")","v":1491},{"$f":"IFERROR(HLOOKUP(AT$3,Pivot!$B$3:$BB$56,DataTab!$G4,FALSE),\"\")","v":954},{"$f":"IFERROR(HLOOKUP(AU$3,Pivot!$B$3:$BB$56,DataTab!$G4,FALSE),\"\")","v":4588},{"$f":"IFERROR(HLOOKUP(AV$3,Pivot!$B$3:$BB$56,DataTab!$G4,FALSE),\"\")","v":462},{"$f":"IFERROR(HLOOKUP(AW$3,Pivot!$B$3:$BB$56,DataTab!$G4,FALSE),\"\")","v":1583},{"$f":"IFERROR(HLOOKUP(AX$3,Pivot!$B$3:$BB$56,DataTab!$G4,FALSE),\"\")","v":394},{"$f":"IFERROR(HLOOKUP(AY$3,Pivot!$B$3:$BB$56,DataTab!$G4,FALSE),\"\")","v":4648},{"$f":"IFERROR(HLOOKUP(AZ$3,Pivot!$B$3:$BB$56,DataTab!$G4,FALSE),\"\")","v":16780},{"$f":"IFERROR(HLOOKUP(BA$3,Pivot!$B$3:$BB$56,DataTab!$G4,FALSE),\"\")","v":1154},{"$f":"IFERROR(HLOOKUP(BB$3,Pivot!$B$3:$BB$56,DataTab!$G4,FALSE),\"\")","v":156},{"$f":"IFERROR(HLOOKUP(BC$3,Pivot!$B$3:$BB$56,DataTab!$G4,FALSE),\"\")","v":4311},{"$f":"IFERROR(HLOOKUP(BD$3,Pivot!$B$3:$BB$56,DataTab!$G4,FALSE),\"\")","v":2704},{"$f":"IFERROR(HLOOKUP(BE$3,Pivot!$B$3:$BB$56,DataTab!$G4,FALSE),\"\")","v":1221},{"$f":"IFERROR(HLOOKUP(BF$3,Pivot!$B$3:$BB$56,DataTab!$G4,FALSE),\"\")","v":14414},{"$f":"IFERROR(HLOOKUP(BG$3,Pivot!$B$3:$BB$56,DataTab!$G4,FALSE),\"\")","v":302},{"$f":"IFERROR(HLOOKUP(BH$3,Pivot!$B$3:$BB$56,DataTab!$G4,FALSE),\"\")","v":2049},null,{"$f":"IF(ISBLANK(E4),\"\",E4)","v":"IL"},{"$f":"LARGE($N2:$BH2, BK2)","v":16907},{"$f":"LARGE($N2:$BH2, BL2)","v":16780},14414,13264,12687,{"$f":"(SUM(I2:BH2))-SUM(BK4:BO4)","v":136752}]
["Alaska",2250,{"$f":"RANK(B5,$B$4:$B$55,0)","v":24},5,null,{"$f":"IF(ISBLANK(E5),\"\",VLOOKUP(E5,StateListAbbrev!$A$2:$B$53,2,FALSE))","v":""},{"$f":"IF(ISBLANK(E5),\"\",VLOOKUP(F5,'2012'!$A$10:$B$62,2,FALSE))","v":""},null,{"$f":"IFERROR(HLOOKUP(I$3,Pivot!$B$3:$BB$56,DataTab!$G5,FALSE),\"\")","v":""},{"$f":"IFERROR(HLOOKUP(J$3,Pivot!$B$3:$BB$56,DataTab!$G5,FALSE),\"\")","v":""},{"$f":"IFERROR(HLOOKUP(K$3,Pivot!$B$3:$BB$56,DataTab!$G5,FALSE),\"\")","v":""},{"$f":"IFERROR(HLOOKUP(L$3,Pivot!$B$3:$BB$56,DataTab!$G5,FALSE),\"\")","v":""},{"$f":"IFERROR(HLOOKUP(M$3,Pivot!$B$3:$BB$56,DataTab!$G5,FALSE),\"\")","v":""},{"$f":"IFERROR(HLOOKUP(N$3,Pivot!$B$3:$BB$56,DataTab!$G5,FALSE),\"\")","v":""},{"$f":"IFERROR(HLOOKUP(O$3,Pivot!$B$3:$BB$56,DataTab!$G5,FALSE),\"\")","v":""},{"$f":"IFERROR(HLOOKUP(P$3,Pivot!$B$3:$BB$56,DataTab!$G5,FALSE),\"\")","v":""},{"$f":"IFERROR(HLOOKUP(Q$3,Pivot!$B$3:$BB$56,DataTab!$G5,FALSE),\"\")","v":""},{"$f":"IFERROR(HLOOKUP(R$3,Pivot!$B$3:$BB$56,DataTab!$G5,FALSE),\"\")","v":""},{"$f":"IFERROR(HLOOKUP(S$3,Pivot!$B$3:$BB$56,DataTab!$G5,FALSE),\"\")","v":""},{"$f":"IFERROR(HLOOKUP(T$3,Pivot!$B$3:$BB$56,DataTab!$G5,FALSE),\"\")","v":""},{"$f":"IFERROR(HLOOKUP(U$3,Pivot!$B$3:$BB$56,DataTab!$G5,FALSE),\"\")","v":""},{"$f":"IFERROR(HLOOKUP(V$3,Pivot!$B$3:$BB$56,DataTab!$G5,FALSE),\"\")","v":""},{"$f":"IFERROR(HLOOKUP(W$3,Pivot!$B$3:$BB$56,DataTab!$G5,FALSE),\"\")","v":""},{"$f":"IFERROR(HLOOKUP(X$3,Pivot!$B$3:$BB$56,DataTab!$G5,FALSE),\"\")","v":""},{"$f":"IFERROR(HLOOKUP(Y$3,Pivot!$B$3:$BB$56,DataTab!$G5,FALSE),\"\")","v":""},{"$f":"IFERROR(HLOOKUP(Z$3,Pivot!$B$3:$BB$56,DataTab!$G5,FALSE),\"\")","v":""},{"$f":"IFERROR(HLOOKUP(AA$3,Pivot!$B$3:$BB$56,DataTab!$G5,FALSE),\"\")","v":""},{"$f":"IFERROR(HLOOKUP(AB$3,Pivot!$B$3:$BB$56,DataTab!$G5,FALSE),\"\")","v":""},{"$f":"IFERROR(HLOOKUP(AC$3,Pivot!$B$3:$BB$56,DataTab!$G5,FALSE),\"\")","v":""},{"$f":"IFERROR(HLOOKUP(AD$3,Pivot!$B$3:$BB$56,DataTab!$G5,FALSE),\"\")","v":""},{"$f":"IFERROR(HLOOKUP(AE$3,Pivot!$B$3:$BB$56,DataTab!$G5,FALSE),\"\")","v":""},{"$f":"IFERROR(HLOOKUP(AF$3,Pivot!$B$3:$BB$56,DataTab!$G5,FALSE),\"\")","v":""},{"$f":"IFERROR(HLOOKUP(AG$3,Pivot!$B$3:$BB$56,DataTab!$G5,FALSE),\"\")","v":""},{"$f":"IFERROR(HLOOKUP(AH$3,Pivot!$B$3:$BB$56,DataTab!$G5,FALSE),\"\")","v":""},{"$f":"IFERROR(HLOOKUP(AI$3,Pivot!$B$3:$BB$56,DataTab!$G5,FALSE),\"\")","v":""},{"$f":"IFERROR(HLOOKUP(AJ$3,Pivot!$B$3:$BB$56,DataTab!$G5,FALSE),\"\")","v":""},{"$f":"IFERROR(HLOOKUP(AK$3,Pivot!$B$3:$BB$56,DataTab!$G5,FALSE),\"\")","v":""},{"$f":"IFERROR(HLOOKUP(AL$3,Pivot!$B$3:$BB$56,DataTab!$G5,FALSE),\"\")","v":""},{"$f":"IFERROR(HLOOKUP(AM$3,Pivot!$B$3:$BB$56,DataTab!$G5,FALSE),\"\")","v":""},{"$f":"IFERROR(HLOOKUP(AN$3,Pivot!$B$3:$BB$56,DataTab!$G5,FALSE),\"\")","v":""},{"$f":"IFERROR(HLOOKUP(AO$3,Pivot!$B$3:$BB$56,DataTab!$G5,FALSE),\"\")","v":""},{"$f":"IFERROR(HLOOKUP(AP$3,Pivot!$B$3:$BB$56,DataTab!$G5,FALSE),\"\")","v":""},{"$f":"IFERROR(HLOOKUP(AQ$3,Pivot!$B$3:$BB$56,DataTab!$G5,FALSE),\"\")","v":""},{"$f":"IFERROR(HLOOKUP(AR$3,Pivot!$B$3:$BB$56,DataTab!$G5,FALSE),\"\")","v":""},{"$f":"IFERROR(HLOOKUP(AS$3,Pivot!$B$3:$BB$56,DataTab!$G5,FALSE),\"\")","v":""},{"$f":"IFERROR(HLOOKUP(AT$3,Pivot!$B$3:$BB$56,DataTab!$G5,FALSE),\"\")","v":""},{"$f":"IFERROR(HLOOKUP(AU$3,Pivot!$B$3:$BB$56,DataTab!$G5,FALSE),\"\")","v":""},{"$f":"IFERROR(HLOOKUP(AV$3,Pivot!$B$3:$BB$56,DataTab!$G5,FALSE),\"\")","v":""},{"$f":"IFERROR(HLOOKUP(AW$3,Pivot!$B$3:$BB$56,DataTab!$G5,FALSE),\"\")","v":""},{"$f":"IFERROR(HLOOKUP(AX$3,Pivot!$B$3:$BB$56,DataTab!$G5,FALSE),\"\")","v":""},{"$f":"IFERROR(HLOOKUP(AY$3,Pivot!$B$3:$BB$56,DataTab!$G5,FALSE),\"\")","v":""},{"$f":"IFERROR(HLOOKUP(AZ$3,Pivot!$B$3:$BB$56,DataTab!$G5,FALSE),\"\")","v":""},{"$f":"IFERROR(HLOOKUP(BA$3,Pivot!$B$3:$BB$56,DataTab!$G5,FALSE),\"\")","v":""},{"$f":"IFERROR(HLOOKUP(BB$3,Pivot!$B$3:$BB$56,DataTab!$G5,FALSE),\"\")","v":""},{"$f":"IFERROR(HLOOKUP(BC$3,Pivot!$B$3:$BB$56,DataTab!$G5,FALSE),\"\")","v":""},{"$f":"IFERROR(HLOOKUP(BD$3,Pivot!$B$3:$BB$56,DataTab!$G5,FALSE),\"\")","v":""},{"$f":"IFERROR(HLOOKUP(BE$3,Pivot!$B$3:$BB$56,DataTab!$G5,FALSE),\"\")","v":""},{"$f":"IFERROR(HLOOKUP(BF$3,Pivot!$B$3:$BB$56,DataTab!$G5,FALSE),\"\")","v":""},{"$f":"IFERROR(HLOOKUP(BG$3,Pivot!$B$3:$BB$56,DataTab!$G5,FALSE),\"\")","v":""},{"$f":"IFERROR(HLOOKUP(BH$3,Pivot!$B$3:$BB$56,DataTab!$G5,FALSE),\"\")","v":""},null,{"$f":"IF(E5=\"\",\"\",\", \" &E5)","v":""}]
["Arizona",7139,11,3,null,{"$f":"IF(ISBLANK(E6),\"\",VLOOKUP(E6,StateListAbbrev!$A$2:$B$53,2,FALSE))","v":""},{"$f":"IF(ISBLANK(E6),\"\",VLOOKUP(F6,'2012'!$A$10:$B$62,2,FALSE))","v":""},null,{"$f":"IFERROR(HLOOKUP(I$3,Pivot!$B$3:$BB$56,DataTab!$G6,FALSE),\"\")","v":""},{"$f":"IFERROR(HLOOKUP(J$3,Pivot!$B$3:$BB$56,DataTab!$G6,FALSE),\"\")","v":""},{"$f":"IFERROR(HLOOKUP(K$3,Pivot!$B$3:$BB$56,DataTab!$G6,FALSE),\"\")","v":""},{"$f":"IFERROR(HLOOKUP(L$3,Pivot!$B$3:$BB$56,DataTab!$G6,FALSE),\"\")","v":""},{"$f":"IFERROR(HLOOKUP(M$3,Pivot!$B$3:$BB$56,DataTab!$G6,FALSE),\"\")","v":""},{"$f":"IFERROR(HLOOKUP(N$3,Pivot!$B$3:$BB$56,DataTab!$G6,FALSE),\"\")","v":""},{"$f":"IFERROR(HLOOKUP(O$3,Pivot!$B$3:$BB$56,DataTab!$G6,FALSE),\"\")","v":""},{"$f":"IFERROR(HLOOKUP(P$3,Pivot!$B$3:$BB$56,DataTab!$G6,FALSE),\"\")","v":""},{"$f":"IFERROR(HLOOKUP(Q$3,Pivot!$B$3:$BB$56,DataTab!$G6,FALSE),\"\")","v":""},{"$f":"IFERROR(HLOOKUP(R$3,Pivot!$B$3:$BB$56,DataTab!$G6,FALSE),\"\")","v":""},{"$f":"IFERROR(HLOOKUP(S$3,Pivot!$B$3:$BB$56,DataTab!$G6,FALSE),\"\")","v":""},{"$f":"IFERROR(HLOOKUP(T$3,Pivot!$B$3:$BB$56,DataTab!$G6,FALSE),\"\")","v":""},{"$f":"IFERROR(HLOOKUP(U$3,Pivot!$B$3:$BB$56,DataTab!$G6,FALSE),\"\")","v":""},{"$f":"IFERROR(HLOOKUP(V$3,Pivot!$B$3:$BB$56,DataTab!$G6,FALSE),\"\")","v":""},{"$f":"IFERROR(HLOOKUP(W$3,Pivot!$B$3:$BB$56,DataTab!$G6,FALSE),\"\")","v":""},{"$f":"IFERROR(HLOOKUP(X$3,Pivot!$B$3:$BB$56,DataTab!$G6,FALSE),\"\")","v":""},{"$f":"IFERROR(HLOOKUP(Y$3,Pivot!$B$3:$BB$56,DataTab!$G6,FALSE),\"\")","v":""},{"$f":"IFERROR(HLOOKUP(Z$3,Pivot!$B$3:$BB$56,DataTab!$G6,FALSE),\"\")","v":""},{"$f":"IFERROR(HLOOKUP(AA$3,Pivot!$B$3:$BB$56,DataTab!$G6,FALSE),\"\")","v":""},{"$f":"IFERROR(HLOOKUP(AB$3,Pivot!$B$3:$BB$56,DataTab!$G6,FALSE),\"\")","v":""},{"$f":"IFERROR(HLOOKUP(AC$3,Pivot!$B$3:$BB$56,DataTab!$G6,FALSE),\"\")","v":""},{"$f":"IFERROR(HLOOKUP(AD$3,Pivot!$B$3:$BB$56,DataTab!$G6,FALSE),\"\")","v":""},{"$f":"IFERROR(HLOOKUP(AE$3,Pivot!$B$3:$BB$56,DataTab!$G6,FALSE),\"\")","v":""},{"$f":"IFERROR(HLOOKUP(AF$3,Pivot!$B$3:$BB$56,DataTab!$G6,FALSE),\"\")","v":""},{"$f":"IFERROR(HLOOKUP(AG$3,Pivot!$B$3:$BB$56,DataTab!$G6,FALSE),\"\")","v":""},{"$f":"IFERROR(HLOOKUP(AH$3,Pivot!$B$3:$BB$56,DataTab!$G6,FALSE),\"\")","v":""},{"$f":"IFERROR(HLOOKUP(AI$3,Pivot!$B$3:$BB$56,DataTab!$G6,FALSE),\"\")","v":""},{"$f":"IFERROR(HLOOKUP(AJ$3,Pivot!$B$3:$BB$56,DataTab!$G6,FALSE),\"\")","v":""},{"$f":"IFERROR(HLOOKUP(AK$3,Pivot!$B$3:$BB$56,DataTab!$G6,FALSE),\"\")","v":""},{"$f":"IFERROR(HLOOKUP(AL$3,Pivot!$B$3:$BB$56,DataTab!$G6,FALSE),\"\")","v":""},{"$f":"IFERROR(HLOOKUP(AM$3,Pivot!$B$3:$BB$56,DataTab!$G6,FALSE),\"\")","v":""},{"$f":"IFERROR(HLOOKUP(AN$3,Pivot!$B$3:$BB$56,DataTab!$G6,FALSE),\"\")","v":""},{"$f":"IFERROR(HLOOKUP(AO$3,Pivot!$B$3:$BB$56,DataTab!$G6,FALSE),\"\")","v":""},{"$f":"IFERROR(HLOOKUP(AP$3,Pivot!$B$3:$BB$56,DataTab!$G6,FALSE),\"\")","v":""},{"$f":"IFERROR(HLOOKUP(AQ$3,Pivot!$B$3:$BB$56,DataTab!$G6,FALSE),\"\")","v":""},{"$f":"IFERROR(HLOOKUP(AR$3,Pivot!$B$3:$BB$56,DataTab!$G6,FALSE),\"\")","v":""},{"$f":"IFERROR(HLOOKUP(AS$3,Pivot!$B$3:$BB$56,DataTab!$G6,FALSE),\"\")","v":""},{"$f":"IFERROR(HLOOKUP(AT$3,Pivot!$B$3:$BB$56,DataTab!$G6,FALSE),\"\")","v":""},{"$f":"IFERROR(HLOOKUP(AU$3,Pivot!$B$3:$BB$56,DataTab!$G6,FALSE),\"\")","v":""},{"$f":"IFERROR(HLOOKUP(AV$3,Pivot!$B$3:$BB$56,DataTab!$G6,FALSE),\"\")","v":""},{"$f":"IFERROR(HLOOKUP(AW$3,Pivot!$B$3:$BB$56,DataTab!$G6,FALSE),\"\")","v":""},{"$f":"IFERROR(HLOOKUP(AX$3,Pivot!$B$3:$BB$56,DataTab!$G6,FALSE),\"\")","v":""},{"$f":"IFERROR(HLOOKUP(AY$3,Pivot!$B$3:$BB$56,DataTab!$G6,FALSE),\"\")","v":""},{"$f":"IFERROR(HLOOKUP(AZ$3,Pivot!$B$3:$BB$56,DataTab!$G6,FALSE),\"\")","v":""},{"$f":"IFERROR(HLOOKUP(BA$3,Pivot!$B$3:$BB$56,DataTab!$G6,FALSE),\"\")","v":""},{"$f":"IFERROR(HLOOKUP(BB$3,Pivot!$B$3:$BB$56,DataTab!$G6,FALSE),\"\")","v":""},{"$f":"IFERROR(HLOOKUP(BC$3,Pivot!$B$3:$BB$56,DataTab!$G6,FALSE),\"\")","v":""},{"$f":"IFERROR(HLOOKUP(BD$3,Pivot!$B$3:$BB$56,DataTab!$G6,FALSE),\"\")","v":""},{"$f":"IFERROR(HLOOKUP(BE$3,Pivot!$B$3:$BB$56,DataTab!$G6,FALSE),\"\")","v":""},{"$f":"IFERROR(HLOOKUP(BF$3,Pivot!$B$3:$BB$56,DataTab!$G6,FALSE),\"\")","v":""},{"$f":"IFERROR(HLOOKUP(BG$3,Pivot!$B$3:$BB$56,DataTab!$G6,FALSE),\"\")","v":""},{"$f":"IFERROR(HLOOKUP(BH$3,Pivot!$B$3:$BB$56,DataTab!$G6,FALSE),\"\")","v":""},null,""]
["Arkansas",1587,28,6,null,{"$f":"IF(ISBLANK(E7),\"\",VLOOKUP(E7,StateListAbbrev!$A$2:$B$53,2,FALSE))","v":""},{"$f":"IF(ISBLANK(E7),\"\",VLOOKUP(F7,'2012'!$A$10:$B$62,2,FALSE))","v":""},null,{"$f":"IFERROR(HLOOKUP(I$3,Pivot!$B$3:$BB$56,DataTab!$G7,FALSE),\"\")","v":""},{"$f":"IFERROR(HLOOKUP(J$3,Pivot!$B$3:$BB$56,DataTab!$G7,FALSE),\"\")","v":""},{"$f":"IFERROR(HLOOKUP(K$3,Pivot!$B$3:$BB$56,DataTab!$G7,FALSE),\"\")","v":""},{"$f":"IFERROR(HLOOKUP(L$3,Pivot!$B$3:$BB$56,DataTab!$G7,FALSE),\"\")","v":""},{"$f":"IFERROR(HLOOKUP(M$3,Pivot!$B$3:$BB$56,DataTab!$G7,FALSE),\"\")","v":""},{"$f":"IFERROR(HLOOKUP(N$3,Pivot!$B$3:$BB$56,DataTab!$G7,FALSE),\"\")","v":""},{"$f":"IFERROR(HLOOKUP(O$3,Pivot!$B$3:$BB$56,DataTab!$G7,FALSE),\"\")","v":""},{"$f":"IFERROR(HLOOKUP(P$3,Pivot!$B$3:$BB$56,DataTab!$G7,FALSE),\"\")","v":""},{"$f":"IFERROR(HLOOKUP(Q$3,Pivot!$B$3:$BB$56,DataTab!$G7,FALSE),\"\")","v":""},{"$f":"IFERROR(HLOOKUP(R$3,Pivot!$B$3:$BB$56,DataTab!$G7,FALSE),\"\")","v":""},{"$f":"IFERROR(HLOOKUP(S$3,Pivot!$B$3:$BB$56,DataTab!$G7,FALSE),\"\")","v":""},{"$f":"IFERROR(HLOOKUP(T$3,Pivot!$B$3:$BB$56,DataTab!$G7,FALSE),\"\")","v":""},{"$f":"IFERROR(HLOOKUP(U$3,Pivot!$B$3:$BB$56,DataTab!$G7,FALSE),\"\")","v":""},{"$f":"IFERROR(HLOOKUP(V$3,Pivot!$B$3:$BB$56,DataTab!$G7,FALSE),\"\")","v":""},{"$f":"IFERROR(HLOOKUP(W$3,Pivot!$B$3:$BB$56,DataTab!$G7,FALSE),\"\")","v":""},{"$f":"IFERROR(HLOOKUP(X$3,Pivot!$B$3:$BB$56,DataTab!$G7,FALSE),\"\")","v":""},{"$f":"IFERROR(HLOOKUP(Y$3,Pivot!$B$3:$BB$56,DataTab!$G7,FALSE),\"\")","v":""},{"$f":"IFERROR(HLOOKUP(Z$3,Pivot!$B$3:$BB$56,DataTab!$G7,FALSE),\"\")","v":""},{"$f":"IFERROR(HLOOKUP(AA$3,Pivot!$B$3:$BB$56,DataTab!$G7,FALSE),\"\")","v":""},{"$f":"IFERROR(HLOOKUP(AB$3,Pivot!$B$3:$BB$56,DataTab!$G7,FALSE),\"\")","v":""},{"$f":"IFERROR(HLOOKUP(AC$3,Pivot!$B$3:$BB$56,DataTab!$G7,FALSE),\"\")","v":""},{"$f":"IFERROR(HLOOKUP(AD$3,Pivot!$B$3:$BB$56,DataTab!$G7,FALSE),\"\")","v":""},{"$f":"IFERROR(HLOOKUP(AE$3,Pivot!$B$3:$BB$56,DataTab!$G7,FALSE),\"\")","v":""},{"$f":"IFERROR(HLOOKUP(AF$3,Pivot!$B$3:$BB$56,DataTab!$G7,FALSE),\"\")","v":""},{"$f":"IFERROR(HLOOKUP(AG$3,Pivot!$B$3:$BB$56,DataTab!$G7,FALSE),\"\")","v":""},{"$f":"IFERROR(HLOOKUP(AH$3,Pivot!$B$3:$BB$56,DataTab!$G7,FALSE),\"\")","v":""},{"$f":"IFERROR(HLOOKUP(AI$3,Pivot!$B$3:$BB$56,DataTab!$G7,FALSE),\"\")","v":""},{"$f":"IFERROR(HLOOKUP(AJ$3,Pivot!$B$3:$BB$56,DataTab!$G7,FALSE),\"\")","v":""},{"$f":"IFERROR(HLOOKUP(AK$3,Pivot!$B$3:$BB$56,DataTab!$G7,FALSE),\"\")","v":""},{"$f":"IFERROR(HLOOKUP(AL$3,Pivot!$B$3:$BB$56,DataTab!$G7,FALSE),\"\")","v":""},{"$f":"IFERROR(HLOOKUP(AM$3,Pivot!$B$3:$BB$56,DataTab!$G7,FALSE),\"\")","v":""},{"$f":"IFERROR(HLOOKUP(AN$3,Pivot!$B$3:$BB$56,DataTab!$G7,FALSE),\"\")","v":""},{"$f":"IFERROR(HLOOKUP(AO$3,Pivot!$B$3:$BB$56,DataTab!$G7,FALSE),\"\")","v":""},{"$f":"IFERROR(HLOOKUP(AP$3,Pivot!$B$3:$BB$56,DataTab!$G7,FALSE),\"\")","v":""},{"$f":"IFERROR(HLOOKUP(AQ$3,Pivot!$B$3:$BB$56,DataTab!$G7,FALSE),\"\")","v":""},{"$f":"IFERROR(HLOOKUP(AR$3,Pivot!$B$3:$BB$56,DataTab!$G7,FALSE),\"\")","v":""},{"$f":"IFERROR(HLOOKUP(AS$3,Pivot!$B$3:$BB$56,DataTab!$G7,FALSE),\"\")","v":""},{"$f":"IFERROR(HLOOKUP(AT$3,Pivot!$B$3:$BB$56,DataTab!$G7,FALSE),\"\")","v":""},{"$f":"IFERROR(HLOOKUP(AU$3,Pivot!$B$3:$BB$56,DataTab!$G7,FALSE),\"\")","v":""},{"$f":"IFERROR(HLOOKUP(AV$3,Pivot!$B$3:$BB$56,DataTab!$G7,FALSE),\"\")","v":""},{"$f":"IFERROR(HLOOKUP(AW$3,Pivot!$B$3:$BB$56,DataTab!$G7,FALSE),\"\")","v":""},{"$f":"IFERROR(HLOOKUP(AX$3,Pivot!$B$3:$BB$56,DataTab!$G7,FALSE),\"\")","v":""},{"$f":"IFERROR(HLOOKUP(AY$3,Pivot!$B$3:$BB$56,DataTab!$G7,FALSE),\"\")","v":""},{"$f":"IFERROR(HLOOKUP(AZ$3,Pivot!$B$3:$BB$56,DataTab!$G7,FALSE),\"\")","v":""},{"$f":"IFERROR(HLOOKUP(BA$3,Pivot!$B$3:$BB$56,DataTab!$G7,FALSE),\"\")","v":""},{"$f":"IFERROR(HLOOKUP(BB$3,Pivot!$B$3:$BB$56,DataTab!$G7,FALSE),\"\")","v":""},{"$f":"IFERROR(HLOOKUP(BC$3,Pivot!$B$3:$BB$56,DataTab!$G7,FALSE),\"\")","v":""},{"$f":"IFERROR(HLOOKUP(BD$3,Pivot!$B$3:$BB$56,DataTab!$G7,FALSE),\"\")","v":""},{"$f":"IFERROR(HLOOKUP(BE$3,Pivot!$B$3:$BB$56,DataTab!$G7,FALSE),\"\")","v":""},{"$f":"IFERROR(HLOOKUP(BF$3,Pivot!$B$3:$BB$56,DataTab!$G7,FALSE),\"\")","v":""},{"$f":"IFERROR(HLOOKUP(BG$3,Pivot!$B$3:$BB$56,DataTab!$G7,FALSE),\"\")","v":""},{"$f":"IFERROR(HLOOKUP(BH$3,Pivot!$B$3:$BB$56,DataTab!$G7,FALSE),\"\")","v":""},null,""]
["California",14940,3,1,null,{"$f":"IF(ISBLANK(E8),\"\",VLOOKUP(E8,StateListAbbrev!$A$2:$B$53,2,FALSE))","v":""},{"$f":"IF(ISBLANK(E8),\"\",VLOOKUP(F8,'2012'!$A$10:$B$62,2,FALSE))","v":""},null,{"$f":"IFERROR(HLOOKUP(I$3,Pivot!$B$3:$BB$56,DataTab!$G8,FALSE),\"\")","v":""},{"$f":"IFERROR(HLOOKUP(J$3,Pivot!$B$3:$BB$56,DataTab!$G8,FALSE),\"\")","v":""},{"$f":"IFERROR(HLOOKUP(K$3,Pivot!$B$3:$BB$56,DataTab!$G8,FALSE),\"\")","v":""},{"$f":"IFERROR(HLOOKUP(L$3,Pivot!$B$3:$BB$56,DataTab!$G8,FALSE),\"\")","v":""},{"$f":"IFERROR(HLOOKUP(M$3,Pivot!$B$3:$BB$56,DataTab!$G8,FALSE),\"\")","v":""},{"$f":"IFERROR(HLOOKUP(N$3,Pivot!$B$3:$BB$56,DataTab!$G8,FALSE),\"\")","v":""},{"$f":"IFERROR(HLOOKUP(O$3,Pivot!$B$3:$BB$56,DataTab!$G8,FALSE),\"\")","v":""},{"$f":"IFERROR(HLOOKUP(P$3,Pivot!$B$3:$BB$56,DataTab!$G8,FALSE),\"\")","v":""},{"$f":"IFERROR(HLOOKUP(Q$3,Pivot!$B$3:$BB$56,DataTab!$G8,FALSE),\"\")","v":""},{"$f":"IFERROR(HLOOKUP(R$3,Pivot!$B$3:$BB$56,DataTab!$G8,FALSE),\"\")","v":""},{"$f":"IFERROR(HLOOKUP(S$3,Pivot!$B$3:$BB$56,DataTab!$G8,FALSE),\"\")","v":""},{"$f":"IFERROR(HLOOKUP(T$3,Pivot!$B$3:$BB$56,DataTab!$G8,FALSE),\"\")","v":""},{"$f":"IFERROR(HLOOKUP(U$3,Pivot!$B$3:$BB$56,DataTab!$G8,FALSE),\"\")","v":""},{"$f":"IFERROR(HLOOKUP(V$3,Pivot!$B$3:$BB$56,DataTab!$G8,FALSE),\"\")","v":""},{"$f":"IFERROR(HLOOKUP(W$3,Pivot!$B$3:$BB$56,DataTab!$G8,FALSE),\"\")","v":""},{"$f":"IFERROR(HLOOKUP(X$3,Pivot!$B$3:$BB$56,DataTab!$G8,FALSE),\"\")","v":""},{"$f":"IFERROR(HLOOKUP(Y$3,Pivot!$B$3:$BB$56,DataTab!$G8,FALSE),\"\")","v":""},{"$f":"IFERROR(HLOOKUP(Z$3,Pivot!$B$3:$BB$56,DataTab!$G8,FALSE),\"\")","v":""},{"$f":"IFERROR(HLOOKUP(AA$3,Pivot!$B$3:$BB$56,DataTab!$G8,FALSE),\"\")","v":""},{"$f":"IFERROR(HLOOKUP(AB$3,Pivot!$B$3:$BB$56,DataTab!$G8,FALSE),\"\")","v":""},{"$f":"IFERROR(HLOOKUP(AC$3,Pivot!$B$3:$BB$56,DataTab!$G8,FALSE),\"\")","v":""},{"$f":"IFERROR(HLOOKUP(AD$3,Pivot!$B$3:$BB$56,DataTab!$G8,FALSE),\"\")","v":""},{"$f":"IFERROR(HLOOKUP(AE$3,Pivot!$B$3:$BB$56,DataTab!$G8,FALSE),\"\")","v":""},{"$f":"IFERROR(HLOOKUP(AF$3,Pivot!$B$3:$BB$56,DataTab!$G8,FALSE),\"\")","v":""},{"$f":"IFERROR(HLOOKUP(AG$3,Pivot!$B$3:$BB$56,DataTab!$G8,FALSE),\"\")","v":""},{"$f":"IFERROR(HLOOKUP(AH$3,Pivot!$B$3:$BB$56,DataTab!$G8,FALSE),\"\")","v":""},{"$f":"IFERROR(HLOOKUP(AI$3,Pivot!$B$3:$BB$56,DataTab!$G8,FALSE),\"\")","v":""},{"$f":"IFERROR(HLOOKUP(AJ$3,Pivot!$B$3:$BB$56,DataTab!$G8,FALSE),\"\")","v":""},{"$f":"IFERROR(HLOOKUP(AK$3,Pivot!$B$3:$BB$56,DataTab!$G8,FALSE),\"\")","v":""},{"$f":"IFERROR(HLOOKUP(AL$3,Pivot!$B$3:$BB$56,DataTab!$G8,FALSE),\"\")","v":""},{"$f":"IFERROR(HLOOKUP(AM$3,Pivot!$B$3:$BB$56,DataTab!$G8,FALSE),\"\")","v":""},{"$f":"IFERROR(HLOOKUP(AN$3,Pivot!$B$3:$BB$56,DataTab!$G8,FALSE),\"\")","v":""},{"$f":"IFERROR(HLOOKUP(AO$3,Pivot!$B$3:$BB$56,DataTab!$G8,FALSE),\"\")","v":""},{"$f":"IFERROR(HLOOKUP(AP$3,Pivot!$B$3:$BB$56,DataTab!$G8,FALSE),\"\")","v":""},{"$f":"IFERROR(HLOOKUP(AQ$3,Pivot!$B$3:$BB$56,DataTab!$G8,FALSE),\"\")","v":""},{"$f":"IFERROR(HLOOKUP(AR$3,Pivot!$B$3:$BB$56,DataTab!$G8,FALSE),\"\")","v":""},{"$f":"IFERROR(HLOOKUP(AS$3,Pivot!$B$3:$BB$56,DataTab!$G8,FALSE),\"\")","v":""},{"$f":"IFERROR(HLOOKUP(AT$3,Pivot!$B$3:$BB$56,DataTab!$G8,FALSE),\"\")","v":""},{"$f":"IFERROR(HLOOKUP(AU$3,Pivot!$B$3:$BB$56,DataTab!$G8,FALSE),\"\")","v":""},{"$f":"IFERROR(HLOOKUP(AV$3,Pivot!$B$3:$BB$56,DataTab!$G8,FALSE),\"\")","v":""},{"$f":"IFERROR(HLOOKUP(AW$3,Pivot!$B$3:$BB$56,DataTab!$G8,FALSE),\"\")","v":""},{"$f":"IFERROR(HLOOKUP(AX$3,Pivot!$B$3:$BB$56,DataTab!$G8,FALSE),\"\")","v":""},{"$f":"IFERROR(HLOOKUP(AY$3,Pivot!$B$3:$BB$56,DataTab!$G8,FALSE),\"\")","v":""},{"$f":"IFERROR(HLOOKUP(AZ$3,Pivot!$B$3:$BB$56,DataTab!$G8,FALSE),\"\")","v":""},{"$f":"IFERROR(HLOOKUP(BA$3,Pivot!$B$3:$BB$56,DataTab!$G8,FALSE),\"\")","v":""},{"$f":"IFERROR(HLOOKUP(BB$3,Pivot!$B$3:$BB$56,DataTab!$G8,FALSE),\"\")","v":""},{"$f":"IFERROR(HLOOKUP(BC$3,Pivot!$B$3:$BB$56,DataTab!$G8,FALSE),\"\")","v":""},{"$f":"IFERROR(HLOOKUP(BD$3,Pivot!$B$3:$BB$56,DataTab!$G8,FALSE),\"\")","v":""},{"$f":"IFERROR(HLOOKUP(BE$3,Pivot!$B$3:$BB$56,DataTab!$G8,FALSE),\"\")","v":""},{"$f":"IFERROR(HLOOKUP(BF$3,Pivot!$B$3:$BB$56,DataTab!$G8,FALSE),\"\")","v":""},{"$f":"IFERROR(HLOOKUP(BG$3,Pivot!$B$3:$BB$56,DataTab!$G8,FALSE),\"\")","v":""},{"$f":"IFERROR(HLOOKUP(BH$3,Pivot!$B$3:$BB$56,DataTab!$G8,FALSE),\"\")","v":""},null,""]
["Colorado",3036,19,4,null,{"$f":"IF(ISBLANK(E9),\"\",VLOOKUP(E9,StateListAbbrev!$A$2:$B$53,2,FALSE))","v":""},{"$f":"IF(ISBLANK(E9),\"\",VLOOKUP(F9,'2012'!$A$10:$B$62,2,FALSE))","v":""},null,{"$f":"IFERROR(HLOOKUP(I$3,Pivot!$B$3:$BB$56,DataTab!$G9,FALSE),\"\")","v":""},{"$f":"IFERROR(HLOOKUP(J$3,Pivot!$B$3:$BB$56,DataTab!$G9,FALSE),\"\")","v":""},{"$f":"IFERROR(HLOOKUP(K$3,Pivot!$B$3:$BB$56,DataTab!$G9,FALSE),\"\")","v":""},{"$f":"IFERROR(HLOOKUP(L$3,Pivot!$B$3:$BB$56,DataTab!$G9,FALSE),\"\")","v":""},{"$f":"IFERROR(HLOOKUP(M$3,Pivot!$B$3:$BB$56,DataTab!$G9,FALSE),\"\")","v":""},{"$f":"IFERROR(HLOOKUP(N$3,Pivot!$B$3:$BB$56,DataTab!$G9,FALSE),\"\")","v":""},{"$f":"IFERROR(HLOOKUP(O$3,Pivot!$B$3:$BB$56,DataTab!$G9,FALSE),\"\")","v":""},{"$f":"IFERROR(HLOOKUP(P$3,Pivot!$B$3:$BB$56,DataTab!$G9,FALSE),\"\")","v":""},{"$f":"IFERROR(HLOOKUP(Q$3,Pivot!$B$3:$BB$56,DataTab!$G9,FALSE),\"\")","v":""},{"$f":"IFERROR(HLOOKUP(R$3,Pivot!$B$3:$BB$56,DataTab!$G9,FALSE),\"\")","v":""},{"$f":"IFERROR(HLOOKUP(S$3,Pivot!$B$3:$BB$56,DataTab!$G9,FALSE),\"\")","v":""},{"$f":"IFERROR(HLOOKUP(T$3,Pivot!$B$3:$BB$56,DataTab!$G9,FALSE),\"\")","v":""},{"$f":"IFERROR(HLOOKUP(U$3,Pivot!$B$3:$BB$56,DataTab!$G9,FALSE),\"\")","v":""},{"$f":"IFERROR(HLOOKUP(V$3,Pivot!$B$3:$BB$56,DataTab!$G9,FALSE),\"\")","v":""},{"$f":"IFERROR(HLOOKUP(W$3,Pivot!$B$3:$BB$56,DataTab!$G9,FALSE),\"\")","v":""},{"$f":"IFERROR(HLOOKUP(X$3,Pivot!$B$3:$BB$56,DataTab!$G9,FALSE),\"\")","v":""},{"$f":"IFERROR(HLOOKUP(Y$3,Pivot!$B$3:$BB$56,DataTab!$G9,FALSE),\"\")","v":""},{"$f":"IFERROR(HLOOKUP(Z$3,Pivot!$B$3:$BB$56,DataTab!$G9,FALSE),\"\")","v":""},{"$f":"IFERROR(HLOOKUP(AA$3,Pivot!$B$3:$BB$56,DataTab!$G9,FALSE),\"\")","v":""},{"$f":"IFERROR(HLOOKUP(AB$3,Pivot!$B$3:$BB$56,DataTab!$G9,FALSE),\"\")","v":""},{"$f":"IFERROR(HLOOKUP(AC$3,Pivot!$B$3:$BB$56,DataTab!$G9,FALSE),\"\")","v":""},{"$f":"IFERROR(HLOOKUP(AD$3,Pivot!$B$3:$BB$56,DataTab!$G9,FALSE),\"\")","v":""},{"$f":"IFERROR(HLOOKUP(AE$3,Pivot!$B$3:$BB$56,DataTab!$G9,FALSE),\"\")","v":""},{"$f":"IFERROR(HLOOKUP(AF$3,Pivot!$B$3:$BB$56,DataTab!$G9,FALSE),\"\")","v":""},{"$f":"IFERROR(HLOOKUP(AG$3,Pivot!$B$3:$BB$56,DataTab!$G9,FALSE),\"\")","v":""},{"$f":"IFERROR(HLOOKUP(AH$3,Pivot!$B$3:$BB$56,DataTab!$G9,FALSE),\"\")","v":""},{"$f":"IFERROR(HLOOKUP(AI$3,Pivot!$B$3:$BB$56,DataTab!$G9,FALSE),\"\")","v":""},{"$f":"IFERROR(HLOOKUP(AJ$3,Pivot!$B$3:$BB$56,DataTab!$G9,FALSE),\"\")","v":""},{"$f":"IFERROR(HLOOKUP(AK$3,Pivot!$B$3:$BB$56,DataTab!$G9,FALSE),\"\")","v":""},{"$f":"IFERROR(HLOOKUP(AL$3,Pivot!$B$3:$BB$56,DataTab!$G9,FALSE),\"\")","v":""},{"$f":"IFERROR(HLOOKUP(AM$3,Pivot!$B$3:$BB$56,DataTab!$G9,FALSE),\"\")","v":""},{"$f":"IFERROR(HLOOKUP(AN$3,Pivot!$B$3:$BB$56,DataTab!$G9,FALSE),\"\")","v":""},{"$f":"IFERROR(HLOOKUP(AO$3,Pivot!$B$3:$BB$56,DataTab!$G9,FALSE),\"\")","v":""},{"$f":"IFERROR(HLOOKUP(AP$3,Pivot!$B$3:$BB$56,DataTab!$G9,FALSE),\"\")","v":""},{"$f":"IFERROR(HLOOKUP(AQ$3,Pivot!$B$3:$BB$56,DataTab!$G9,FALSE),\"\")","v":""},{"$f":"IFERROR(HLOOKUP(AR$3,Pivot!$B$3:$BB$56,DataTab!$G9,FALSE),\"\")","v":""},{"$f":"IFERROR(HLOOKUP(AS$3,Pivot!$B$3:$BB$56,DataTab!$G9,FALSE),\"\")","v":""},{"$f":"IFERROR(HLOOKUP(AT$3,Pivot!$B$3:$BB$56,DataTab!$G9,FALSE),\"\")","v":""},{"$f":"IFERROR(HLOOKUP(AU$3,Pivot!$B$3:$BB$56,DataTab!$G9,FALSE),\"\")","v":""},{"$f":"IFERROR(HLOOKUP(AV$3,Pivot!$B$3:$BB$56,DataTab!$G9,FALSE),\"\")","v":""},{"$f":"IFERROR(HLOOKUP(AW$3,Pivot!$B$3:$BB$56,DataTab!$G9,FALSE),\"\")","v":""},{"$f":"IFERROR(HLOOKUP(AX$3,Pivot!$B$3:$BB$56,DataTab!$G9,FALSE),\"\")","v":""},{"$f":"IFERROR(HLOOKUP(AY$3,Pivot!$B$3:$BB$56,DataTab!$G9,FALSE),\"\")","v":""},{"$f":"IFERROR(HLOOKUP(AZ$3,Pivot!$B$3:$BB$56,DataTab!$G9,FALSE),\"\")","v":""},{"$f":"IFERROR(HLOOKUP(BA$3,Pivot!$B$3:$BB$56,DataTab!$G9,FALSE),\"\")","v":""},{"$f":"IFERROR(HLOOKUP(BB$3,Pivot!$B$3:$BB$56,DataTab!$G9,FALSE),\"\")","v":""},{"$f":"IFERROR(HLOOKUP(BC$3,Pivot!$B$3:$BB$56,DataTab!$G9,FALSE),\"\")","v":""},{"$f":"IFERROR(HLOOKUP(BD$3,Pivot!$B$3:$BB$56,DataTab!$G9,FALSE),\"\")","v":""},{"$f":"IFERROR(HLOOKUP(BE$3,Pivot!$B$3:$BB$56,DataTab!$G9,FALSE),\"\")","v":""},{"$f":"IFERROR(HLOOKUP(BF$3,Pivot!$B$3:$BB$56,DataTab!$G9,FALSE),\"\")","v":""},{"$f":"IFERROR(HLOOKUP(BG$3,Pivot!$B$3:$BB$56,DataTab!$G9,FALSE),\"\")","v":""},{"$f":"IFERROR(HLOOKUP(BH$3,Pivot!$B$3:$BB$56,DataTab!$G9,FALSE),\"\")","v":""},null,""]
["Connecticut",955,39,8,null,{"$f":"IF(ISBLANK(E10),\"\",VLOOKUP(E10,StateListAbbrev!$A$2:$B$53,2,FALSE))","v":""},{"$f":"IF(ISBLANK(E10),\"\",VLOOKUP(F10,'2012'!$A$10:$B$62,2,FALSE))","v":""},null,{"$f":"IFERROR(HLOOKUP(I$3,Pivot!$B$3:$BB$56,DataTab!$G10,FALSE),\"\")","v":""},{"$f":"IFERROR(HLOOKUP(J$3,Pivot!$B$3:$BB$56,DataTab!$G10,FALSE),\"\")","v":""},{"$f":"IFERROR(HLOOKUP(K$3,Pivot!$B$3:$BB$56,DataTab!$G10,FALSE),\"\")","v":""},{"$f":"IFERROR(HLOOKUP(L$3,Pivot!$B$3:$BB$56,DataTab!$G10,FALSE),\"\")","v":""},{"$f":"IFERROR(HLOOKUP(M$3,Pivot!$B$3:$BB$56,DataTab!$G10,FALSE),\"\")","v":""},{"$f":"IFERROR(HLOOKUP(N$3,Pivot!$B$3:$BB$56,DataTab!$G10,FALSE),\"\")","v":""},{"$f":"IFERROR(HLOOKUP(O$3,Pivot!$B$3:$BB$56,DataTab!$G10,FALSE),\"\")","v":""},{"$f":"IFERROR(HLOOKUP(P$3,Pivot!$B$3:$BB$56,DataTab!$G10,FALSE),\"\")","v":""},{"$f":"IFERROR(HLOOKUP(Q$3,Pivot!$B$3:$BB$56,DataTab!$G10,FALSE),\"\")","v":""},{"$f":"IFERROR(HLOOKUP(R$3,Pivot!$B$3:$BB$56,DataTab!$G10,FALSE),\"\")","v":""},{"$f":"IFERROR(HLOOKUP(S$3,Pivot!$B$3:$BB$56,DataTab!$G10,FALSE),\"\")","v":""},{"$f":"IFERROR(HLOOKUP(T$3,Pivot!$B$3:$BB$56,DataTab!$G10,FALSE),\"\")","v":""},{"$f":"IFERROR(HLOOKUP(U$3,Pivot!$B$3:$BB$56,DataTab!$G10,FALSE),\"\")","v":""},{"$f":"IFERROR(HLOOKUP(V$3,Pivot!$B$3:$BB$56,DataTab!$G10,FALSE),\"\")","v":""},{"$f":"IFERROR(HLOOKUP(W$3,Pivot!$B$3:$BB$56,DataTab!$G10,FALSE),\"\")","v":""},{"$f":"IFERROR(HLOOKUP(X$3,Pivot!$B$3:$BB$56,DataTab!$G10,FALSE),\"\")","v":""},{"$f":"IFERROR(HLOOKUP(Y$3,Pivot!$B$3:$BB$56,DataTab!$G10,FALSE),\"\")","v":""},{"$f":"IFERROR(HLOOKUP(Z$3,Pivot!$B$3:$BB$56,DataTab!$G10,FALSE),\"\")","v":""},{"$f":"IFERROR(HLOOKUP(AA$3,Pivot!$B$3:$BB$56,DataTab!$G10,FALSE),\"\")","v":""},{"$f":"IFERROR(HLOOKUP(AB$3,Pivot!$B$3:$BB$56,DataTab!$G10,FALSE),\"\")","v":""},{"$f":"IFERROR(HLOOKUP(AC$3,Pivot!$B$3:$BB$56,DataTab!$G10,FALSE),\"\")","v":""},{"$f":"IFERROR(HLOOKUP(AD$3,Pivot!$B$3:$BB$56,DataTab!$G10,FALSE),\"\")","v":""},{"$f":"IFERROR(HLOOKUP(AE$3,Pivot!$B$3:$BB$56,DataTab!$G10,FALSE),\"\")","v":""},{"$f":"IFERROR(HLOOKUP(AF$3,Pivot!$B$3:$BB$56,DataTab!$G10,FALSE),\"\")","v":""},{"$f":"IFERROR(HLOOKUP(AG$3,Pivot!$B$3:$BB$56,DataTab!$G10,FALSE),\"\")","v":""},{"$f":"IFERROR(HLOOKUP(AH$3,Pivot!$B$3:$BB$56,DataTab!$G10,FALSE),\"\")","v":""},{"$f":"IFERROR(HLOOKUP(AI$3,Pivot!$B$3:$BB$56,DataTab!$G10,FALSE),\"\")","v":""},{"$f":"IFERROR(HLOOKUP(AJ$3,Pivot!$B$3:$BB$56,DataTab!$G10,FALSE),\"\")","v":""},{"$f":"IFERROR(HLOOKUP(AK$3,Pivot!$B$3:$BB$56,DataTab!$G10,FALSE),\"\")","v":""},{"$f":"IFERROR(HLOOKUP(AL$3,Pivot!$B$3:$BB$56,DataTab!$G10,FALSE),\"\")","v":""},{"$f":"IFERROR(HLOOKUP(AM$3,Pivot!$B$3:$BB$56,DataTab!$G10,FALSE),\"\")","v":""},{"$f":"IFERROR(HLOOKUP(AN$3,Pivot!$B$3:$BB$56,DataTab!$G10,FALSE),\"\")","v":""},{"$f":"IFERROR(HLOOKUP(AO$3,Pivot!$B$3:$BB$56,DataTab!$G10,FALSE),\"\")","v":""},{"$f":"IFERROR(HLOOKUP(AP$3,Pivot!$B$3:$BB$56,DataTab!$G10,FALSE),\"\")","v":""},{"$f":"IFERROR(HLOOKUP(AQ$3,Pivot!$B$3:$BB$56,DataTab!$G10,FALSE),\"\")","v":""},{"$f":"IFERROR(HLOOKUP(AR$3,Pivot!$B$3:$BB$56,DataTab!$G10,FALSE),\"\")","v":""},{"$f":"IFERROR(HLOOKUP(AS$3,Pivot!$B$3:$BB$56,DataTab!$G10,FALSE),\"\")","v":""},{"$f":"IFERROR(HLOOKUP(AT$3,Pivot!$B$3:$BB$56,DataTab!$G10,FALSE),\"\")","v":""},{"$f":"IFERROR(HLOOKUP(AU$3,Pivot!$B$3:$BB$56,DataTab!$G10,FALSE),\"\")","v":""},{"$f":"IFERROR(HLOOKUP(AV$3,Pivot!$B$3:$BB$56,DataTab!$G10,FALSE),\"\")","v":""},{"$f":"IFERROR(HLOOKUP(AW$3,Pivot!$B$3:$BB$56,DataTab!$G10,FALSE),\"\")","v":""},{"$f":"IFERROR(HLOOKUP(AX$3,Pivot!$B$3:$BB$56,DataTab!$G10,FALSE),\"\")","v":""},{"$f":"IFERROR(HLOOKUP(AY$3,Pivot!$B$3:$BB$56,DataTab!$G10,FALSE),\"\")","v":""},{"$f":"IFERROR(HLOOKUP(AZ$3,Pivot!$B$3:$BB$56,DataTab!$G10,FALSE),\"\")","v":""},{"$f":"IFERROR(HLOOKUP(BA$3,Pivot!$B$3:$BB$56,DataTab!$G10,FALSE),\"\")","v":""},{"$f":"IFERROR(HLOOKUP(BB$3,Pivot!$B$3:$BB$56,DataTab!$G10,FALSE),\"\")","v":""},{"$f":"IFERROR(HLOOKUP(BC$3,Pivot!$B$3:$BB$56,DataTab!$G10,FALSE),\"\")","v":""},{"$f":"IFERROR(HLOOKUP(BD$3,Pivot!$B$3:$BB$56,DataTab!$G10,FALSE),\"\")","v":""},{"$f":"IFERROR(HLOOKUP(BE$3,Pivot!$B$3:$BB$56,DataTab!$G10,FALSE),\"\")","v":""},{"$f":"IFERROR(HLOOKUP(BF$3,Pivot!$B$3:$BB$56,DataTab!$G10,FALSE),\"\")","v":""},{"$f":"IFERROR(HLOOKUP(BG$3,Pivot!$B$3:$BB$56,DataTab!$G10,FALSE),\"\")","v":""},{"$f":"IFERROR(HLOOKUP(BH$3,Pivot!$B$3:$BB$56,DataTab!$G10,FALSE),\"\")","v":""},null,""]
["Delaware",234,48,10,null,{"$f":"IF(ISBLANK(E11),\"\",VLOOKUP(E11,StateListAbbrev!$A$2:$B$53,2,FALSE))","v":""},{"$f":"IF(ISBLANK(E11),\"\",VLOOKUP(F11,'2012'!$A$10:$B$62,2,FALSE))","v":""},null,{"$f":"IFERROR(HLOOKUP(I$3,Pivot!$B$3:$BB$56,DataTab!$G11,FALSE),\"\")","v":""},{"$f":"IFERROR(HLOOKUP(J$3,Pivot!$B$3:$BB$56,DataTab!$G11,FALSE),\"\")","v":""},{"$f":"IFERROR(HLOOKUP(K$3,Pivot!$B$3:$BB$56,DataTab!$G11,FALSE),\"\")","v":""},{"$f":"IFERROR(HLOOKUP(L$3,Pivot!$B$3:$BB$56,DataTab!$G11,FALSE),\"\")","v":""},{"$f":"IFERROR(HLOOKUP(M$3,Pivot!$B$3:$BB$56,DataTab!$G11,FALSE),\"\")","v":""},{"$f":"IFERROR(HLOOKUP(N$3,Pivot!$B$3:$BB$56,DataTab!$G11,FALSE),\"\")","v":""},{"$f":"IFERROR(HLOOKUP(O$3,Pivot!$B$3:$BB$56,DataTab!$G11,FALSE),\"\")","v":""},{"$f":"IFERROR(HLOOKUP(P$3,Pivot!$B$3:$BB$56,DataTab!$G11,FALSE),\"\")","v":""},{"$f":"IFERROR(HLOOKUP(Q$3,Pivot!$B$3:$BB$56,DataTab!$G11,FALSE),\"\")","v":""},{"$f":"IFERROR(HLOOKUP(R$3,Pivot!$B$3:$BB$56,DataTab!$G11,FALSE),\"\")","v":""},{"$f":"IFERROR(HLOOKUP(S$3,Pivot!$B$3:$BB$56,DataTab!$G11,FALSE),\"\")","v":""},{"$f":"IFERROR(HLOOKUP(T$3,Pivot!$B$3:$BB$56,DataTab!$G11,FALSE),\"\")","v":""},{"$f":"IFERROR(HLOOKUP(U$3,Pivot!$B$3:$BB$56,DataTab!$G11,FALSE),\"\")","v":""},{"$f":"IFERROR(HLOOKUP(V$3,Pivot!$B$3:$BB$56,DataTab!$G11,FALSE),\"\")","v":""},{"$f":"IFERROR(HLOOKUP(W$3,Pivot!$B$3:$BB$56,DataTab!$G11,FALSE),\"\")","v":""},{"$f":"IFERROR(HLOOKUP(X$3,Pivot!$B$3:$BB$56,DataTab!$G11,FALSE),\"\")","v":""},{"$f":"IFERROR(HLOOKUP(Y$3,Pivot!$B$3:$BB$56,DataTab!$G11,FALSE),\"\")","v":""},{"$f":"IFERROR(HLOOKUP(Z$3,Pivot!$B$3:$BB$56,DataTab!$G11,FALSE),\"\")","v":""},{"$f":"IFERROR(HLOOKUP(AA$3,Pivot!$B$3:$BB$56,DataTab!$G11,FALSE),\"\")","v":""},{"$f":"IFERROR(HLOOKUP(AB$3,Pivot!$B$3:$BB$56,DataTab!$G11,FALSE),\"\")","v":""},{"$f":"IFERROR(HLOOKUP(AC$3,Pivot!$B$3:$BB$56,DataTab!$G11,FALSE),\"\")","v":""},{"$f":"IFERROR(HLOOKUP(AD$3,Pivot!$B$3:$BB$56,DataTab!$G11,FALSE),\"\")","v":""},{"$f":"IFERROR(HLOOKUP(AE$3,Pivot!$B$3:$BB$56,DataTab!$G11,FALSE),\"\")","v":""},{"$f":"IFERROR(HLOOKUP(AF$3,Pivot!$B$3:$BB$56,DataTab!$G11,FALSE),\"\")","v":""},{"$f":"IFERROR(HLOOKUP(AG$3,Pivot!$B$3:$BB$56,DataTab!$G11,FALSE),\"\")","v":""},{"$f":"IFERROR(HLOOKUP(AH$3,Pivot!$B$3:$BB$56,DataTab!$G11,FALSE),\"\")","v":""},{"$f":"IFERROR(HLOOKUP(AI$3,Pivot!$B$3:$BB$56,DataTab!$G11,FALSE),\"\")","v":""},{"$f":"IFERROR(HLOOKUP(AJ$3,Pivot!$B$3:$BB$56,DataTab!$G11,FALSE),\"\")","v":""},{"$f":"IFERROR(HLOOKUP(AK$3,Pivot!$B$3:$BB$56,DataTab!$G11,FALSE),\"\")","v":""},{"$f":"IFERROR(HLOOKUP(AL$3,Pivot!$B$3:$BB$56,DataTab!$G11,FALSE),\"\")","v":""},{"$f":"IFERROR(HLOOKUP(AM$3,Pivot!$B$3:$BB$56,DataTab!$G11,FALSE),\"\")","v":""},{"$f":"IFERROR(HLOOKUP(AN$3,Pivot!$B$3:$BB$56,DataTab!$G11,FALSE),\"\")","v":""},{"$f":"IFERROR(HLOOKUP(AO$3,Pivot!$B$3:$BB$56,DataTab!$G11,FALSE),\"\")","v":""},{"$f":"IFERROR(HLOOKUP(AP$3,Pivot!$B$3:$BB$56,DataTab!$G11,FALSE),\"\")","v":""},{"$f":"IFERROR(HLOOKUP(AQ$3,Pivot!$B$3:$BB$56,DataTab!$G11,FALSE),\"\")","v":""},{"$f":"IFERROR(HLOOKUP(AR$3,Pivot!$B$3:$BB$56,DataTab!$G11,FALSE),\"\")","v":""},{"$f":"IFERROR(HLOOKUP(AS$3,Pivot!$B$3:$BB$56,DataTab!$G11,FALSE),\"\")","v":""},{"$f":"IFERROR(HLOOKUP(AT$3,Pivot!$B$3:$BB$56,DataTab!$G11,FALSE),\"\")","v":""},{"$f":"IFERROR(HLOOKUP(AU$3,Pivot!$B$3:$BB$56,DataTab!$G11,FALSE),\"\")","v":""},{"$f":"IFERROR(HLOOKUP(AV$3,Pivot!$B$3:$BB$56,DataTab!$G11,FALSE),\"\")","v":""},{"$f":"IFERROR(HLOOKUP(AW$3,Pivot!$B$3:$BB$56,DataTab!$G11,FALSE),\"\")","v":""},{"$f":"IFERROR(HLOOKUP(AX$3,Pivot!$B$3:$BB$56,DataTab!$G11,FALSE),\"\")","v":""},{"$f":"IFERROR(HLOOKUP(AY$3,Pivot!$B$3:$BB$56,DataTab!$G11,FALSE),\"\")","v":""},{"$f":"IFERROR(HLOOKUP(AZ$3,Pivot!$B$3:$BB$56,DataTab!$G11,FALSE),\"\")","v":""},{"$f":"IFERROR(HLOOKUP(BA$3,Pivot!$B$3:$BB$56,DataTab!$G11,FALSE),\"\")","v":""},{"$f":"IFERROR(HLOOKUP(BB$3,Pivot!$B$3:$BB$56,DataTab!$G11,FALSE),\"\")","v":""},{"$f":"IFERROR(HLOOKUP(BC$3,Pivot!$B$3:$BB$56,DataTab!$G11,FALSE),\"\")","v":""},{"$f":"IFERROR(HLOOKUP(BD$3,Pivot!$B$3:$BB$56,DataTab!$G11,FALSE),\"\")","v":""},{"$f":"IFERROR(HLOOKUP(BE$3,Pivot!$B$3:$BB$56,DataTab!$G11,FALSE),\"\")","v":""},{"$f":"IFERROR(HLOOKUP(BF$3,Pivot!$B$3:$BB$56,DataTab!$G11,FALSE),\"\")","v":""},{"$f":"IFERROR(HLOOKUP(BG$3,Pivot!$B$3:$BB$56,DataTab!$G11,FALSE),\"\")","v":""},{"$f":"IFERROR(HLOOKUP(BH$3,Pivot!$B$3:$BB$56,DataTab!$G11,FALSE),\"\")","v":""},null,""]
["District of Columbia ",1066,38,8,null,{"$f":"IF(ISBLANK(E12),\"\",VLOOKUP(E12,StateListAbbrev!$A$2:$B$53,2,FALSE))","v":""},{"$f":"IF(ISBLANK(E12),\"\",VLOOKUP(F12,'2012'!$A$10:$B$62,2,FALSE))","v":""},null,{"$f":"IFERROR(HLOOKUP(I$3,Pivot!$B$3:$BB$56,DataTab!$G12,FALSE),\"\")","v":""},{"$f":"IFERROR(HLOOKUP(J$3,Pivot!$B$3:$BB$56,DataTab!$G12,FALSE),\"\")","v":""},{"$f":"IFERROR(HLOOKUP(K$3,Pivot!$B$3:$BB$56,DataTab!$G12,FALSE),\"\")","v":""},{"$f":"IFERROR(HLOOKUP(L$3,Pivot!$B$3:$BB$56,DataTab!$G12,FALSE),\"\")","v":""},{"$f":"IFERROR(HLOOKUP(M$3,Pivot!$B$3:$BB$56,DataTab!$G12,FALSE),\"\")","v":""},{"$f":"IFERROR(HLOOKUP(N$3,Pivot!$B$3:$BB$56,DataTab!$G12,FALSE),\"\")","v":""},{"$f":"IFERROR(HLOOKUP(O$3,Pivot!$B$3:$BB$56,DataTab!$G12,FALSE),\"\")","v":""},{"$f":"IFERROR(HLOOKUP(P$3,Pivot!$B$3:$BB$56,DataTab!$G12,FALSE),\"\")","v":""},{"$f":"IFERROR(HLOOKUP(Q$3,Pivot!$B$3:$BB$56,DataTab!$G12,FALSE),\"\")","v":""},{"$f":"IFERROR(HLOOKUP(R$3,Pivot!$B$3:$BB$56,DataTab!$G12,FALSE),\"\")","v":""},{"$f":"IFERROR(HLOOKUP(S$3,Pivot!$B$3:$BB$56,DataTab!$G12,FALSE),\"\")","v":""},{"$f":"IFERROR(HLOOKUP(T$3,Pivot!$B$3:$BB$56,DataTab!$G12,FALSE),\"\")","v":""},{"$f":"IFERROR(HLOOKUP(U$3,Pivot!$B$3:$BB$56,DataTab!$G12,FALSE),\"\")","v":""},{"$f":"IFERROR(HLOOKUP(V$3,Pivot!$B$3:$BB$56,DataTab!$G12,FALSE),\"\")","v":""},{"$f":"IFERROR(HLOOKUP(W$3,Pivot!$B$3:$BB$56,DataTab!$G12,FALSE),\"\")","v":""},{"$f":"IFERROR(HLOOKUP(X$3,Pivot!$B$3:$BB$56,DataTab!$G12,FALSE),\"\")","v":""},{"$f":"IFERROR(HLOOKUP(Y$3,Pivot!$B$3:$BB$56,DataTab!$G12,FALSE),\"\")","v":""},{"$f":"IFERROR(HLOOKUP(Z$3,Pivot!$B$3:$BB$56,DataTab!$G12,FALSE),\"\")","v":""},{"$f":"IFERROR(HLOOKUP(AA$3,Pivot!$B$3:$BB$56,DataTab!$G12,FALSE),\"\")","v":""},{"$f":"IFERROR(HLOOKUP(AB$3,Pivot!$B$3:$BB$56,DataTab!$G12,FALSE),\"\")","v":""},{"$f":"IFERROR(HLOOKUP(AC$3,Pivot!$B$3:$BB$56,DataTab!$G12,FALSE),\"\")","v":""},{"$f":"IFERROR(HLOOKUP(AD$3,Pivot!$B$3:$BB$56,DataTab!$G12,FALSE),\"\")","v":""},{"$f":"IFERROR(HLOOKUP(AE$3,Pivot!$B$3:$BB$56,DataTab!$G12,FALSE),\"\")","v":""},{"$f":"IFERROR(HLOOKUP(AF$3,Pivot!$B$3:$BB$56,DataTab!$G12,FALSE),\"\")","v":""},{"$f":"IFERROR(HLOOKUP(AG$3,Pivot!$B$3:$BB$56,DataTab!$G12,FALSE),\"\")","v":""},{"$f":"IFERROR(HLOOKUP(AH$3,Pivot!$B$3:$BB$56,DataTab!$G12,FALSE),\"\")","v":""},{"$f":"IFERROR(HLOOKUP(AI$3,Pivot!$B$3:$BB$56,DataTab!$G12,FALSE),\"\")","v":""},{"$f":"IFERROR(HLOOKUP(AJ$3,Pivot!$B$3:$BB$56,DataTab!$G12,FALSE),\"\")","v":""},{"$f":"IFERROR(HLOOKUP(AK$3,Pivot!$B$3:$BB$56,DataTab!$G12,FALSE),\"\")","v":""},{"$f":"IFERROR(HLOOKUP(AL$3,Pivot!$B$3:$BB$56,DataTab!$G12,FALSE),\"\")","v":""},{"$f":"IFERROR(HLOOKUP(AM$3,Pivot!$B$3:$BB$56,DataTab!$G12,FALSE),\"\")","v":""},{"$f":"IFERROR(HLOOKUP(AN$3,Pivot!$B$3:$BB$56,DataTab!$G12,FALSE),\"\")","v":""},{"$f":"IFERROR(HLOOKUP(AO$3,Pivot!$B$3:$BB$56,DataTab!$G12,FALSE),\"\")","v":""},{"$f":"IFERROR(HLOOKUP(AP$3,Pivot!$B$3:$BB$56,DataTab!$G12,FALSE),\"\")","v":""},{"$f":"IFERROR(HLOOKUP(AQ$3,Pivot!$B$3:$BB$56,DataTab!$G12,FALSE),\"\")","v":""},{"$f":"IFERROR(HLOOKUP(AR$3,Pivot!$B$3:$BB$56,DataTab!$G12,FALSE),\"\")","v":""},{"$f":"IFERROR(HLOOKUP(AS$3,Pivot!$B$3:$BB$56,DataTab!$G12,FALSE),\"\")","v":""},{"$f":"IFERROR(HLOOKUP(AT$3,Pivot!$B$3:$BB$56,DataTab!$G12,FALSE),\"\")","v":""},{"$f":"IFERROR(HLOOKUP(AU$3,Pivot!$B$3:$BB$56,DataTab!$G12,FALSE),\"\")","v":""},{"$f":"IFERROR(HLOOKUP(AV$3,Pivot!$B$3:$BB$56,DataTab!$G12,FALSE),\"\")","v":""},{"$f":"IFERROR(HLOOKUP(AW$3,Pivot!$B$3:$BB$56,DataTab!$G12,FALSE),\"\")","v":""},{"$f":"IFERROR(HLOOKUP(AX$3,Pivot!$B$3:$BB$56,DataTab!$G12,FALSE),\"\")","v":""},{"$f":"IFERROR(HLOOKUP(AY$3,Pivot!$B$3:$BB$56,DataTab!$G12,FALSE),\"\")","v":""},{"$f":"IFERROR(HLOOKUP(AZ$3,Pivot!$B$3:$BB$56,DataTab!$G12,FALSE),\"\")","v":""},{"$f":"IFERROR(HLOOKUP(BA$3,Pivot!$B$3:$BB$56,DataTab!$G12,FALSE),\"\")","v":""},{"$f":"IFERROR(HLOOKUP(BB$3,Pivot!$B$3:$BB$56,DataTab!$G12,FALSE),\"\")","v":""},{"$f":"IFERROR(HLOOKUP(BC$3,Pivot!$B$3:$BB$56,DataTab!$G12,FALSE),\"\")","v":""},{"$f":"IFERROR(HLOOKUP(BD$3,Pivot!$B$3:$BB$56,DataTab!$G12,FALSE),\"\")","v":""},{"$f":"IFERROR(HLOOKUP(BE$3,Pivot!$B$3:$BB$56,DataTab!$G12,FALSE),\"\")","v":""},{"$f":"IFERROR(HLOOKUP(BF$3,Pivot!$B$3:$BB$56,DataTab!$G12,FALSE),\"\")","v":""},{"$f":"IFERROR(HLOOKUP(BG$3,Pivot!$B$3:$BB$56,DataTab!$G12,FALSE),\"\")","v":""},{"$f":"IFERROR(HLOOKUP(BH$3,Pivot!$B$3:$BB$56,DataTab!$G12,FALSE),\"\")","v":""},null,""]
["Florida",12687,6,2,null,{"$f":"IF(ISBLANK(E13),\"\",VLOOKUP(E13,StateListAbbrev!$A$2:$B$53,2,FALSE))","v":""},{"$f":"IF(ISBLANK(E13),\"\",VLOOKUP(F13,'2012'!$A$10:$B$62,2,FALSE))","v":""},null,{"$f":"IFERROR(HLOOKUP(I$3,Pivot!$B$3:$BB$56,DataTab!$G13,FALSE),\"\")","v":""},{"$f":"IFERROR(HLOOKUP(J$3,Pivot!$B$3:$BB$56,DataTab!$G13,FALSE),\"\")","v":""},{"$f":"IFERROR(HLOOKUP(K$3,Pivot!$B$3:$BB$56,DataTab!$G13,FALSE),\"\")","v":""},{"$f":"IFERROR(HLOOKUP(L$3,Pivot!$B$3:$BB$56,DataTab!$G13,FALSE),\"\")","v":""},{"$f":"IFERROR(HLOOKUP(M$3,Pivot!$B$3:$BB$56,DataTab!$G13,FALSE),\"\")","v":""},{"$f":"IFERROR(HLOOKUP(N$3,Pivot!$B$3:$BB$56,DataTab!$G13,FALSE),\"\")","v":""},{"$f":"IFERROR(HLOOKUP(O$3,Pivot!$B$3:$BB$56,DataTab!$G13,FALSE),\"\")","v":""},{"$f":"IFERROR(HLOOKUP(P$3,Pivot!$B$3:$BB$56,DataTab!$G13,FALSE),\"\")","v":""},{"$f":"IFERROR(HLOOKUP(Q$3,Pivot!$B$3:$BB$56,DataTab!$G13,FALSE),\"\")","v":""},{"$f":"IFERROR(HLOOKUP(R$3,Pivot!$B$3:$BB$56,DataTab!$G13,FALSE),\"\")","v":""},{"$f":"IFERROR(HLOOKUP(S$3,Pivot!$B$3:$BB$56,DataTab!$G13,FALSE),\"\")","v":""},{"$f":"IFERROR(HLOOKUP(T$3,Pivot!$B$3:$BB$56,DataTab!$G13,FALSE),\"\")","v":""},{"$f":"IFERROR(HLOOKUP(U$3,Pivot!$B$3:$BB$56,DataTab!$G13,FALSE),\"\")","v":""},{"$f":"IFERROR(HLOOKUP(V$3,Pivot!$B$3:$BB$56,DataTab!$G13,FALSE),\"\")","v":""},{"$f":"IFERROR(HLOOKUP(W$3,Pivot!$B$3:$BB$56,DataTab!$G13,FALSE),\"\")","v":""},{"$f":"IFERROR(HLOOKUP(X$3,Pivot!$B$3:$BB$56,DataTab!$G13,FALSE),\"\")","v":""},{"$f":"IFERROR(HLOOKUP(Y$3,Pivot!$B$3:$BB$56,DataTab!$G13,FALSE),\"\")","v":""},{"$f":"IFERROR(HLOOKUP(Z$3,Pivot!$B$3:$BB$56,DataTab!$G13,FALSE),\"\")","v":""},{"$f":"IFERROR(HLOOKUP(AA$3,Pivot!$B$3:$BB$56,DataTab!$G13,FALSE),\"\")","v":""},{"$f":"IFERROR(HLOOKUP(AB$3,Pivot!$B$3:$BB$56,DataTab!$G13,FALSE),\"\")","v":""},{"$f":"IFERROR(HLOOKUP(AC$3,Pivot!$B$3:$BB$56,DataTab!$G13,FALSE),\"\")","v":""},{"$f":"IFERROR(HLOOKUP(AD$3,Pivot!$B$3:$BB$56,DataTab!$G13,FALSE),\"\")","v":""},{"$f":"IFERROR(HLOOKUP(AE$3,Pivot!$B$3:$BB$56,DataTab!$G13,FALSE),\"\")","v":""},{"$f":"IFERROR(HLOOKUP(AF$3,Pivot!$B$3:$BB$56,DataTab!$G13,FALSE),\"\")","v":""},{"$f":"IFERROR(HLOOKUP(AG$3,Pivot!$B$3:$BB$56,DataTab!$G13,FALSE),\"\")","v":""},{"$f":"IFERROR(HLOOKUP(AH$3,Pivot!$B$3:$BB$56,DataTab!$G13,FALSE),\"\")","v":""},{"$f":"IFERROR(HLOOKUP(AI$3,Pivot!$B$3:$BB$56,DataTab!$G13,FALSE),\"\")","v":""},{"$f":"IFERROR(HLOOKUP(AJ$3,Pivot!$B$3:$BB$56,DataTab!$G13,FALSE),\"\")","v":""},{"$f":"IFERROR(HLOOKUP(AK$3,Pivot!$B$3:$BB$56,DataTab!$G13,FALSE),\"\")","v":""},{"$f":"IFERROR(HLOOKUP(AL$3,Pivot!$B$3:$BB$56,DataTab!$G13,FALSE),\"\")","v":""},{"$f":"IFERROR(HLOOKUP(AM$3,Pivot!$B$3:$BB$56,DataTab!$G13,FALSE),\"\")","v":""},{"$f":"IFERROR(HLOOKUP(AN$3,Pivot!$B$3:$BB$56,DataTab!$G13,FALSE),\"\")","v":""},{"$f":"IFERROR(HLOOKUP(AO$3,Pivot!$B$3:$BB$56,DataTab!$G13,FALSE),\"\")","v":""},{"$f":"IFERROR(HLOOKUP(AP$3,Pivot!$B$3:$BB$56,DataTab!$G13,FALSE),\"\")","v":""},{"$f":"IFERROR(HLOOKUP(AQ$3,Pivot!$B$3:$BB$56,DataTab!$G13,FALSE),\"\")","v":""},{"$f":"IFERROR(HLOOKUP(AR$3,Pivot!$B$3:$BB$56,DataTab!$G13,FALSE),\"\")","v":""},{"$f":"IFERROR(HLOOKUP(AS$3,Pivot!$B$3:$BB$56,DataTab!$G13,FALSE),\"\")","v":""},{"$f":"IFERROR(HLOOKUP(AT$3,Pivot!$B$3:$BB$56,DataTab!$G13,FALSE),\"\")","v":""},{"$f":"IFERROR(HLOOKUP(AU$3,Pivot!$B$3:$BB$56,DataTab!$G13,FALSE),\"\")","v":""},{"$f":"IFERROR(HLOOKUP(AV$3,Pivot!$B$3:$BB$56,DataTab!$G13,FALSE),\"\")","v":""},{"$f":"IFERROR(HLOOKUP(AW$3,Pivot!$B$3:$BB$56,DataTab!$G13,FALSE),\"\")","v":""},{"$f":"IFERROR(HLOOKUP(AX$3,Pivot!$B$3:$BB$56,DataTab!$G13,FALSE),\"\")","v":""},{"$f":"IFERROR(HLOOKUP(AY$3,Pivot!$B$3:$BB$56,DataTab!$G13,FALSE),\"\")","v":""},{"$f":"IFERROR(HLOOKUP(AZ$3,Pivot!$B$3:$BB$56,DataTab!$G13,FALSE),\"\")","v":""},{"$f":"IFERROR(HLOOKUP(BA$3,Pivot!$B$3:$BB$56,DataTab!$G13,FALSE),\"\")","v":""},{"$f":"IFERROR(HLOOKUP(BB$3,Pivot!$B$3:$BB$56,DataTab!$G13,FALSE),\"\")","v":""},{"$f":"IFERROR(HLOOKUP(BC$3,Pivot!$B$3:$BB$56,DataTab!$G13,FALSE),\"\")","v":""},{"$f":"IFERROR(HLOOKUP(BD$3,Pivot!$B$3:$BB$56,DataTab!$G13,FALSE),\"\")","v":""},{"$f":"IFERROR(HLOOKUP(BE$3,Pivot!$B$3:$BB$56,DataTab!$G13,FALSE),\"\")","v":""},{"$f":"IFERROR(HLOOKUP(BF$3,Pivot!$B$3:$BB$56,DataTab!$G13,FALSE),\"\")","v":""},{"$f":"IFERROR(HLOOKUP(BG$3,Pivot!$B$3:$BB$56,DataTab!$G13,FALSE),\"\")","v":""},{"$f":"IFERROR(HLOOKUP(BH$3,Pivot!$B$3:$BB$56,DataTab!$G13,FALSE),\"\")","v":""},null,""]
["Georgia",8745,8,2,null,{"$f":"IF(ISBLANK(E14),\"\",VLOOKUP(E14,StateListAbbrev!$A$2:$B$53,2,FALSE))","v":""},{"$f":"IF(ISBLANK(E14),\"\",VLOOKUP(F14,'2012'!$A$10:$B$62,2,FALSE))","v":""},null,{"$f":"IFERROR(HLOOKUP(I$3,Pivot!$B$3:$BB$56,DataTab!$G14,FALSE),\"\")","v":""},{"$f":"IFERROR(HLOOKUP(J$3,Pivot!$B$3:$BB$56,DataTab!$G14,FALSE),\"\")","v":""},{"$f":"IFERROR(HLOOKUP(K$3,Pivot!$B$3:$BB$56,DataTab!$G14,FALSE),\"\")","v":""},{"$f":"IFERROR(HLOOKUP(L$3,Pivot!$B$3:$BB$56,DataTab!$G14,FALSE),\"\")","v":""},{"$f":"IFERROR(HLOOKUP(M$3,Pivot!$B$3:$BB$56,DataTab!$G14,FALSE),\"\")","v":""},{"$f":"IFERROR(HLOOKUP(N$3,Pivot!$B$3:$BB$56,DataTab!$G14,FALSE),\"\")","v":""},{"$f":"IFERROR(HLOOKUP(O$3,Pivot!$B$3:$BB$56,DataTab!$G14,FALSE),\"\")","v":""},{"$f":"IFERROR(HLOOKUP(P$3,Pivot!$B$3:$BB$56,DataTab!$G14,FALSE),\"\")","v":""},{"$f":"IFERROR(HLOOKUP(Q$3,Pivot!$B$3:$BB$56,DataTab!$G14,FALSE),\"\")","v":""},{"$f":"IFERROR(HLOOKUP(R$3,Pivot!$B$3:$BB$56,DataTab!$G14,FALSE),\"\")","v":""},{"$f":"IFERROR(HLOOKUP(S$3,Pivot!$B$3:$BB$56,DataTab!$G14,FALSE),\"\")","v":""},{"$f":"IFERROR(HLOOKUP(T$3,Pivot!$B$3:$BB$56,DataTab!$G14,FALSE),\"\")","v":""},{"$f":"IFERROR(HLOOKUP(U$3,Pivot!$B$3:$BB$56,DataTab!$G14,FALSE),\"\")","v":""},{"$f":"IFERROR(HLOOKUP(V$3,Pivot!$B$3:$BB$56,DataTab!$G14,FALSE),\"\")","v":""},{"$f":"IFERROR(HLOOKUP(W$3,Pivot!$B$3:$BB$56,DataTab!$G14,FALSE),\"\")","v":""},{"$f":"IFERROR(HLOOKUP(X$3,Pivot!$B$3:$BB$56,DataTab!$G14,FALSE),\"\")","v":""},{"$f":"IFERROR(HLOOKUP(Y$3,Pivot!$B$3:$BB$56,DataTab!$G14,FALSE),\"\")","v":""},{"$f":"IFERROR(HLOOKUP(Z$3,Pivot!$B$3:$BB$56,DataTab!$G14,FALSE),\"\")","v":""},{"$f":"IFERROR(HLOOKUP(AA$3,Pivot!$B$3:$BB$56,DataTab!$G14,FALSE),\"\")","v":""},{"$f":"IFERROR(HLOOKUP(AB$3,Pivot!$B$3:$BB$56,DataTab!$G14,FALSE),\"\")","v":""},{"$f":"IFERROR(HLOOKUP(AC$3,Pivot!$B$3:$BB$56,DataTab!$G14,FALSE),\"\")","v":""},{"$f":"IFERROR(HLOOKUP(AD$3,Pivot!$B$3:$BB$56,DataTab!$G14,FALSE),\"\")","v":""},{"$f":"IFERROR(HLOOKUP(AE$3,Pivot!$B$3:$BB$56,DataTab!$G14,FALSE),\"\")","v":""},{"$f":"IFERROR(HLOOKUP(AF$3,Pivot!$B$3:$BB$56,DataTab!$G14,FALSE),\"\")","v":""},{"$f":"IFERROR(HLOOKUP(AG$3,Pivot!$B$3:$BB$56,DataTab!$G14,FALSE),\"\")","v":""},{"$f":"IFERROR(HLOOKUP(AH$3,Pivot!$B$3:$BB$56,DataTab!$G14,FALSE),\"\")","v":""},{"$f":"IFERROR(HLOOKUP(AI$3,Pivot!$B$3:$BB$56,DataTab!$G14,FALSE),\"\")","v":""},{"$f":"IFERROR(HLOOKUP(AJ$3,Pivot!$B$3:$BB$56,DataTab!$G14,FALSE),\"\")","v":""},{"$f":"IFERROR(HLOOKUP(AK$3,Pivot!$B$3:$BB$56,DataTab!$G14,FALSE),\"\")","v":""},{"$f":"IFERROR(HLOOKUP(AL$3,Pivot!$B$3:$BB$56,DataTab!$G14,FALSE),\"\")","v":""},{"$f":"IFERROR(HLOOKUP(AM$3,Pivot!$B$3:$BB$56,DataTab!$G14,FALSE),\"\")","v":""},{"$f":"IFERROR(HLOOKUP(AN$3,Pivot!$B$3:$BB$56,DataTab!$G14,FALSE),\"\")","v":""},{"$f":"IFERROR(HLOOKUP(AO$3,Pivot!$B$3:$BB$56,DataTab!$G14,FALSE),\"\")","v":""},{"$f":"IFERROR(HLOOKUP(AP$3,Pivot!$B$3:$BB$56,DataTab!$G14,FALSE),\"\")","v":""},{"$f":"IFERROR(HLOOKUP(AQ$3,Pivot!$B$3:$BB$56,DataTab!$G14,FALSE),\"\")","v":""},{"$f":"IFERROR(HLOOKUP(AR$3,Pivot!$B$3:$BB$56,DataTab!$G14,FALSE),\"\")","v":""},{"$f":"IFERROR(HLOOKUP(AS$3,Pivot!$B$3:$BB$56,DataTab!$G14,FALSE),\"\")","v":""},{"$f":"IFERROR(HLOOKUP(AT$3,Pivot!$B$3:$BB$56,DataTab!$G14,FALSE),\"\")","v":""},{"$f":"IFERROR(HLOOKUP(AU$3,Pivot!$B$3:$BB$56,DataTab!$G14,FALSE),\"\")","v":""},{"$f":"IFERROR(HLOOKUP(AV$3,Pivot!$B$3:$BB$56,DataTab!$G14,FALSE),\"\")","v":""},{"$f":"IFERROR(HLOOKUP(AW$3,Pivot!$B$3:$BB$56,DataTab!$G14,FALSE),\"\")","v":""},{"$f":"IFERROR(HLOOKUP(AX$3,Pivot!$B$3:$BB$56,DataTab!$G14,FALSE),\"\")","v":""},{"$f":"IFERROR(HLOOKUP(AY$3,Pivot!$B$3:$BB$56,DataTab!$G14,FALSE),\"\")","v":""},{"$f":"IFERROR(HLOOKUP(AZ$3,Pivot!$B$3:$BB$56,DataTab!$G14,FALSE),\"\")","v":""},{"$f":"IFERROR(HLOOKUP(BA$3,Pivot!$B$3:$BB$56,DataTab!$G14,FALSE),\"\")","v":""},{"$f":"IFERROR(HLOOKUP(BB$3,Pivot!$B$3:$BB$56,DataTab!$G14,FALSE),\"\")","v":""},{"$f":"IFERROR(HLOOKUP(BC$3,Pivot!$B$3:$BB$56,DataTab!$G14,FALSE),\"\")","v":""},{"$f":"IFERROR(HLOOKUP(BD$3,Pivot!$B$3:$BB$56,DataTab!$G14,FALSE),\"\")","v":""},{"$f":"IFERROR(HLOOKUP(BE$3,Pivot!$B$3:$BB$56,DataTab!$G14,FALSE),\"\")","v":""},{"$f":"IFERROR(HLOOKUP(BF$3,Pivot!$B$3:$BB$56,DataTab!$G14,FALSE),\"\")","v":""},{"$f":"IFERROR(HLOOKUP(BG$3,Pivot!$B$3:$BB$56,DataTab!$G14,FALSE),\"\")","v":""},{"$f":"IFERROR(HLOOKUP(BH$3,Pivot!$B$3:$BB$56,DataTab!$G14,FALSE),\"\")","v":""},null,""]
["Hawaii",869,42,9,null,{"$f":"IF(ISBLANK(E15),\"\",VLOOKUP(E15,StateListAbbrev!$A$2:$B$53,2,FALSE))","v":""},{"$f":"IF(ISBLANK(E15),\"\",VLOOKUP(F15,'2012'!$A$10:$B$62,2,FALSE))","v":""},null,{"$f":"IFERROR(HLOOKUP(I$3,Pivot!$B$3:$BB$56,DataTab!$G15,FALSE),\"\")","v":""},{"$f":"IFERROR(HLOOKUP(J$3,Pivot!$B$3:$BB$56,DataTab!$G15,FALSE),\"\")","v":""},{"$f":"IFERROR(HLOOKUP(K$3,Pivot!$B$3:$BB$56,DataTab!$G15,FALSE),\"\")","v":""},{"$f":"IFERROR(HLOOKUP(L$3,Pivot!$B$3:$BB$56,DataTab!$G15,FALSE),\"\")","v":""},{"$f":"IFERROR(HLOOKUP(M$3,Pivot!$B$3:$BB$56,DataTab!$G15,FALSE),\"\")","v":""},{"$f":"IFERROR(HLOOKUP(N$3,Pivot!$B$3:$BB$56,DataTab!$G15,FALSE),\"\")","v":""},{"$f":"IFERROR(HLOOKUP(O$3,Pivot!$B$3:$BB$56,DataTab!$G15,FALSE),\"\")","v":""},{"$f":"IFERROR(HLOOKUP(P$3,Pivot!$B$3:$BB$56,DataTab!$G15,FALSE),\"\")","v":""},{"$f":"IFERROR(HLOOKUP(Q$3,Pivot!$B$3:$BB$56,DataTab!$G15,FALSE),\"\")","v":""},{"$f":"IFERROR(HLOOKUP(R$3,Pivot!$B$3:$BB$56,DataTab!$G15,FALSE),\"\")","v":""},{"$f":"IFERROR(HLOOKUP(S$3,Pivot!$B$3:$BB$56,DataTab!$G15,FALSE),\"\")","v":""},{"$f":"IFERROR(HLOOKUP(T$3,Pivot!$B$3:$BB$56,DataTab!$G15,FALSE),\"\")","v":""},{"$f":"IFERROR(HLOOKUP(U$3,Pivot!$B$3:$BB$56,DataTab!$G15,FALSE),\"\")","v":""},{"$f":"IFERROR(HLOOKUP(V$3,Pivot!$B$3:$BB$56,DataTab!$G15,FALSE),\"\")","v":""},{"$f":"IFERROR(HLOOKUP(W$3,Pivot!$B$3:$BB$56,DataTab!$G15,FALSE),\"\")","v":""},{"$f":"IFERROR(HLOOKUP(X$3,Pivot!$B$3:$BB$56,DataTab!$G15,FALSE),\"\")","v":""},{"$f":"IFERROR(HLOOKUP(Y$3,Pivot!$B$3:$BB$56,DataTab!$G15,FALSE),\"\")","v":""},{"$f":"IFERROR(HLOOKUP(Z$3,Pivot!$B$3:$BB$56,DataTab!$G15,FALSE),\"\")","v":""},{"$f":"IFERROR(HLOOKUP(AA$3,Pivot!$B$3:$BB$56,DataTab!$G15,FALSE),\"\")","v":""},{"$f":"IFERROR(HLOOKUP(AB$3,Pivot!$B$3:$BB$56,DataTab!$G15,FALSE),\"\")","v":""},{"$f":"IFERROR(HLOOKUP(AC$3,Pivot!$B$3:$BB$56,DataTab!$G15,FALSE),\"\")","v":""},{"$f":"IFERROR(HLOOKUP(AD$3,Pivot!$B$3:$BB$56,DataTab!$G15,FALSE),\"\")","v":""},{"$f":"IFERROR(HLOOKUP(AE$3,Pivot!$B$3:$BB$56,DataTab!$G15,FALSE),\"\")","v":""},{"$f":"IFERROR(HLOOKUP(AF$3,Pivot!$B$3:$BB$56,DataTab!$G15,FALSE),\"\")","v":""},{"$f":"IFERROR(HLOOKUP(AG$3,Pivot!$B$3:$BB$56,DataTab!$G15,FALSE),\"\")","v":""},{"$f":"IFERROR(HLOOKUP(AH$3,Pivot!$B$3:$BB$56,DataTab!$G15,FALSE),\"\")","v":""},{"$f":"IFERROR(HLOOKUP(AI$3,Pivot!$B$3:$BB$56,DataTab!$G15,FALSE),\"\")","v":""},{"$f":"IFERROR(HLOOKUP(AJ$3,Pivot!$B$3:$BB$56,DataTab!$G15,FALSE),\"\")","v":""},{"$f":"IFERROR(HLOOKUP(AK$3,Pivot!$B$3:$BB$56,DataTab!$G15,FALSE),\"\")","v":""},{"$f":"IFERROR(HLOOKUP(AL$3,Pivot!$B$3:$BB$56,DataTab!$G15,FALSE),\"\")","v":""},{"$f":"IFERROR(HLOOKUP(AM$3,Pivot!$B$3:$BB$56,DataTab!$G15,FALSE),\"\")","v":""},{"$f":"IFERROR(HLOOKUP(AN$3,Pivot!$B$3:$BB$56,DataTab!$G15,FALSE),\"\")","v":""},{"$f":"IFERROR(HLOOKUP(AO$3,Pivot!$B$3:$BB$56,DataTab!$G15,FALSE),\"\")","v":""},{"$f":"IFERROR(HLOOKUP(AP$3,Pivot!$B$3:$BB$56,DataTab!$G15,FALSE),\"\")","v":""},{"$f":"IFERROR(HLOOKUP(AQ$3,Pivot!$B$3:$BB$56,DataTab!$G15,FALSE),\"\")","v":""},{"$f":"IFERROR(HLOOKUP(AR$3,Pivot!$B$3:$BB$56,DataTab!$G15,FALSE),\"\")","v":""},{"$f":"IFERROR(HLOOKUP(AS$3,Pivot!$B$3:$BB$56,DataTab!$G15,FALSE),\"\")","v":""},{"$f":"IFERROR(HLOOKUP(AT$3,Pivot!$B$3:$BB$56,DataTab!$G15,FALSE),\"\")","v":""},{"$f":"IFERROR(HLOOKUP(AU$3,Pivot!$B$3:$BB$56,DataTab!$G15,FALSE),\"\")","v":""},{"$f":"IFERROR(HLOOKUP(AV$3,Pivot!$B$3:$BB$56,DataTab!$G15,FALSE),\"\")","v":""},{"$f":"IFERROR(HLOOKUP(AW$3,Pivot!$B$3:$BB$56,DataTab!$G15,FALSE),\"\")","v":""},{"$f":"IFERROR(HLOOKUP(AX$3,Pivot!$B$3:$BB$56,DataTab!$G15,FALSE),\"\")","v":""},{"$f":"IFERROR(HLOOKUP(AY$3,Pivot!$B$3:$BB$56,DataTab!$G15,FALSE),\"\")","v":""},{"$f":"IFERROR(HLOOKUP(AZ$3,Pivot!$B$3:$BB$56,DataTab!$G15,FALSE),\"\")","v":""},{"$f":"IFERROR(HLOOKUP(BA$3,Pivot!$B$3:$BB$56,DataTab!$G15,FALSE),\"\")","v":""},{"$f":"IFERROR(HLOOKUP(BB$3,Pivot!$B$3:$BB$56,DataTab!$G15,FALSE),\"\")","v":""},{"$f":"IFERROR(HLOOKUP(BC$3,Pivot!$B$3:$BB$56,DataTab!$G15,FALSE),\"\")","v":""},{"$f":"IFERROR(HLOOKUP(BD$3,Pivot!$B$3:$BB$56,DataTab!$G15,FALSE),\"\")","v":""},{"$f":"IFERROR(HLOOKUP(BE$3,Pivot!$B$3:$BB$56,DataTab!$G15,FALSE),\"\")","v":""},{"$f":"IFERROR(HLOOKUP(BF$3,Pivot!$B$3:$BB$56,DataTab!$G15,FALSE),\"\")","v":""},{"$f":"IFERROR(HLOOKUP(BG$3,Pivot!$B$3:$BB$56,DataTab!$G15,FALSE),\"\")","v":""},{"$f":"IFERROR(HLOOKUP(BH$3,Pivot!$B$3:$BB$56,DataTab!$G15,FALSE),\"\")","v":""},null,""]
["Idaho",1384,32,7,null,{"$f":"IF(ISBLANK(E16),\"\",VLOOKUP(E16,StateListAbbrev!$A$2:$B$53,2,FALSE))","v":""},{"$f":"IF(ISBLANK(E16),\"\",VLOOKUP(F16,'2012'!$A$10:$B$62,2,FALSE))","v":""},null,{"$f":"IFERROR(HLOOKUP(I$3,Pivot!$B$3:$BB$56,DataTab!$G16,FALSE),\"\")","v":""},{"$f":"IFERROR(HLOOKUP(J$3,Pivot!$B$3:$BB$56,DataTab!$G16,FALSE),\"\")","v":""},{"$f":"IFERROR(HLOOKUP(K$3,Pivot!$B$3:$BB$56,DataTab!$G16,FALSE),\"\")","v":""},{"$f":"IFERROR(HLOOKUP(L$3,Pivot!$B$3:$BB$56,DataTab!$G16,FALSE),\"\")","v":""},{"$f":"IFERROR(HLOOKUP(M$3,Pivot!$B$3:$BB$56,DataTab!$G16,FALSE),\"\")","v":""},{"$f":"IFERROR(HLOOKUP(N$3,Pivot!$B$3:$BB$56,DataTab!$G16,FALSE),\"\")","v":""},{"$f":"IFERROR(HLOOKUP(O$3,Pivot!$B$3:$BB$56,DataTab!$G16,FALSE),\"\")","v":""},{"$f":"IFERROR(HLOOKUP(P$3,Pivot!$B$3:$BB$56,DataTab!$G16,FALSE),\"\")","v":""},{"$f":"IFERROR(HLOOKUP(Q$3,Pivot!$B$3:$BB$56,DataTab!$G16,FALSE),\"\")","v":""},{"$f":"IFERROR(HLOOKUP(R$3,Pivot!$B$3:$BB$56,DataTab!$G16,FALSE),\"\")","v":""},{"$f":"IFERROR(HLOOKUP(S$3,Pivot!$B$3:$BB$56,DataTab!$G16,FALSE),\"\")","v":""},{"$f":"IFERROR(HLOOKUP(T$3,Pivot!$B$3:$BB$56,DataTab!$G16,FALSE),\"\")","v":""},{"$f":"IFERROR(HLOOKUP(U$3,Pivot!$B$3:$BB$56,DataTab!$G16,FALSE),\"\")","v":""},{"$f":"IFERROR(HLOOKUP(V$3,Pivot!$B$3:$BB$56,DataTab!$G16,FALSE),\"\")","v":""},{"$f":"IFERROR(HLOOKUP(W$3,Pivot!$B$3:$BB$56,DataTab!$G16,FALSE),\"\")","v":""},{"$f":"IFERROR(HLOOKUP(X$3,Pivot!$B$3:$BB$56,DataTab!$G16,FALSE),\"\")","v":""},{"$f":"IFERROR(HLOOKUP(Y$3,Pivot!$B$3:$BB$56,DataTab!$G16,FALSE),\"\")","v":""},{"$f":"IFERROR(HLOOKUP(Z$3,Pivot!$B$3:$BB$56,DataTab!$G16,FALSE),\"\")","v":""},{"$f":"IFERROR(HLOOKUP(AA$3,Pivot!$B$3:$BB$56,DataTab!$G16,FALSE),\"\")","v":""},{"$f":"IFERROR(HLOOKUP(AB$3,Pivot!$B$3:$BB$56,DataTab!$G16,FALSE),\"\")","v":""},{"$f":"IFERROR(HLOOKUP(AC$3,Pivot!$B$3:$BB$56,DataTab!$G16,FALSE),\"\")","v":""},{"$f":"IFERROR(HLOOKUP(AD$3,Pivot!$B$3:$BB$56,DataTab!$G16,FALSE),\"\")","v":""},{"$f":"IFERROR(HLOOKUP(AE$3,Pivot!$B$3:$BB$56,DataTab!$G16,FALSE),\"\")","v":""},{"$f":"IFERROR(HLOOKUP(AF$3,Pivot!$B$3:$BB$56,DataTab!$G16,FALSE),\"\")","v":""},{"$f":"IFERROR(HLOOKUP(AG$3,Pivot!$B$3:$BB$56,DataTab!$G16,FALSE),\"\")","v":""},{"$f":"IFERROR(HLOOKUP(AH$3,Pivot!$B$3:$BB$56,DataTab!$G16,FALSE),\"\")","v":""},{"$f":"IFERROR(HLOOKUP(AI$3,Pivot!$B$3:$BB$56,DataTab!$G16,FALSE),\"\")","v":""},{"$f":"IFERROR(HLOOKUP(AJ$3,Pivot!$B$3:$BB$56,DataTab!$G16,FALSE),\"\")","v":""},{"$f":"IFERROR(HLOOKUP(AK$3,Pivot!$B$3:$BB$56,DataTab!$G16,FALSE),\"\")","v":""},{"$f":"IFERROR(HLOOKUP(AL$3,Pivot!$B$3:$BB$56,DataTab!$G16,FALSE),\"\")","v":""},{"$f":"IFERROR(HLOOKUP(AM$3,Pivot!$B$3:$BB$56,DataTab!$G16,FALSE),\"\")","v":""},{"$f":"IFERROR(HLOOKUP(AN$3,Pivot!$B$3:$BB$56,DataTab!$G16,FALSE),\"\")","v":""},{"$f":"IFERROR(HLOOKUP(AO$3,Pivot!$B$3:$BB$56,DataTab!$G16,FALSE),\"\")","v":""},{"$f":"IFERROR(HLOOKUP(AP$3,Pivot!$B$3:$BB$56,DataTab!$G16,FALSE),\"\")","v":""},{"$f":"IFERROR(HLOOKUP(AQ$3,Pivot!$B$3:$BB$56,DataTab!$G16,FALSE),\"\")","v":""},{"$f":"IFERROR(HLOOKUP(AR$3,Pivot!$B$3:$BB$56,DataTab!$G16,FALSE),\"\")","v":""},{"$f":"IFERROR(HLOOKUP(AS$3,Pivot!$B$3:$BB$56,DataTab!$G16,FALSE),\"\")","v":""},{"$f":"IFERROR(HLOOKUP(AT$3,Pivot!$B$3:$BB$56,DataTab!$G16,FALSE),\"\")","v":""},{"$f":"IFERROR(HLOOKUP(AU$3,Pivot!$B$3:$BB$56,DataTab!$G16,FALSE),\"\")","v":""},{"$f":"IFERROR(HLOOKUP(AV$3,Pivot!$B$3:$BB$56,DataTab!$G16,FALSE),\"\")","v":""},{"$f":"IFERROR(HLOOKUP(AW$3,Pivot!$B$3:$BB$56,DataTab!$G16,FALSE),\"\")","v":""},{"$f":"IFERROR(HLOOKUP(AX$3,Pivot!$B$3:$BB$56,DataTab!$G16,FALSE),\"\")","v":""},{"$f":"IFERROR(HLOOKUP(AY$3,Pivot!$B$3:$BB$56,DataTab!$G16,FALSE),\"\")","v":""},{"$f":"IFERROR(HLOOKUP(AZ$3,Pivot!$B$3:$BB$56,DataTab!$G16,FALSE),\"\")","v":""},{"$f":"IFERROR(HLOOKUP(BA$3,Pivot!$B$3:$BB$56,DataTab!$G16,FALSE),\"\")","v":""},{"$f":"IFERROR(HLOOKUP(BB$3,Pivot!$B$3:$BB$56,DataTab!$G16,FALSE),\"\")","v":""},{"$f":"IFERROR(HLOOKUP(BC$3,Pivot!$B$3:$BB$56,DataTab!$G16,FALSE),\"\")","v":""},{"$f":"IFERROR(HLOOKUP(BD$3,Pivot!$B$3:$BB$56,DataTab!$G16,FALSE),\"\")","v":""},{"$f":"IFERROR(HLOOKUP(BE$3,Pivot!$B$3:$BB$56,DataTab!$G16,FALSE),\"\")","v":""},{"$f":"IFERROR(HLOOKUP(BF$3,Pivot!$B$3:$BB$56,DataTab!$G16,FALSE),\"\")","v":""},{"$f":"IFERROR(HLOOKUP(BG$3,Pivot!$B$3:$BB$56,DataTab!$G16,FALSE),\"\")","v":""},{"$f":"IFERROR(HLOOKUP(BH$3,Pivot!$B$3:$BB$56,DataTab!$G16,FALSE),\"\")","v":""},null,""]
["Illinois",0,52,10,null,{"$f":"IF(ISBLANK(E17),\"\",VLOOKUP(E17,StateListAbbrev!$A$2:$B$53,2,FALSE))","v":""},{"$f":"IF(ISBLANK(E17),\"\",VLOOKUP(F17,'2012'!$A$10:$B$62,2,FALSE))","v":""},null,{"$f":"IFERROR(HLOOKUP(I$3,Pivot!$B$3:$BB$56,DataTab!$G17,FALSE),\"\")","v":""},{"$f":"IFERROR(HLOOKUP(J$3,Pivot!$B$3:$BB$56,DataTab!$G17,FALSE),\"\")","v":""},{"$f":"IFERROR(HLOOKUP(K$3,Pivot!$B$3:$BB$56,DataTab!$G17,FALSE),\"\")","v":""},{"$f":"IFERROR(HLOOKUP(L$3,Pivot!$B$3:$BB$56,DataTab!$G17,FALSE),\"\")","v":""},{"$f":"IFERROR(HLOOKUP(M$3,Pivot!$B$3:$BB$56,DataTab!$G17,FALSE),\"\")","v":""},{"$f":"IFERROR(HLOOKUP(N$3,Pivot!$B$3:$BB$56,DataTab!$G17,FALSE),\"\")","v":""},{"$f":"IFERROR(HLOOKUP(O$3,Pivot!$B$3:$BB$56,DataTab!$G17,FALSE),\"\")","v":""},{"$f":"IFERROR(HLOOKUP(P$3,Pivot!$B$3:$BB$56,DataTab!$G17,FALSE),\"\")","v":""},{"$f":"IFERROR(HLOOKUP(Q$3,Pivot!$B$3:$BB$56,DataTab!$G17,FALSE),\"\")","v":""},{"$f":"IFERROR(HLOOKUP(R$3,Pivot!$B$3:$BB$56,DataTab!$G17,FALSE),\"\")","v":""},{"$f":"IFERROR(HLOOKUP(S$3,Pivot!$B$3:$BB$56,DataTab!$G17,FALSE),\"\")","v":""},{"$f":"IFERROR(HLOOKUP(T$3,Pivot!$B$3:$BB$56,DataTab!$G17,FALSE),\"\")","v":""},{"$f":"IFERROR(HLOOKUP(U$3,Pivot!$B$3:$BB$56,DataTab!$G17,FALSE),\"\")","v":""},{"$f":"IFERROR(HLOOKUP(V$3,Pivot!$B$3:$BB$56,DataTab!$G17,FALSE),\"\")","v":""},{"$f":"IFERROR(HLOOKUP(W$3,Pivot!$B$3:$BB$56,DataTab!$G17,FALSE),\"\")","v":""},{"$f":"IFERROR(HLOOKUP(X$3,Pivot!$B$3:$BB$56,DataTab!$G17,FALSE),\"\")","v":""},{"$f":"IFERROR(HLOOKUP(Y$3,Pivot!$B$3:$BB$56,DataTab!$G17,FALSE),\"\")","v":""},{"$f":"IFERROR(HLOOKUP(Z$3,Pivot!$B$3:$BB$56,DataTab!$G17,FALSE),\"\")","v":""},{"$f":"IFERROR(HLOOKUP(AA$3,Pivot!$B$3:$BB$56,DataTab!$G17,FALSE),\"\")","v":""},{"$f":"IFERROR(HLOOKUP(AB$3,Pivot!$B$3:$BB$56,DataTab!$G17,FALSE),\"\")","v":""},{"$f":"IFERROR(HLOOKUP(AC$3,Pivot!$B$3:$BB$56,DataTab!$G17,FALSE),\"\")","v":""},{"$f":"IFERROR(HLOOKUP(AD$3,Pivot!$B$3:$BB$56,DataTab!$G17,FALSE),\"\")","v":""},{"$f":"IFERROR(HLOOKUP(AE$3,Pivot!$B$3:$BB$56,DataTab!$G17,FALSE),\"\")","v":""},{"$f":"IFERROR(HLOOKUP(AF$3,Pivot!$B$3:$BB$56,DataTab!$G17,FALSE),\"\")","v":""},{"$f":"IFERROR(HLOOKUP(AG$3,Pivot!$B$3:$BB$56,DataTab!$G17,FALSE),\"\")","v":""},{"$f":"IFERROR(HLOOKUP(AH$3,Pivot!$B$3:$BB$56,DataTab!$G17,FALSE),\"\")","v":""},{"$f":"IFERROR(HLOOKUP(AI$3,Pivot!$B$3:$BB$56,DataTab!$G17,FALSE),\"\")","v":""},{"$f":"IFERROR(HLOOKUP(AJ$3,Pivot!$B$3:$BB$56,DataTab!$G17,FALSE),\"\")","v":""},{"$f":"IFERROR(HLOOKUP(AK$3,Pivot!$B$3:$BB$56,DataTab!$G17,FALSE),\"\")","v":""},{"$f":"IFERROR(HLOOKUP(AL$3,Pivot!$B$3:$BB$56,DataTab!$G17,FALSE),\"\")","v":""},{"$f":"IFERROR(HLOOKUP(AM$3,Pivot!$B$3:$BB$56,DataTab!$G17,FALSE),\"\")","v":""},{"$f":"IFERROR(HLOOKUP(AN$3,Pivot!$B$3:$BB$56,DataTab!$G17,FALSE),\"\")","v":""},{"$f":"IFERROR(HLOOKUP(AO$3,Pivot!$B$3:$BB$56,DataTab!$G17,FALSE),\"\")","v":""},{"$f":"IFERROR(HLOOKUP(AP$3,Pivot!$B$3:$BB$56,DataTab!$G17,FALSE),\"\")","v":""},{"$f":"IFERROR(HLOOKUP(AQ$3,Pivot!$B$3:$BB$56,DataTab!$G17,FALSE),\"\")","v":""},{"$f":"IFERROR(HLOOKUP(AR$3,Pivot!$B$3:$BB$56,DataTab!$G17,FALSE),\"\")","v":""},{"$f":"IFERROR(HLOOKUP(AS$3,Pivot!$B$3:$BB$56,DataTab!$G17,FALSE),\"\")","v":""},{"$f":"IFERROR(HLOOKUP(AT$3,Pivot!$B$3:$BB$56,DataTab!$G17,FALSE),\"\")","v":""},{"$f":"IFERROR(HLOOKUP(AU$3,Pivot!$B$3:$BB$56,DataTab!$G17,FALSE),\"\")","v":""},{"$f":"IFERROR(HLOOKUP(AV$3,Pivot!$B$3:$BB$56,DataTab!$G17,FALSE),\"\")","v":""},{"$f":"IFERROR(HLOOKUP(AW$3,Pivot!$B$3:$BB$56,DataTab!$G17,FALSE),\"\")","v":""},{"$f":"IFERROR(HLOOKUP(AX$3,Pivot!$B$3:$BB$56,DataTab!$G17,FALSE),\"\")","v":""},{"$f":"IFERROR(HLOOKUP(AY$3,Pivot!$B$3:$BB$56,DataTab!$G17,FALSE),\"\")","v":""},{"$f":"IFERROR(HLOOKUP(AZ$3,Pivot!$B$3:$BB$56,DataTab!$G17,FALSE),\"\")","v":""},{"$f":"IFERROR(HLOOKUP(BA$3,Pivot!$B$3:$BB$56,DataTab!$G17,FALSE),\"\")","v":""},{"$f":"IFERROR(HLOOKUP(BB$3,Pivot!$B$3:$BB$56,DataTab!$G17,FALSE),\"\")","v":""},{"$f":"IFERROR(HLOOKUP(BC$3,Pivot!$B$3:$BB$56,DataTab!$G17,FALSE),\"\")","v":""},{"$f":"IFERROR(HLOOKUP(BD$3,Pivot!$B$3:$BB$56,DataTab!$G17,FALSE),\"\")","v":""},{"$f":"IFERROR(HLOOKUP(BE$3,Pivot!$B$3:$BB$56,DataTab!$G17,FALSE),\"\")","v":""},{"$f":"IFERROR(HLOOKUP(BF$3,Pivot!$B$3:$BB$56,DataTab!$G17,FALSE),\"\")","v":""},{"$f":"IFERROR(HLOOKUP(BG$3,Pivot!$B$3:$BB$56,DataTab!$G17,FALSE),\"\")","v":""},{"$f":"IFERROR(HLOOKUP(BH$3,Pivot!$B$3:$BB$56,DataTab!$G17,FALSE),\"\")","v":""},null,""]
["Indiana",16907,1,1,null,{"$f":"IF(ISBLANK(E18),\"\",VLOOKUP(E18,StateListAbbrev!$A$2:$B$53,2,FALSE))","v":""},{"$f":"IF(ISBLANK(E18),\"\",VLOOKUP(F18,'2012'!$A$10:$B$62,2,FALSE))","v":""},null,{"$f":"IFERROR(HLOOKUP(I$3,Pivot!$B$3:$BB$56,DataTab!$G18,FALSE),\"\")","v":""},{"$f":"IFERROR(HLOOKUP(J$3,Pivot!$B$3:$BB$56,DataTab!$G18,FALSE),\"\")","v":""},{"$f":"IFERROR(HLOOKUP(K$3,Pivot!$B$3:$BB$56,DataTab!$G18,FALSE),\"\")","v":""},{"$f":"IFERROR(HLOOKUP(L$3,Pivot!$B$3:$BB$56,DataTab!$G18,FALSE),\"\")","v":""},{"$f":"IFERROR(HLOOKUP(M$3,Pivot!$B$3:$BB$56,DataTab!$G18,FALSE),\"\")","v":""},{"$f":"IFERROR(HLOOKUP(N$3,Pivot!$B$3:$BB$56,DataTab!$G18,FALSE),\"\")","v":""},{"$f":"IFERROR(HLOOKUP(O$3,Pivot!$B$3:$BB$56,DataTab!$G18,FALSE),\"\")","v":""},{"$f":"IFERROR(HLOOKUP(P$3,Pivot!$B$3:$BB$56,DataTab!$G18,FALSE),\"\")","v":""},{"$f":"IFERROR(HLOOKUP(Q$3,Pivot!$B$3:$BB$56,DataTab!$G18,FALSE),\"\")","v":""},{"$f":"IFERROR(HLOOKUP(R$3,Pivot!$B$3:$BB$56,DataTab!$G18,FALSE),\"\")","v":""},{"$f":"IFERROR(HLOOKUP(S$3,Pivot!$B$3:$BB$56,DataTab!$G18,FALSE),\"\")","v":""},{"$f":"IFERROR(HLOOKUP(T$3,Pivot!$B$3:$BB$56,DataTab!$G18,FALSE),\"\")","v":""},{"$f":"IFERROR(HLOOKUP(U$3,Pivot!$B$3:$BB$56,DataTab!$G18,FALSE),\"\")","v":""},{"$f":"IFERROR(HLOOKUP(V$3,Pivot!$B$3:$BB$56,DataTab!$G18,FALSE),\"\")","v":""},{"$f":"IFERROR(HLOOKUP(W$3,Pivot!$B$3:$BB$56,DataTab!$G18,FALSE),\"\")","v":""},{"$f":"IFERROR(HLOOKUP(X$3,Pivot!$B$3:$BB$56,DataTab!$G18,FALSE),\"\")","v":""},{"$f":"IFERROR(HLOOKUP(Y$3,Pivot!$B$3:$BB$56,DataTab!$G18,FALSE),\"\")","v":""},{"$f":"IFERROR(HLOOKUP(Z$3,Pivot!$B$3:$BB$56,DataTab!$G18,FALSE),\"\")","v":""},{"$f":"IFERROR(HLOOKUP(AA$3,Pivot!$B$3:$BB$56,DataTab!$G18,FALSE),\"\")","v":""},{"$f":"IFERROR(HLOOKUP(AB$3,Pivot!$B$3:$BB$56,DataTab!$G18,FALSE),\"\")","v":""},{"$f":"IFERROR(HLOOKUP(AC$3,Pivot!$B$3:$BB$56,DataTab!$G18,FALSE),\"\")","v":""},{"$f":"IFERROR(HLOOKUP(AD$3,Pivot!$B$3:$BB$56,DataTab!$G18,FALSE),\"\")","v":""},{"$f":"IFERROR(HLOOKUP(AE$3,Pivot!$B$3:$BB$56,DataTab!$G18,FALSE),\"\")","v":""},{"$f":"IFERROR(HLOOKUP(AF$3,Pivot!$B$3:$BB$56,DataTab!$G18,FALSE),\"\")","v":""},{"$f":"IFERROR(HLOOKUP(AG$3,Pivot!$B$3:$BB$56,DataTab!$G18,FALSE),\"\")","v":""},{"$f":"IFERROR(HLOOKUP(AH$3,Pivot!$B$3:$BB$56,DataTab!$G18,FALSE),\"\")","v":""},{"$f":"IFERROR(HLOOKUP(AI$3,Pivot!$B$3:$BB$56,DataTab!$G18,FALSE),\"\")","v":""},{"$f":"IFERROR(HLOOKUP(AJ$3,Pivot!$B$3:$BB$56,DataTab!$G18,FALSE),\"\")","v":""},{"$f":"IFERROR(HLOOKUP(AK$3,Pivot!$B$3:$BB$56,DataTab!$G18,FALSE),\"\")","v":""},{"$f":"IFERROR(HLOOKUP(AL$3,Pivot!$B$3:$BB$56,DataTab!$G18,FALSE),\"\")","v":""},{"$f":"IFERROR(HLOOKUP(AM$3,Pivot!$B$3:$BB$56,DataTab!$G18,FALSE),\"\")","v":""},{"$f":"IFERROR(HLOOKUP(AN$3,Pivot!$B$3:$BB$56,DataTab!$G18,FALSE),\"\")","v":""},{"$f":"IFERROR(HLOOKUP(AO$3,Pivot!$B$3:$BB$56,DataTab!$G18,FALSE),\"\")","v":""},{"$f":"IFERROR(HLOOKUP(AP$3,Pivot!$B$3:$BB$56,DataTab!$G18,FALSE),\"\")","v":""},{"$f":"IFERROR(HLOOKUP(AQ$3,Pivot!$B$3:$BB$56,DataTab!$G18,FALSE),\"\")","v":""},{"$f":"IFERROR(HLOOKUP(AR$3,Pivot!$B$3:$BB$56,DataTab!$G18,FALSE),\"\")","v":""},{"$f":"IFERROR(HLOOKUP(AS$3,Pivot!$B$3:$BB$56,DataTab!$G18,FALSE),\"\")","v":""},{"$f":"IFERROR(HLOOKUP(AT$3,Pivot!$B$3:$BB$56,DataTab!$G18,FALSE),\"\")","v":""},{"$f":"IFERROR(HLOOKUP(AU$3,Pivot!$B$3:$BB$56,DataTab!$G18,FALSE),\"\")","v":""},{"$f":"IFERROR(HLOOKUP(AV$3,Pivot!$B$3:$BB$56,DataTab!$G18,FALSE),\"\")","v":""},{"$f":"IFERROR(HLOOKUP(AW$3,Pivot!$B$3:$BB$56,DataTab!$G18,FALSE),\"\")","v":""},{"$f":"IFERROR(HLOOKUP(AX$3,Pivot!$B$3:$BB$56,DataTab!$G18,FALSE),\"\")","v":""},{"$f":"IFERROR(HLOOKUP(AY$3,Pivot!$B$3:$BB$56,DataTab!$G18,FALSE),\"\")","v":""},{"$f":"IFERROR(HLOOKUP(AZ$3,Pivot!$B$3:$BB$56,DataTab!$G18,FALSE),\"\")","v":""},{"$f":"IFERROR(HLOOKUP(BA$3,Pivot!$B$3:$BB$56,DataTab!$G18,FALSE),\"\")","v":""},{"$f":"IFERROR(HLOOKUP(BB$3,Pivot!$B$3:$BB$56,DataTab!$G18,FALSE),\"\")","v":""},{"$f":"IFERROR(HLOOKUP(BC$3,Pivot!$B$3:$BB$56,DataTab!$G18,FALSE),\"\")","v":""},{"$f":"IFERROR(HLOOKUP(BD$3,Pivot!$B$3:$BB$56,DataTab!$G18,FALSE),\"\")","v":""},{"$f":"IFERROR(HLOOKUP(BE$3,Pivot!$B$3:$BB$56,DataTab!$G18,FALSE),\"\")","v":""},{"$f":"IFERROR(HLOOKUP(BF$3,Pivot!$B$3:$BB$56,DataTab!$G18,FALSE),\"\")","v":""},{"$f":"IFERROR(HLOOKUP(BG$3,Pivot!$B$3:$BB$56,DataTab!$G18,FALSE),\"\")","v":""},{"$f":"IFERROR(HLOOKUP(BH$3,Pivot!$B$3:$BB$56,DataTab!$G18,FALSE),\"\")","v":""},null,""]
["Iowa",8529,9,2,null,{"$f":"IF(ISBLANK(E19),\"\",VLOOKUP(E19,StateListAbbrev!$A$2:$B$53,2,FALSE))","v":""},{"$f":"IF(ISBLANK(E19),\"\",VLOOKUP(F19,'2012'!$A$10:$B$62,2,FALSE))","v":""},null,{"$f":"IFERROR(HLOOKUP(I$3,Pivot!$B$3:$BB$56,DataTab!$G19,FALSE),\"\")","v":""},{"$f":"IFERROR(HLOOKUP(J$3,Pivot!$B$3:$BB$56,DataTab!$G19,FALSE),\"\")","v":""},{"$f":"IFERROR(HLOOKUP(K$3,Pivot!$B$3:$BB$56,DataTab!$G19,FALSE),\"\")","v":""},{"$f":"IFERROR(HLOOKUP(L$3,Pivot!$B$3:$BB$56,DataTab!$G19,FALSE),\"\")","v":""},{"$f":"IFERROR(HLOOKUP(M$3,Pivot!$B$3:$BB$56,DataTab!$G19,FALSE),\"\")","v":""},{"$f":"IFERROR(HLOOKUP(N$3,Pivot!$B$3:$BB$56,DataTab!$G19,FALSE),\"\")","v":""},{"$f":"IFERROR(HLOOKUP(O$3,Pivot!$B$3:$BB$56,DataTab!$G19,FALSE),\"\")","v":""},{"$f":"IFERROR(HLOOKUP(P$3,Pivot!$B$3:$BB$56,DataTab!$G19,FALSE),\"\")","v":""},{"$f":"IFERROR(HLOOKUP(Q$3,Pivot!$B$3:$BB$56,DataTab!$G19,FALSE),\"\")","v":""},{"$f":"IFERROR(HLOOKUP(R$3,Pivot!$B$3:$BB$56,DataTab!$G19,FALSE),\"\")","v":""},{"$f":"IFERROR(HLOOKUP(S$3,Pivot!$B$3:$BB$56,DataTab!$G19,FALSE),\"\")","v":""},{"$f":"IFERROR(HLOOKUP(T$3,Pivot!$B$3:$BB$56,DataTab!$G19,FALSE),\"\")","v":""},{"$f":"IFERROR(HLOOKUP(U$3,Pivot!$B$3:$BB$56,DataTab!$G19,FALSE),\"\")","v":""},{"$f":"IFERROR(HLOOKUP(V$3,Pivot!$B$3:$BB$56,DataTab!$G19,FALSE),\"\")","v":""},{"$f":"IFERROR(HLOOKUP(W$3,Pivot!$B$3:$BB$56,DataTab!$G19,FALSE),\"\")","v":""},{"$f":"IFERROR(HLOOKUP(X$3,Pivot!$B$3:$BB$56,DataTab!$G19,FALSE),\"\")","v":""},{"$f":"IFERROR(HLOOKUP(Y$3,Pivot!$B$3:$BB$56,DataTab!$G19,FALSE),\"\")","v":""},{"$f":"IFERROR(HLOOKUP(Z$3,Pivot!$B$3:$BB$56,DataTab!$G19,FALSE),\"\")","v":""},{"$f":"IFERROR(HLOOKUP(AA$3,Pivot!$B$3:$BB$56,DataTab!$G19,FALSE),\"\")","v":""},{"$f":"IFERROR(HLOOKUP(AB$3,Pivot!$B$3:$BB$56,DataTab!$G19,FALSE),\"\")","v":""},{"$f":"IFERROR(HLOOKUP(AC$3,Pivot!$B$3:$BB$56,DataTab!$G19,FALSE),\"\")","v":""},{"$f":"IFERROR(HLOOKUP(AD$3,Pivot!$B$3:$BB$56,DataTab!$G19,FALSE),\"\")","v":""},{"$f":"IFERROR(HLOOKUP(AE$3,Pivot!$B$3:$BB$56,DataTab!$G19,FALSE),\"\")","v":""},{"$f":"IFERROR(HLOOKUP(AF$3,Pivot!$B$3:$BB$56,DataTab!$G19,FALSE),\"\")","v":""},{"$f":"IFERROR(HLOOKUP(AG$3,Pivot!$B$3:$BB$56,DataTab!$G19,FALSE),\"\")","v":""},{"$f":"IFERROR(HLOOKUP(AH$3,Pivot!$B$3:$BB$56,DataTab!$G19,FALSE),\"\")","v":""},{"$f":"IFERROR(HLOOKUP(AI$3,Pivot!$B$3:$BB$56,DataTab!$G19,FALSE),\"\")","v":""},{"$f":"IFERROR(HLOOKUP(AJ$3,Pivot!$B$3:$BB$56,DataTab!$G19,FALSE),\"\")","v":""},{"$f":"IFERROR(HLOOKUP(AK$3,Pivot!$B$3:$BB$56,DataTab!$G19,FALSE),\"\")","v":""},{"$f":"IFERROR(HLOOKUP(AL$3,Pivot!$B$3:$BB$56,DataTab!$G19,FALSE),\"\")","v":""},{"$f":"IFERROR(HLOOKUP(AM$3,Pivot!$B$3:$BB$56,DataTab!$G19,FALSE),\"\")","v":""},{"$f":"IFERROR(HLOOKUP(AN$3,Pivot!$B$3:$BB$56,DataTab!$G19,FALSE),\"\")","v":""},{"$f":"IFERROR(HLOOKUP(AO$3,Pivot!$B$3:$BB$56,DataTab!$G19,FALSE),\"\")","v":""},{"$f":"IFERROR(HLOOKUP(AP$3,Pivot!$B$3:$BB$56,DataTab!$G19,FALSE),\"\")","v":""},{"$f":"IFERROR(HLOOKUP(AQ$3,Pivot!$B$3:$BB$56,DataTab!$G19,FALSE),\"\")","v":""},{"$f":"IFERROR(HLOOKUP(AR$3,Pivot!$B$3:$BB$56,DataTab!$G19,FALSE),\"\")","v":""},{"$f":"IFERROR(HLOOKUP(AS$3,Pivot!$B$3:$BB$56,DataTab!$G19,FALSE),\"\")","v":""},{"$f":"IFERROR(HLOOKUP(AT$3,Pivot!$B$3:$BB$56,DataTab!$G19,FALSE),\"\")","v":""},{"$f":"IFERROR(HLOOKUP(AU$3,Pivot!$B$3:$BB$56,DataTab!$G19,FALSE),\"\")","v":""},{"$f":"IFERROR(HLOOKUP(AV$3,Pivot!$B$3:$BB$56,DataTab!$G19,FALSE),\"\")","v":""},{"$f":"IFERROR(HLOOKUP(AW$3,Pivot!$B$3:$BB$56,DataTab!$G19,FALSE),\"\")","v":""},{"$f":"IFERROR(HLOOKUP(AX$3,Pivot!$B$3:$BB$56,DataTab!$G19,FALSE),\"\")","v":""},{"$f":"IFERROR(HLOOKUP(AY$3,Pivot!$B$3:$BB$56,DataTab!$G19,FALSE),\"\")","v":""},{"$f":"IFERROR(HLOOKUP(AZ$3,Pivot!$B$3:$BB$56,DataTab!$G19,FALSE),\"\")","v":""},{"$f":"IFERROR(HLOOKUP(BA$3,Pivot!$B$3:$BB$56,DataTab!$G19,FALSE),\"\")","v":""},{"$f":"IFERROR(HLOOKUP(BB$3,Pivot!$B$3:$BB$56,DataTab!$G19,FALSE),\"\")","v":""},{"$f":"IFERROR(HLOOKUP(BC$3,Pivot!$B$3:$BB$56,DataTab!$G19,FALSE),\"\")","v":""},{"$f":"IFERROR(HLOOKUP(BD$3,Pivot!$B$3:$BB$56,DataTab!$G19,FALSE),\"\")","v":""},{"$f":"IFERROR(HLOOKUP(BE$3,Pivot!$B$3:$BB$56,DataTab!$G19,FALSE),\"\")","v":""},{"$f":"IFERROR(HLOOKUP(BF$3,Pivot!$B$3:$BB$56,DataTab!$G19,FALSE),\"\")","v":""},{"$f":"IFERROR(HLOOKUP(BG$3,Pivot!$B$3:$BB$56,DataTab!$G19,FALSE),\"\")","v":""},{"$f":"IFERROR(HLOOKUP(BH$3,Pivot!$B$3:$BB$56,DataTab!$G19,FALSE),\"\")","v":""},null,""]
["Kansas",2009,26,5,null,{"$f":"IF(ISBLANK(E20),\"\",VLOOKUP(E20,StateListAbbrev!$A$2:$B$53,2,FALSE))","v":""},{"$f":"IF(ISBLANK(E20),\"\",VLOOKUP(F20,'2012'!$A$10:$B$62,2,FALSE))","v":""},null,{"$f":"IFERROR(HLOOKUP(I$3,Pivot!$B$3:$BB$56,DataTab!$G20,FALSE),\"\")","v":""},{"$f":"IFERROR(HLOOKUP(J$3,Pivot!$B$3:$BB$56,DataTab!$G20,FALSE),\"\")","v":""},{"$f":"IFERROR(HLOOKUP(K$3,Pivot!$B$3:$BB$56,DataTab!$G20,FALSE),\"\")","v":""},{"$f":"IFERROR(HLOOKUP(L$3,Pivot!$B$3:$BB$56,DataTab!$G20,FALSE),\"\")","v":""},{"$f":"IFERROR(HLOOKUP(M$3,Pivot!$B$3:$BB$56,DataTab!$G20,FALSE),\"\")","v":""},{"$f":"IFERROR(HLOOKUP(N$3,Pivot!$B$3:$BB$56,DataTab!$G20,FALSE),\"\")","v":""},{"$f":"IFERROR(HLOOKUP(O$3,Pivot!$B$3:$BB$56,DataTab!$G20,FALSE),\"\")","v":""},{"$f":"IFERROR(HLOOKUP(P$3,Pivot!$B$3:$BB$56,DataTab!$G20,FALSE),\"\")","v":""},{"$f":"IFERROR(HLOOKUP(Q$3,Pivot!$B$3:$BB$56,DataTab!$G20,FALSE),\"\")","v":""},{"$f":"IFERROR(HLOOKUP(R$3,Pivot!$B$3:$BB$56,DataTab!$G20,FALSE),\"\")","v":""},{"$f":"IFERROR(HLOOKUP(S$3,Pivot!$B$3:$BB$56,DataTab!$G20,FALSE),\"\")","v":""},{"$f":"IFERROR(HLOOKUP(T$3,Pivot!$B$3:$BB$56,DataTab!$G20,FALSE),\"\")","v":""},{"$f":"IFERROR(HLOOKUP(U$3,Pivot!$B$3:$BB$56,DataTab!$G20,FALSE),\"\")","v":""},{"$f":"IFERROR(HLOOKUP(V$3,Pivot!$B$3:$BB$56,DataTab!$G20,FALSE),\"\")","v":""},{"$f":"IFERROR(HLOOKUP(W$3,Pivot!$B$3:$BB$56,DataTab!$G20,FALSE),\"\")","v":""},{"$f":"IFERROR(HLOOKUP(X$3,Pivot!$B$3:$BB$56,DataTab!$G20,FALSE),\"\")","v":""},{"$f":"IFERROR(HLOOKUP(Y$3,Pivot!$B$3:$BB$56,DataTab!$G20,FALSE),\"\")","v":""},{"$f":"IFERROR(HLOOKUP(Z$3,Pivot!$B$3:$BB$56,DataTab!$G20,FALSE),\"\")","v":""},{"$f":"IFERROR(HLOOKUP(AA$3,Pivot!$B$3:$BB$56,DataTab!$G20,FALSE),\"\")","v":""},{"$f":"IFERROR(HLOOKUP(AB$3,Pivot!$B$3:$BB$56,DataTab!$G20,FALSE),\"\")","v":""},{"$f":"IFERROR(HLOOKUP(AC$3,Pivot!$B$3:$BB$56,DataTab!$G20,FALSE),\"\")","v":""},{"$f":"IFERROR(HLOOKUP(AD$3,Pivot!$B$3:$BB$56,DataTab!$G20,FALSE),\"\")","v":""},{"$f":"IFERROR(HLOOKUP(AE$3,Pivot!$B$3:$BB$56,DataTab!$G20,FALSE),\"\")","v":""},{"$f":"IFERROR(HLOOKUP(AF$3,Pivot!$B$3:$BB$56,DataTab!$G20,FALSE),\"\")","v":""},{"$f":"IFERROR(HLOOKUP(AG$3,Pivot!$B$3:$BB$56,DataTab!$G20,FALSE),\"\")","v":""},{"$f":"IFERROR(HLOOKUP(AH$3,Pivot!$B$3:$BB$56,DataTab!$G20,FALSE),\"\")","v":""},{"$f":"IFERROR(HLOOKUP(AI$3,Pivot!$B$3:$BB$56,DataTab!$G20,FALSE),\"\")","v":""},{"$f":"IFERROR(HLOOKUP(AJ$3,Pivot!$B$3:$BB$56,DataTab!$G20,FALSE),\"\")","v":""},{"$f":"IFERROR(HLOOKUP(AK$3,Pivot!$B$3:$BB$56,DataTab!$G20,FALSE),\"\")","v":""},{"$f":"IFERROR(HLOOKUP(AL$3,Pivot!$B$3:$BB$56,DataTab!$G20,FALSE),\"\")","v":""},{"$f":"IFERROR(HLOOKUP(AM$3,Pivot!$B$3:$BB$56,DataTab!$G20,FALSE),\"\")","v":""},{"$f":"IFERROR(HLOOKUP(AN$3,Pivot!$B$3:$BB$56,DataTab!$G20,FALSE),\"\")","v":""},{"$f":"IFERROR(HLOOKUP(AO$3,Pivot!$B$3:$BB$56,DataTab!$G20,FALSE),\"\")","v":""},{"$f":"IFERROR(HLOOKUP(AP$3,Pivot!$B$3:$BB$56,DataTab!$G20,FALSE),\"\")","v":""},{"$f":"IFERROR(HLOOKUP(AQ$3,Pivot!$B$3:$BB$56,DataTab!$G20,FALSE),\"\")","v":""},{"$f":"IFERROR(HLOOKUP(AR$3,Pivot!$B$3:$BB$56,DataTab!$G20,FALSE),\"\")","v":""},{"$f":"IFERROR(HLOOKUP(AS$3,Pivot!$B$3:$BB$56,DataTab!$G20,FALSE),\"\")","v":""},{"$f":"IFERROR(HLOOKUP(AT$3,Pivot!$B$3:$BB$56,DataTab!$G20,FALSE),\"\")","v":""},{"$f":"IFERROR(HLOOKUP(AU$3,Pivot!$B$3:$BB$56,DataTab!$G20,FALSE),\"\")","v":""},{"$f":"IFERROR(HLOOKUP(AV$3,Pivot!$B$3:$BB$56,DataTab!$G20,FALSE),\"\")","v":""},{"$f":"IFERROR(HLOOKUP(AW$3,Pivot!$B$3:$BB$56,DataTab!$G20,FALSE),\"\")","v":""},{"$f":"IFERROR(HLOOKUP(AX$3,Pivot!$B$3:$BB$56,DataTab!$G20,FALSE),\"\")","v":""},{"$f":"IFERROR(HLOOKUP(AY$3,Pivot!$B$3:$BB$56,DataTab!$G20,FALSE),\"\")","v":""},{"$f":"IFERROR(HLOOKUP(AZ$3,Pivot!$B$3:$BB$56,DataTab!$G20,FALSE),\"\")","v":""},{"$f":"IFERROR(HLOOKUP(BA$3,Pivot!$B$3:$BB$56,DataTab!$G20,FALSE),\"\")","v":""},{"$f":"IFERROR(HLOOKUP(BB$3,Pivot!$B$3:$BB$56,DataTab!$G20,FALSE),\"\")","v":""},{"$f":"IFERROR(HLOOKUP(BC$3,Pivot!$B$3:$BB$56,DataTab!$G20,FALSE),\"\")","v":""},{"$f":"IFERROR(HLOOKUP(BD$3,Pivot!$B$3:$BB$56,DataTab!$G20,FALSE),\"\")","v":""},{"$f":"IFERROR(HLOOKUP(BE$3,Pivot!$B$3:$BB$56,DataTab!$G20,FALSE),\"\")","v":""},{"$f":"IFERROR(HLOOKUP(BF$3,Pivot!$B$3:$BB$56,DataTab!$G20,FALSE),\"\")","v":""},{"$f":"IFERROR(HLOOKUP(BG$3,Pivot!$B$3:$BB$56,DataTab!$G20,FALSE),\"\")","v":""},{"$f":"IFERROR(HLOOKUP(BH$3,Pivot!$B$3:$BB$56,DataTab!$G20,FALSE),\"\")","v":""},null,""]
["Kentucky",2923,20,4,null,{"$f":"IF(ISBLANK(E21),\"\",VLOOKUP(E21,StateListAbbrev!$A$2:$B$53,2,FALSE))","v":""},{"$f":"IF(ISBLANK(E21),\"\",VLOOKUP(F21,'2012'!$A$10:$B$62,2,FALSE))","v":""},null,{"$f":"IFERROR(HLOOKUP(I$3,Pivot!$B$3:$BB$56,DataTab!$G21,FALSE),\"\")","v":""},{"$f":"IFERROR(HLOOKUP(J$3,Pivot!$B$3:$BB$56,DataTab!$G21,FALSE),\"\")","v":""},{"$f":"IFERROR(HLOOKUP(K$3,Pivot!$B$3:$BB$56,DataTab!$G21,FALSE),\"\")","v":""},{"$f":"IFERROR(HLOOKUP(L$3,Pivot!$B$3:$BB$56,DataTab!$G21,FALSE),\"\")","v":""},{"$f":"IFERROR(HLOOKUP(M$3,Pivot!$B$3:$BB$56,DataTab!$G21,FALSE),\"\")","v":""},{"$f":"IFERROR(HLOOKUP(N$3,Pivot!$B$3:$BB$56,DataTab!$G21,FALSE),\"\")","v":""},{"$f":"IFERROR(HLOOKUP(O$3,Pivot!$B$3:$BB$56,DataTab!$G21,FALSE),\"\")","v":""},{"$f":"IFERROR(HLOOKUP(P$3,Pivot!$B$3:$BB$56,DataTab!$G21,FALSE),\"\")","v":""},{"$f":"IFERROR(HLOOKUP(Q$3,Pivot!$B$3:$BB$56,DataTab!$G21,FALSE),\"\")","v":""},{"$f":"IFERROR(HLOOKUP(R$3,Pivot!$B$3:$BB$56,DataTab!$G21,FALSE),\"\")","v":""},{"$f":"IFERROR(HLOOKUP(S$3,Pivot!$B$3:$BB$56,DataTab!$G21,FALSE),\"\")","v":""},{"$f":"IFERROR(HLOOKUP(T$3,Pivot!$B$3:$BB$56,DataTab!$G21,FALSE),\"\")","v":""},{"$f":"IFERROR(HLOOKUP(U$3,Pivot!$B$3:$BB$56,DataTab!$G21,FALSE),\"\")","v":""},{"$f":"IFERROR(HLOOKUP(V$3,Pivot!$B$3:$BB$56,DataTab!$G21,FALSE),\"\")","v":""},{"$f":"IFERROR(HLOOKUP(W$3,Pivot!$B$3:$BB$56,DataTab!$G21,FALSE),\"\")","v":""},{"$f":"IFERROR(HLOOKUP(X$3,Pivot!$B$3:$BB$56,DataTab!$G21,FALSE),\"\")","v":""},{"$f":"IFERROR(HLOOKUP(Y$3,Pivot!$B$3:$BB$56,DataTab!$G21,FALSE),\"\")","v":""},{"$f":"IFERROR(HLOOKUP(Z$3,Pivot!$B$3:$BB$56,DataTab!$G21,FALSE),\"\")","v":""},{"$f":"IFERROR(HLOOKUP(AA$3,Pivot!$B$3:$BB$56,DataTab!$G21,FALSE),\"\")","v":""},{"$f":"IFERROR(HLOOKUP(AB$3,Pivot!$B$3:$BB$56,DataTab!$G21,FALSE),\"\")","v":""},{"$f":"IFERROR(HLOOKUP(AC$3,Pivot!$B$3:$BB$56,DataTab!$G21,FALSE),\"\")","v":""},{"$f":"IFERROR(HLOOKUP(AD$3,Pivot!$B$3:$BB$56,DataTab!$G21,FALSE),\"\")","v":""},{"$f":"IFERROR(HLOOKUP(AE$3,Pivot!$B$3:$BB$56,DataTab!$G21,FALSE),\"\")","v":""},{"$f":"IFERROR(HLOOKUP(AF$3,Pivot!$B$3:$BB$56,DataTab!$G21,FALSE),\"\")","v":""},{"$f":"IFERROR(HLOOKUP(AG$3,Pivot!$B$3:$BB$56,DataTab!$G21,FALSE),\"\")","v":""},{"$f":"IFERROR(HLOOKUP(AH$3,Pivot!$B$3:$BB$56,DataTab!$G21,FALSE),\"\")","v":""},{"$f":"IFERROR(HLOOKUP(AI$3,Pivot!$B$3:$BB$56,DataTab!$G21,FALSE),\"\")","v":""},{"$f":"IFERROR(HLOOKUP(AJ$3,Pivot!$B$3:$BB$56,DataTab!$G21,FALSE),\"\")","v":""},{"$f":"IFERROR(HLOOKUP(AK$3,Pivot!$B$3:$BB$56,DataTab!$G21,FALSE),\"\")","v":""},{"$f":"IFERROR(HLOOKUP(AL$3,Pivot!$B$3:$BB$56,DataTab!$G21,FALSE),\"\")","v":""},{"$f":"IFERROR(HLOOKUP(AM$3,Pivot!$B$3:$BB$56,DataTab!$G21,FALSE),\"\")","v":""},{"$f":"IFERROR(HLOOKUP(AN$3,Pivot!$B$3:$BB$56,DataTab!$G21,FALSE),\"\")","v":""},{"$f":"IFERROR(HLOOKUP(AO$3,Pivot!$B$3:$BB$56,DataTab!$G21,FALSE),\"\")","v":""},{"$f":"IFERROR(HLOOKUP(AP$3,Pivot!$B$3:$BB$56,DataTab!$G21,FALSE),\"\")","v":""},{"$f":"IFERROR(HLOOKUP(AQ$3,Pivot!$B$3:$BB$56,DataTab!$G21,FALSE),\"\")","v":""},{"$f":"IFERROR(HLOOKUP(AR$3,Pivot!$B$3:$BB$56,DataTab!$G21,FALSE),\"\")","v":""},{"$f":"IFERROR(HLOOKUP(AS$3,Pivot!$B$3:$BB$56,DataTab!$G21,FALSE),\"\")","v":""},{"$f":"IFERROR(HLOOKUP(AT$3,Pivot!$B$3:$BB$56,DataTab!$G21,FALSE),\"\")","v":""},{"$f":"IFERROR(HLOOKUP(AU$3,Pivot!$B$3:$BB$56,DataTab!$G21,FALSE),\"\")","v":""},{"$f":"IFERROR(HLOOKUP(AV$3,Pivot!$B$3:$BB$56,DataTab!$G21,FALSE),\"\")","v":""},{"$f":"IFERROR(HLOOKUP(AW$3,Pivot!$B$3:$BB$56,DataTab!$G21,FALSE),\"\")","v":""},{"$f":"IFERROR(HLOOKUP(AX$3,Pivot!$B$3:$BB$56,DataTab!$G21,FALSE),\"\")","v":""},{"$f":"IFERROR(HLOOKUP(AY$3,Pivot!$B$3:$BB$56,DataTab!$G21,FALSE),\"\")","v":""},{"$f":"IFERROR(HLOOKUP(AZ$3,Pivot!$B$3:$BB$56,DataTab!$G21,FALSE),\"\")","v":""},{"$f":"IFERROR(HLOOKUP(BA$3,Pivot!$B$3:$BB$56,DataTab!$G21,FALSE),\"\")","v":""},{"$f":"IFERROR(HLOOKUP(BB$3,Pivot!$B$3:$BB$56,DataTab!$G21,FALSE),\"\")","v":""},{"$f":"IFERROR(HLOOKUP(BC$3,Pivot!$B$3:$BB$56,DataTab!$G21,FALSE),\"\")","v":""},{"$f":"IFERROR(HLOOKUP(BD$3,Pivot!$B$3:$BB$56,DataTab!$G21,FALSE),\"\")","v":""},{"$f":"IFERROR(HLOOKUP(BE$3,Pivot!$B$3:$BB$56,DataTab!$G21,FALSE),\"\")","v":""},{"$f":"IFERROR(HLOOKUP(BF$3,Pivot!$B$3:$BB$56,DataTab!$G21,FALSE),\"\")","v":""},{"$f":"IFERROR(HLOOKUP(BG$3,Pivot!$B$3:$BB$56,DataTab!$G21,FALSE),\"\")","v":""},{"$f":"IFERROR(HLOOKUP(BH$3,Pivot!$B$3:$BB$56,DataTab!$G21,FALSE),\"\")","v":""},null,""]
["Louisiana",1229,35,7,null,{"$f":"IF(ISBLANK(E22),\"\",VLOOKUP(E22,StateListAbbrev!$A$2:$B$53,2,FALSE))","v":""},{"$f":"IF(ISBLANK(E22),\"\",VLOOKUP(F22,'2012'!$A$10:$B$62,2,FALSE))","v":""},null,{"$f":"IFERROR(HLOOKUP(I$3,Pivot!$B$3:$BB$56,DataTab!$G22,FALSE),\"\")","v":""},{"$f":"IFERROR(HLOOKUP(J$3,Pivot!$B$3:$BB$56,DataTab!$G22,FALSE),\"\")","v":""},{"$f":"IFERROR(HLOOKUP(K$3,Pivot!$B$3:$BB$56,DataTab!$G22,FALSE),\"\")","v":""},{"$f":"IFERROR(HLOOKUP(L$3,Pivot!$B$3:$BB$56,DataTab!$G22,FALSE),\"\")","v":""},{"$f":"IFERROR(HLOOKUP(M$3,Pivot!$B$3:$BB$56,DataTab!$G22,FALSE),\"\")","v":""},{"$f":"IFERROR(HLOOKUP(N$3,Pivot!$B$3:$BB$56,DataTab!$G22,FALSE),\"\")","v":""},{"$f":"IFERROR(HLOOKUP(O$3,Pivot!$B$3:$BB$56,DataTab!$G22,FALSE),\"\")","v":""},{"$f":"IFERROR(HLOOKUP(P$3,Pivot!$B$3:$BB$56,DataTab!$G22,FALSE),\"\")","v":""},{"$f":"IFERROR(HLOOKUP(Q$3,Pivot!$B$3:$BB$56,DataTab!$G22,FALSE),\"\")","v":""},{"$f":"IFERROR(HLOOKUP(R$3,Pivot!$B$3:$BB$56,DataTab!$G22,FALSE),\"\")","v":""},{"$f":"IFERROR(HLOOKUP(S$3,Pivot!$B$3:$BB$56,DataTab!$G22,FALSE),\"\")","v":""},{"$f":"IFERROR(HLOOKUP(T$3,Pivot!$B$3:$BB$56,DataTab!$G22,FALSE),\"\")","v":""},{"$f":"IFERROR(HLOOKUP(U$3,Pivot!$B$3:$BB$56,DataTab!$G22,FALSE),\"\")","v":""},{"$f":"IFERROR(HLOOKUP(V$3,Pivot!$B$3:$BB$56,DataTab!$G22,FALSE),\"\")","v":""},{"$f":"IFERROR(HLOOKUP(W$3,Pivot!$B$3:$BB$56,DataTab!$G22,FALSE),\"\")","v":""},{"$f":"IFERROR(HLOOKUP(X$3,Pivot!$B$3:$BB$56,DataTab!$G22,FALSE),\"\")","v":""},{"$f":"IFERROR(HLOOKUP(Y$3,Pivot!$B$3:$BB$56,DataTab!$G22,FALSE),\"\")","v":""},{"$f":"IFERROR(HLOOKUP(Z$3,Pivot!$B$3:$BB$56,DataTab!$G22,FALSE),\"\")","v":""},{"$f":"IFERROR(HLOOKUP(AA$3,Pivot!$B$3:$BB$56,DataTab!$G22,FALSE),\"\")","v":""},{"$f":"IFERROR(HLOOKUP(AB$3,Pivot!$B$3:$BB$56,DataTab!$G22,FALSE),\"\")","v":""},{"$f":"IFERROR(HLOOKUP(AC$3,Pivot!$B$3:$BB$56,DataTab!$G22,FALSE),\"\")","v":""},{"$f":"IFERROR(HLOOKUP(AD$3,Pivot!$B$3:$BB$56,DataTab!$G22,FALSE),\"\")","v":""},{"$f":"IFERROR(HLOOKUP(AE$3,Pivot!$B$3:$BB$56,DataTab!$G22,FALSE),\"\")","v":""},{"$f":"IFERROR(HLOOKUP(AF$3,Pivot!$B$3:$BB$56,DataTab!$G22,FALSE),\"\")","v":""},{"$f":"IFERROR(HLOOKUP(AG$3,Pivot!$B$3:$BB$56,DataTab!$G22,FALSE),\"\")","v":""},{"$f":"IFERROR(HLOOKUP(AH$3,Pivot!$B$3:$BB$56,DataTab!$G22,FALSE),\"\")","v":""},{"$f":"IFERROR(HLOOKUP(AI$3,Pivot!$B$3:$BB$56,DataTab!$G22,FALSE),\"\")","v":""},{"$f":"IFERROR(HLOOKUP(AJ$3,Pivot!$B$3:$BB$56,DataTab!$G22,FALSE),\"\")","v":""},{"$f":"IFERROR(HLOOKUP(AK$3,Pivot!$B$3:$BB$56,DataTab!$G22,FALSE),\"\")","v":""},{"$f":"IFERROR(HLOOKUP(AL$3,Pivot!$B$3:$BB$56,DataTab!$G22,FALSE),\"\")","v":""},{"$f":"IFERROR(HLOOKUP(AM$3,Pivot!$B$3:$BB$56,DataTab!$G22,FALSE),\"\")","v":""},{"$f":"IFERROR(HLOOKUP(AN$3,Pivot!$B$3:$BB$56,DataTab!$G22,FALSE),\"\")","v":""},{"$f":"IFERROR(HLOOKUP(AO$3,Pivot!$B$3:$BB$56,DataTab!$G22,FALSE),\"\")","v":""},{"$f":"IFERROR(HLOOKUP(AP$3,Pivot!$B$3:$BB$56,DataTab!$G22,FALSE),\"\")","v":""},{"$f":"IFERROR(HLOOKUP(AQ$3,Pivot!$B$3:$BB$56,DataTab!$G22,FALSE),\"\")","v":""},{"$f":"IFERROR(HLOOKUP(AR$3,Pivot!$B$3:$BB$56,DataTab!$G22,FALSE),\"\")","v":""},{"$f":"IFERROR(HLOOKUP(AS$3,Pivot!$B$3:$BB$56,DataTab!$G22,FALSE),\"\")","v":""},{"$f":"IFERROR(HLOOKUP(AT$3,Pivot!$B$3:$BB$56,DataTab!$G22,FALSE),\"\")","v":""},{"$f":"IFERROR(HLOOKUP(AU$3,Pivot!$B$3:$BB$56,DataTab!$G22,FALSE),\"\")","v":""},{"$f":"IFERROR(HLOOKUP(AV$3,Pivot!$B$3:$BB$56,DataTab!$G22,FALSE),\"\")","v":""},{"$f":"IFERROR(HLOOKUP(AW$3,Pivot!$B$3:$BB$56,DataTab!$G22,FALSE),\"\")","v":""},{"$f":"IFERROR(HLOOKUP(AX$3,Pivot!$B$3:$BB$56,DataTab!$G22,FALSE),\"\")","v":""},{"$f":"IFERROR(HLOOKUP(AY$3,Pivot!$B$3:$BB$56,DataTab!$G22,FALSE),\"\")","v":""},{"$f":"IFERROR(HLOOKUP(AZ$3,Pivot!$B$3:$BB$56,DataTab!$G22,FALSE),\"\")","v":""},{"$f":"IFERROR(HLOOKUP(BA$3,Pivot!$B$3:$BB$56,DataTab!$G22,FALSE),\"\")","v":""},{"$f":"IFERROR(HLOOKUP(BB$3,Pivot!$B$3:$BB$56,DataTab!$G22,FALSE),\"\")","v":""},{"$f":"IFERROR(HLOOKUP(BC$3,Pivot!$B$3:$BB$56,DataTab!$G22,FALSE),\"\")","v":""},{"$f":"IFERROR(HLOOKUP(BD$3,Pivot!$B$3:$BB$56,DataTab!$G22,FALSE),\"\")","v":""},{"$f":"IFERROR(HLOOKUP(BE$3,Pivot!$B$3:$BB$56,DataTab!$G22,FALSE),\"\")","v":""},{"$f":"IFERROR(HLOOKUP(BF$3,Pivot!$B$3:$BB$56,DataTab!$G22,FALSE),\"\")","v":""},{"$f":"IFERROR(HLOOKUP(BG$3,Pivot!$B$3:$BB$56,DataTab!$G22,FALSE),\"\")","v":""},{"$f":"IFERROR(HLOOKUP(BH$3,Pivot!$B$3:$BB$56,DataTab!$G22,FALSE),\"\")","v":""},null,""]
["Maine",526,43,9,null,{"$f":"IF(ISBLANK(E23),\"\",VLOOKUP(E23,StateListAbbrev!$A$2:$B$53,2,FALSE))","v":""},{"$f":"IF(ISBLANK(E23),\"\",VLOOKUP(F23,'2012'!$A$10:$B$62,2,FALSE))","v":""},null,{"$f":"IFERROR(HLOOKUP(I$3,Pivot!$B$3:$BB$56,DataTab!$G23,FALSE),\"\")","v":""},{"$f":"IFERROR(HLOOKUP(J$3,Pivot!$B$3:$BB$56,DataTab!$G23,FALSE),\"\")","v":""},{"$f":"IFERROR(HLOOKUP(K$3,Pivot!$B$3:$BB$56,DataTab!$G23,FALSE),\"\")","v":""},{"$f":"IFERROR(HLOOKUP(L$3,Pivot!$B$3:$BB$56,DataTab!$G23,FALSE),\"\")","v":""},{"$f":"IFERROR(HLOOKUP(M$3,Pivot!$B$3:$BB$56,DataTab!$G23,FALSE),\"\")","v":""},{"$f":"IFERROR(HLOOKUP(N$3,Pivot!$B$3:$BB$56,DataTab!$G23,FALSE),\"\")","v":""},{"$f":"IFERROR(HLOOKUP(O$3,Pivot!$B$3:$BB$56,DataTab!$G23,FALSE),\"\")","v":""},{"$f":"IFERROR(HLOOKUP(P$3,Pivot!$B$3:$BB$56,DataTab!$G23,FALSE),\"\")","v":""},{"$f":"IFERROR(HLOOKUP(Q$3,Pivot!$B$3:$BB$56,DataTab!$G23,FALSE),\"\")","v":""},{"$f":"IFERROR(HLOOKUP(R$3,Pivot!$B$3:$BB$56,DataTab!$G23,FALSE),\"\")","v":""},{"$f":"IFERROR(HLOOKUP(S$3,Pivot!$B$3:$BB$56,DataTab!$G23,FALSE),\"\")","v":""},{"$f":"IFERROR(HLOOKUP(T$3,Pivot!$B$3:$BB$56,DataTab!$G23,FALSE),\"\")","v":""},{"$f":"IFERROR(HLOOKUP(U$3,Pivot!$B$3:$BB$56,DataTab!$G23,FALSE),\"\")","v":""},{"$f":"IFERROR(HLOOKUP(V$3,Pivot!$B$3:$BB$56,DataTab!$G23,FALSE),\"\")","v":""},{"$f":"IFERROR(HLOOKUP(W$3,Pivot!$B$3:$BB$56,DataTab!$G23,FALSE),\"\")","v":""},{"$f":"IFERROR(HLOOKUP(X$3,Pivot!$B$3:$BB$56,DataTab!$G23,FALSE),\"\")","v":""},{"$f":"IFERROR(HLOOKUP(Y$3,Pivot!$B$3:$BB$56,DataTab!$G23,FALSE),\"\")","v":""},{"$f":"IFERROR(HLOOKUP(Z$3,Pivot!$B$3:$BB$56,DataTab!$G23,FALSE),\"\")","v":""},{"$f":"IFERROR(HLOOKUP(AA$3,Pivot!$B$3:$BB$56,DataTab!$G23,FALSE),\"\")","v":""},{"$f":"IFERROR(HLOOKUP(AB$3,Pivot!$B$3:$BB$56,DataTab!$G23,FALSE),\"\")","v":""},{"$f":"IFERROR(HLOOKUP(AC$3,Pivot!$B$3:$BB$56,DataTab!$G23,FALSE),\"\")","v":""},{"$f":"IFERROR(HLOOKUP(AD$3,Pivot!$B$3:$BB$56,DataTab!$G23,FALSE),\"\")","v":""},{"$f":"IFERROR(HLOOKUP(AE$3,Pivot!$B$3:$BB$56,DataTab!$G23,FALSE),\"\")","v":""},{"$f":"IFERROR(HLOOKUP(AF$3,Pivot!$B$3:$BB$56,DataTab!$G23,FALSE),\"\")","v":""},{"$f":"IFERROR(HLOOKUP(AG$3,Pivot!$B$3:$BB$56,DataTab!$G23,FALSE),\"\")","v":""},{"$f":"IFERROR(HLOOKUP(AH$3,Pivot!$B$3:$BB$56,DataTab!$G23,FALSE),\"\")","v":""},{"$f":"IFERROR(HLOOKUP(AI$3,Pivot!$B$3:$BB$56,DataTab!$G23,FALSE),\"\")","v":""},{"$f":"IFERROR(HLOOKUP(AJ$3,Pivot!$B$3:$BB$56,DataTab!$G23,FALSE),\"\")","v":""},{"$f":"IFERROR(HLOOKUP(AK$3,Pivot!$B$3:$BB$56,DataTab!$G23,FALSE),\"\")","v":""},{"$f":"IFERROR(HLOOKUP(AL$3,Pivot!$B$3:$BB$56,DataTab!$G23,FALSE),\"\")","v":""},{"$f":"IFERROR(HLOOKUP(AM$3,Pivot!$B$3:$BB$56,DataTab!$G23,FALSE),\"\")","v":""},{"$f":"IFERROR(HLOOKUP(AN$3,Pivot!$B$3:$BB$56,DataTab!$G23,FALSE),\"\")","v":""},{"$f":"IFERROR(HLOOKUP(AO$3,Pivot!$B$3:$BB$56,DataTab!$G23,FALSE),\"\")","v":""},{"$f":"IFERROR(HLOOKUP(AP$3,Pivot!$B$3:$BB$56,DataTab!$G23,FALSE),\"\")","v":""},{"$f":"IFERROR(HLOOKUP(AQ$3,Pivot!$B$3:$BB$56,DataTab!$G23,FALSE),\"\")","v":""},{"$f":"IFERROR(HLOOKUP(AR$3,Pivot!$B$3:$BB$56,DataTab!$G23,FALSE),\"\")","v":""},{"$f":"IFERROR(HLOOKUP(AS$3,Pivot!$B$3:$BB$56,DataTab!$G23,FALSE),\"\")","v":""},{"$f":"IFERROR(HLOOKUP(AT$3,Pivot!$B$3:$BB$56,DataTab!$G23,FALSE),\"\")","v":""},{"$f":"IFERROR(HLOOKUP(AU$3,Pivot!$B$3:$BB$56,DataTab!$G23,FALSE),\"\")","v":""},{"$f":"IFERROR(HLOOKUP(AV$3,Pivot!$B$3:$BB$56,DataTab!$G23,FALSE),\"\")","v":""},{"$f":"IFERROR(HLOOKUP(AW$3,Pivot!$B$3:$BB$56,DataTab!$G23,FALSE),\"\")","v":""},{"$f":"IFERROR(HLOOKUP(AX$3,Pivot!$B$3:$BB$56,DataTab!$G23,FALSE),\"\")","v":""},{"$f":"IFERROR(HLOOKUP(AY$3,Pivot!$B$3:$BB$56,DataTab!$G23,FALSE),\"\")","v":""},{"$f":"IFERROR(HLOOKUP(AZ$3,Pivot!$B$3:$BB$56,DataTab!$G23,FALSE),\"\")","v":""},{"$f":"IFERROR(HLOOKUP(BA$3,Pivot!$B$3:$BB$56,DataTab!$G23,FALSE),\"\")","v":""},{"$f":"IFERROR(HLOOKUP(BB$3,Pivot!$B$3:$BB$56,DataTab!$G23,FALSE),\"\")","v":""},{"$f":"IFERROR(HLOOKUP(BC$3,Pivot!$B$3:$BB$56,DataTab!$G23,FALSE),\"\")","v":""},{"$f":"IFERROR(HLOOKUP(BD$3,Pivot!$B$3:$BB$56,DataTab!$G23,FALSE),\"\")","v":""},{"$f":"IFERROR(HLOOKUP(BE$3,Pivot!$B$3:$BB$56,DataTab!$G23,FALSE),\"\")","v":""},{"$f":"IFERROR(HLOOKUP(BF$3,Pivot!$B$3:$BB$56,DataTab!$G23,FALSE),\"\")","v":""},{"$f":"IFERROR(HLOOKUP(BG$3,Pivot!$B$3:$BB$56,DataTab!$G23,FALSE),\"\")","v":""},{"$f":"IFERROR(HLOOKUP(BH$3,Pivot!$B$3:$BB$56,DataTab!$G23,FALSE),\"\")","v":""},null,""]
["Maryland",1865,27,6,null,{"$f":"IF(ISBLANK(E24),\"\",VLOOKUP(E24,StateListAbbrev!$A$2:$B$53,2,FALSE))","v":""},{"$f":"IF(ISBLANK(E24),\"\",VLOOKUP(F24,'2012'!$A$10:$B$62,2,FALSE))","v":""},null,{"$f":"IFERROR(HLOOKUP(I$3,Pivot!$B$3:$BB$56,DataTab!$G24,FALSE),\"\")","v":""},{"$f":"IFERROR(HLOOKUP(J$3,Pivot!$B$3:$BB$56,DataTab!$G24,FALSE),\"\")","v":""},{"$f":"IFERROR(HLOOKUP(K$3,Pivot!$B$3:$BB$56,DataTab!$G24,FALSE),\"\")","v":""},{"$f":"IFERROR(HLOOKUP(L$3,Pivot!$B$3:$BB$56,DataTab!$G24,FALSE),\"\")","v":""},{"$f":"IFERROR(HLOOKUP(M$3,Pivot!$B$3:$BB$56,DataTab!$G24,FALSE),\"\")","v":""},{"$f":"IFERROR(HLOOKUP(N$3,Pivot!$B$3:$BB$56,DataTab!$G24,FALSE),\"\")","v":""},{"$f":"IFERROR(HLOOKUP(O$3,Pivot!$B$3:$BB$56,DataTab!$G24,FALSE),\"\")","v":""},{"$f":"IFERROR(HLOOKUP(P$3,Pivot!$B$3:$BB$56,DataTab!$G24,FALSE),\"\")","v":""},{"$f":"IFERROR(HLOOKUP(Q$3,Pivot!$B$3:$BB$56,DataTab!$G24,FALSE),\"\")","v":""},{"$f":"IFERROR(HLOOKUP(R$3,Pivot!$B$3:$BB$56,DataTab!$G24,FALSE),\"\")","v":""},{"$f":"IFERROR(HLOOKUP(S$3,Pivot!$B$3:$BB$56,DataTab!$G24,FALSE),\"\")","v":""},{"$f":"IFERROR(HLOOKUP(T$3,Pivot!$B$3:$BB$56,DataTab!$G24,FALSE),\"\")","v":""},{"$f":"IFERROR(HLOOKUP(U$3,Pivot!$B$3:$BB$56,DataTab!$G24,FALSE),\"\")","v":""},{"$f":"IFERROR(HLOOKUP(V$3,Pivot!$B$3:$BB$56,DataTab!$G24,FALSE),\"\")","v":""},{"$f":"IFERROR(HLOOKUP(W$3,Pivot!$B$3:$BB$56,DataTab!$G24,FALSE),\"\")","v":""},{"$f":"IFERROR(HLOOKUP(X$3,Pivot!$B$3:$BB$56,DataTab!$G24,FALSE),\"\")","v":""},{"$f":"IFERROR(HLOOKUP(Y$3,Pivot!$B$3:$BB$56,DataTab!$G24,FALSE),\"\")","v":""},{"$f":"IFERROR(HLOOKUP(Z$3,Pivot!$B$3:$BB$56,DataTab!$G24,FALSE),\"\")","v":""},{"$f":"IFERROR(HLOOKUP(AA$3,Pivot!$B$3:$BB$56,DataTab!$G24,FALSE),\"\")","v":""},{"$f":"IFERROR(HLOOKUP(AB$3,Pivot!$B$3:$BB$56,DataTab!$G24,FALSE),\"\")","v":""},{"$f":"IFERROR(HLOOKUP(AC$3,Pivot!$B$3:$BB$56,DataTab!$G24,FALSE),\"\")","v":""},{"$f":"IFERROR(HLOOKUP(AD$3,Pivot!$B$3:$BB$56,DataTab!$G24,FALSE),\"\")","v":""},{"$f":"IFERROR(HLOOKUP(AE$3,Pivot!$B$3:$BB$56,DataTab!$G24,FALSE),\"\")","v":""},{"$f":"IFERROR(HLOOKUP(AF$3,Pivot!$B$3:$BB$56,DataTab!$G24,FALSE),\"\")","v":""},{"$f":"IFERROR(HLOOKUP(AG$3,Pivot!$B$3:$BB$56,DataTab!$G24,FALSE),\"\")","v":""},{"$f":"IFERROR(HLOOKUP(AH$3,Pivot!$B$3:$BB$56,DataTab!$G24,FALSE),\"\")","v":""},{"$f":"IFERROR(HLOOKUP(AI$3,Pivot!$B$3:$BB$56,DataTab!$G24,FALSE),\"\")","v":""},{"$f":"IFERROR(HLOOKUP(AJ$3,Pivot!$B$3:$BB$56,DataTab!$G24,FALSE),\"\")","v":""},{"$f":"IFERROR(HLOOKUP(AK$3,Pivot!$B$3:$BB$56,DataTab!$G24,FALSE),\"\")","v":""},{"$f":"IFERROR(HLOOKUP(AL$3,Pivot!$B$3:$BB$56,DataTab!$G24,FALSE),\"\")","v":""},{"$f":"IFERROR(HLOOKUP(AM$3,Pivot!$B$3:$BB$56,DataTab!$G24,FALSE),\"\")","v":""},{"$f":"IFERROR(HLOOKUP(AN$3,Pivot!$B$3:$BB$56,DataTab!$G24,FALSE),\"\")","v":""},{"$f":"IFERROR(HLOOKUP(AO$3,Pivot!$B$3:$BB$56,DataTab!$G24,FALSE),\"\")","v":""},{"$f":"IFERROR(HLOOKUP(AP$3,Pivot!$B$3:$BB$56,DataTab!$G24,FALSE),\"\")","v":""},{"$f":"IFERROR(HLOOKUP(AQ$3,Pivot!$B$3:$BB$56,DataTab!$G24,FALSE),\"\")","v":""},{"$f":"IFERROR(HLOOKUP(AR$3,Pivot!$B$3:$BB$56,DataTab!$G24,FALSE),\"\")","v":""},{"$f":"IFERROR(HLOOKUP(AS$3,Pivot!$B$3:$BB$56,DataTab!$G24,FALSE),\"\")","v":""},{"$f":"IFERROR(HLOOKUP(AT$3,Pivot!$B$3:$BB$56,DataTab!$G24,FALSE),\"\")","v":""},{"$f":"IFERROR(HLOOKUP(AU$3,Pivot!$B$3:$BB$56,DataTab!$G24,FALSE),\"\")","v":""},{"$f":"IFERROR(HLOOKUP(AV$3,Pivot!$B$3:$BB$56,DataTab!$G24,FALSE),\"\")","v":""},{"$f":"IFERROR(HLOOKUP(AW$3,Pivot!$B$3:$BB$56,DataTab!$G24,FALSE),\"\")","v":""},{"$f":"IFERROR(HLOOKUP(AX$3,Pivot!$B$3:$BB$56,DataTab!$G24,FALSE),\"\")","v":""},{"$f":"IFERROR(HLOOKUP(AY$3,Pivot!$B$3:$BB$56,DataTab!$G24,FALSE),\"\")","v":""},{"$f":"IFERROR(HLOOKUP(AZ$3,Pivot!$B$3:$BB$56,DataTab!$G24,FALSE),\"\")","v":""},{"$f":"IFERROR(HLOOKUP(BA$3,Pivot!$B$3:$BB$56,DataTab!$G24,FALSE),\"\")","v":""},{"$f":"IFERROR(HLOOKUP(BB$3,Pivot!$B$3:$BB$56,DataTab!$G24,FALSE),\"\")","v":""},{"$f":"IFERROR(HLOOKUP(BC$3,Pivot!$B$3:$BB$56,DataTab!$G24,FALSE),\"\")","v":""},{"$f":"IFERROR(HLOOKUP(BD$3,Pivot!$B$3:$BB$56,DataTab!$G24,FALSE),\"\")","v":""},{"$f":"IFERROR(HLOOKUP(BE$3,Pivot!$B$3:$BB$56,DataTab!$G24,FALSE),\"\")","v":""},{"$f":"IFERROR(HLOOKUP(BF$3,Pivot!$B$3:$BB$56,DataTab!$G24,FALSE),\"\")","v":""},{"$f":"IFERROR(HLOOKUP(BG$3,Pivot!$B$3:$BB$56,DataTab!$G24,FALSE),\"\")","v":""},{"$f":"IFERROR(HLOOKUP(BH$3,Pivot!$B$3:$BB$56,DataTab!$G24,FALSE),\"\")","v":""},null,""]
["Massachusetts",3296,18,4,null,{"$f":"IF(ISBLANK(E25),\"\",VLOOKUP(E25,StateListAbbrev!$A$2:$B$53,2,FALSE))","v":""},{"$f":"IF(ISBLANK(E25),\"\",VLOOKUP(F25,'2012'!$A$10:$B$62,2,FALSE))","v":""},null,{"$f":"IFERROR(HLOOKUP(I$3,Pivot!$B$3:$BB$56,DataTab!$G25,FALSE),\"\")","v":""},{"$f":"IFERROR(HLOOKUP(J$3,Pivot!$B$3:$BB$56,DataTab!$G25,FALSE),\"\")","v":""},{"$f":"IFERROR(HLOOKUP(K$3,Pivot!$B$3:$BB$56,DataTab!$G25,FALSE),\"\")","v":""},{"$f":"IFERROR(HLOOKUP(L$3,Pivot!$B$3:$BB$56,DataTab!$G25,FALSE),\"\")","v":""},{"$f":"IFERROR(HLOOKUP(M$3,Pivot!$B$3:$BB$56,DataTab!$G25,FALSE),\"\")","v":""},{"$f":"IFERROR(HLOOKUP(N$3,Pivot!$B$3:$BB$56,DataTab!$G25,FALSE),\"\")","v":""},{"$f":"IFERROR(HLOOKUP(O$3,Pivot!$B$3:$BB$56,DataTab!$G25,FALSE),\"\")","v":""},{"$f":"IFERROR(HLOOKUP(P$3,Pivot!$B$3:$BB$56,DataTab!$G25,FALSE),\"\")","v":""},{"$f":"IFERROR(HLOOKUP(Q$3,Pivot!$B$3:$BB$56,DataTab!$G25,FALSE),\"\")","v":""},{"$f":"IFERROR(HLOOKUP(R$3,Pivot!$B$3:$BB$56,DataTab!$G25,FALSE),\"\")","v":""},{"$f":"IFERROR(HLOOKUP(S$3,Pivot!$B$3:$BB$56,DataTab!$G25,FALSE),\"\")","v":""},{"$f":"IFERROR(HLOOKUP(T$3,Pivot!$B$3:$BB$56,DataTab!$G25,FALSE),\"\")","v":""},{"$f":"IFERROR(HLOOKUP(U$3,Pivot!$B$3:$BB$56,DataTab!$G25,FALSE),\"\")","v":""},{"$f":"IFERROR(HLOOKUP(V$3,Pivot!$B$3:$BB$56,DataTab!$G25,FALSE),\"\")","v":""},{"$f":"IFERROR(HLOOKUP(W$3,Pivot!$B$3:$BB$56,DataTab!$G25,FALSE),\"\")","v":""},{"$f":"IFERROR(HLOOKUP(X$3,Pivot!$B$3:$BB$56,DataTab!$G25,FALSE),\"\")","v":""},{"$f":"IFERROR(HLOOKUP(Y$3,Pivot!$B$3:$BB$56,DataTab!$G25,FALSE),\"\")","v":""},{"$f":"IFERROR(HLOOKUP(Z$3,Pivot!$B$3:$BB$56,DataTab!$G25,FALSE),\"\")","v":""},{"$f":"IFERROR(HLOOKUP(AA$3,Pivot!$B$3:$BB$56,DataTab!$G25,FALSE),\"\")","v":""},{"$f":"IFERROR(HLOOKUP(AB$3,Pivot!$B$3:$BB$56,DataTab!$G25,FALSE),\"\")","v":""},{"$f":"IFERROR(HLOOKUP(AC$3,Pivot!$B$3:$BB$56,DataTab!$G25,FALSE),\"\")","v":""},{"$f":"IFERROR(HLOOKUP(AD$3,Pivot!$B$3:$BB$56,DataTab!$G25,FALSE),\"\")","v":""},{"$f":"IFERROR(HLOOKUP(AE$3,Pivot!$B$3:$BB$56,DataTab!$G25,FALSE),\"\")","v":""},{"$f":"IFERROR(HLOOKUP(AF$3,Pivot!$B$3:$BB$56,DataTab!$G25,FALSE),\"\")","v":""},{"$f":"IFERROR(HLOOKUP(AG$3,Pivot!$B$3:$BB$56,DataTab!$G25,FALSE),\"\")","v":""},{"$f":"IFERROR(HLOOKUP(AH$3,Pivot!$B$3:$BB$56,DataTab!$G25,FALSE),\"\")","v":""},{"$f":"IFERROR(HLOOKUP(AI$3,Pivot!$B$3:$BB$56,DataTab!$G25,FALSE),\"\")","v":""},{"$f":"IFERROR(HLOOKUP(AJ$3,Pivot!$B$3:$BB$56,DataTab!$G25,FALSE),\"\")","v":""},{"$f":"IFERROR(HLOOKUP(AK$3,Pivot!$B$3:$BB$56,DataTab!$G25,FALSE),\"\")","v":""},{"$f":"IFERROR(HLOOKUP(AL$3,Pivot!$B$3:$BB$56,DataTab!$G25,FALSE),\"\")","v":""},{"$f":"IFERROR(HLOOKUP(AM$3,Pivot!$B$3:$BB$56,DataTab!$G25,FALSE),\"\")","v":""},{"$f":"IFERROR(HLOOKUP(AN$3,Pivot!$B$3:$BB$56,DataTab!$G25,FALSE),\"\")","v":""},{"$f":"IFERROR(HLOOKUP(AO$3,Pivot!$B$3:$BB$56,DataTab!$G25,FALSE),\"\")","v":""},{"$f":"IFERROR(HLOOKUP(AP$3,Pivot!$B$3:$BB$56,DataTab!$G25,FALSE),\"\")","v":""},{"$f":"IFERROR(HLOOKUP(AQ$3,Pivot!$B$3:$BB$56,DataTab!$G25,FALSE),\"\")","v":""},{"$f":"IFERROR(HLOOKUP(AR$3,Pivot!$B$3:$BB$56,DataTab!$G25,FALSE),\"\")","v":""},{"$f":"IFERROR(HLOOKUP(AS$3,Pivot!$B$3:$BB$56,DataTab!$G25,FALSE),\"\")","v":""},{"$f":"IFERROR(HLOOKUP(AT$3,Pivot!$B$3:$BB$56,DataTab!$G25,FALSE),\"\")","v":""},{"$f":"IFERROR(HLOOKUP(AU$3,Pivot!$B$3:$BB$56,DataTab!$G25,FALSE),\"\")","v":""},{"$f":"IFERROR(HLOOKUP(AV$3,Pivot!$B$3:$BB$56,DataTab!$G25,FALSE),\"\")","v":""},{"$f":"IFERROR(HLOOKUP(AW$3,Pivot!$B$3:$BB$56,DataTab!$G25,FALSE),\"\")","v":""},{"$f":"IFERROR(HLOOKUP(AX$3,Pivot!$B$3:$BB$56,DataTab!$G25,FALSE),\"\")","v":""},{"$f":"IFERROR(HLOOKUP(AY$3,Pivot!$B$3:$BB$56,DataTab!$G25,FALSE),\"\")","v":""},{"$f":"IFERROR(HLOOKUP(AZ$3,Pivot!$B$3:$BB$56,DataTab!$G25,FALSE),\"\")","v":""},{"$f":"IFERROR(HLOOKUP(BA$3,Pivot!$B$3:$BB$56,DataTab!$G25,FALSE),\"\")","v":""},{"$f":"IFERROR(HLOOKUP(BB$3,Pivot!$B$3:$BB$56,DataTab!$G25,FALSE),\"\")","v":""},{"$f":"IFERROR(HLOOKUP(BC$3,Pivot!$B$3:$BB$56,DataTab!$G25,FALSE),\"\")","v":""},{"$f":"IFERROR(HLOOKUP(BD$3,Pivot!$B$3:$BB$56,DataTab!$G25,FALSE),\"\")","v":""},{"$f":"IFERROR(HLOOKUP(BE$3,Pivot!$B$3:$BB$56,DataTab!$G25,FALSE),\"\")","v":""},{"$f":"IFERROR(HLOOKUP(BF$3,Pivot!$B$3:$BB$56,DataTab!$G25,FALSE),\"\")","v":""},{"$f":"IFERROR(HLOOKUP(BG$3,Pivot!$B$3:$BB$56,DataTab!$G25,FALSE),\"\")","v":""},{"$f":"IFERROR(HLOOKUP(BH$3,Pivot!$B$3:$BB$56,DataTab!$G25,FALSE),\"\")","v":""},null,""]
["Michigan",12583,7,2,null,{"$f":"IF(ISBLANK(E26),\"\",VLOOKUP(E26,StateListAbbrev!$A$2:$B$53,2,FALSE))","v":""},{"$f":"IF(ISBLANK(E26),\"\",VLOOKUP(F26,'2012'!$A$10:$B$62,2,FALSE))","v":""},null,{"$f":"IFERROR(HLOOKUP(I$3,Pivot!$B$3:$BB$56,DataTab!$G26,FALSE),\"\")","v":""},{"$f":"IFERROR(HLOOKUP(J$3,Pivot!$B$3:$BB$56,DataTab!$G26,FALSE),\"\")","v":""},{"$f":"IFERROR(HLOOKUP(K$3,Pivot!$B$3:$BB$56,DataTab!$G26,FALSE),\"\")","v":""},{"$f":"IFERROR(HLOOKUP(L$3,Pivot!$B$3:$BB$56,DataTab!$G26,FALSE),\"\")","v":""},{"$f":"IFERROR(HLOOKUP(M$3,Pivot!$B$3:$BB$56,DataTab!$G26,FALSE),\"\")","v":""},{"$f":"IFERROR(HLOOKUP(N$3,Pivot!$B$3:$BB$56,DataTab!$G26,FALSE),\"\")","v":""},{"$f":"IFERROR(HLOOKUP(O$3,Pivot!$B$3:$BB$56,DataTab!$G26,FALSE),\"\")","v":""},{"$f":"IFERROR(HLOOKUP(P$3,Pivot!$B$3:$BB$56,DataTab!$G26,FALSE),\"\")","v":""},{"$f":"IFERROR(HLOOKUP(Q$3,Pivot!$B$3:$BB$56,DataTab!$G26,FALSE),\"\")","v":""},{"$f":"IFERROR(HLOOKUP(R$3,Pivot!$B$3:$BB$56,DataTab!$G26,FALSE),\"\")","v":""},{"$f":"IFERROR(HLOOKUP(S$3,Pivot!$B$3:$BB$56,DataTab!$G26,FALSE),\"\")","v":""},{"$f":"IFERROR(HLOOKUP(T$3,Pivot!$B$3:$BB$56,DataTab!$G26,FALSE),\"\")","v":""},{"$f":"IFERROR(HLOOKUP(U$3,Pivot!$B$3:$BB$56,DataTab!$G26,FALSE),\"\")","v":""},{"$f":"IFERROR(HLOOKUP(V$3,Pivot!$B$3:$BB$56,DataTab!$G26,FALSE),\"\")","v":""},{"$f":"IFERROR(HLOOKUP(W$3,Pivot!$B$3:$BB$56,DataTab!$G26,FALSE),\"\")","v":""},{"$f":"IFERROR(HLOOKUP(X$3,Pivot!$B$3:$BB$56,DataTab!$G26,FALSE),\"\")","v":""},{"$f":"IFERROR(HLOOKUP(Y$3,Pivot!$B$3:$BB$56,DataTab!$G26,FALSE),\"\")","v":""},{"$f":"IFERROR(HLOOKUP(Z$3,Pivot!$B$3:$BB$56,DataTab!$G26,FALSE),\"\")","v":""},{"$f":"IFERROR(HLOOKUP(AA$3,Pivot!$B$3:$BB$56,DataTab!$G26,FALSE),\"\")","v":""},{"$f":"IFERROR(HLOOKUP(AB$3,Pivot!$B$3:$BB$56,DataTab!$G26,FALSE),\"\")","v":""},{"$f":"IFERROR(HLOOKUP(AC$3,Pivot!$B$3:$BB$56,DataTab!$G26,FALSE),\"\")","v":""},{"$f":"IFERROR(HLOOKUP(AD$3,Pivot!$B$3:$BB$56,DataTab!$G26,FALSE),\"\")","v":""},{"$f":"IFERROR(HLOOKUP(AE$3,Pivot!$B$3:$BB$56,DataTab!$G26,FALSE),\"\")","v":""},{"$f":"IFERROR(HLOOKUP(AF$3,Pivot!$B$3:$BB$56,DataTab!$G26,FALSE),\"\")","v":""},{"$f":"IFERROR(HLOOKUP(AG$3,Pivot!$B$3:$BB$56,DataTab!$G26,FALSE),\"\")","v":""},{"$f":"IFERROR(HLOOKUP(AH$3,Pivot!$B$3:$BB$56,DataTab!$G26,FALSE),\"\")","v":""},{"$f":"IFERROR(HLOOKUP(AI$3,Pivot!$B$3:$BB$56,DataTab!$G26,FALSE),\"\")","v":""},{"$f":"IFERROR(HLOOKUP(AJ$3,Pivot!$B$3:$BB$56,DataTab!$G26,FALSE),\"\")","v":""},{"$f":"IFERROR(HLOOKUP(AK$3,Pivot!$B$3:$BB$56,DataTab!$G26,FALSE),\"\")","v":""},{"$f":"IFERROR(HLOOKUP(AL$3,Pivot!$B$3:$BB$56,DataTab!$G26,FALSE),\"\")","v":""},{"$f":"IFERROR(HLOOKUP(AM$3,Pivot!$B$3:$BB$56,DataTab!$G26,FALSE),\"\")","v":""},{"$f":"IFERROR(HLOOKUP(AN$3,Pivot!$B$3:$BB$56,DataTab!$G26,FALSE),\"\")","v":""},{"$f":"IFERROR(HLOOKUP(AO$3,Pivot!$B$3:$BB$56,DataTab!$G26,FALSE),\"\")","v":""},{"$f":"IFERROR(HLOOKUP(AP$3,Pivot!$B$3:$BB$56,DataTab!$G26,FALSE),\"\")","v":""},{"$f":"IFERROR(HLOOKUP(AQ$3,Pivot!$B$3:$BB$56,DataTab!$G26,FALSE),\"\")","v":""},{"$f":"IFERROR(HLOOKUP(AR$3,Pivot!$B$3:$BB$56,DataTab!$G26,FALSE),\"\")","v":""},{"$f":"IFERROR(HLOOKUP(AS$3,Pivot!$B$3:$BB$56,DataTab!$G26,FALSE),\"\")","v":""},{"$f":"IFERROR(HLOOKUP(AT$3,Pivot!$B$3:$BB$56,DataTab!$G26,FALSE),\"\")","v":""},{"$f":"IFERROR(HLOOKUP(AU$3,Pivot!$B$3:$BB$56,DataTab!$G26,FALSE),\"\")","v":""},{"$f":"IFERROR(HLOOKUP(AV$3,Pivot!$B$3:$BB$56,DataTab!$G26,FALSE),\"\")","v":""},{"$f":"IFERROR(HLOOKUP(AW$3,Pivot!$B$3:$BB$56,DataTab!$G26,FALSE),\"\")","v":""},{"$f":"IFERROR(HLOOKUP(AX$3,Pivot!$B$3:$BB$56,DataTab!$G26,FALSE),\"\")","v":""},{"$f":"IFERROR(HLOOKUP(AY$3,Pivot!$B$3:$BB$56,DataTab!$G26,FALSE),\"\")","v":""},{"$f":"IFERROR(HLOOKUP(AZ$3,Pivot!$B$3:$BB$56,DataTab!$G26,FALSE),\"\")","v":""},{"$f":"IFERROR(HLOOKUP(BA$3,Pivot!$B$3:$BB$56,DataTab!$G26,FALSE),\"\")","v":""},{"$f":"IFERROR(HLOOKUP(BB$3,Pivot!$B$3:$BB$56,DataTab!$G26,FALSE),\"\")","v":""},{"$f":"IFERROR(HLOOKUP(BC$3,Pivot!$B$3:$BB$56,DataTab!$G26,FALSE),\"\")","v":""},{"$f":"IFERROR(HLOOKUP(BD$3,Pivot!$B$3:$BB$56,DataTab!$G26,FALSE),\"\")","v":""},{"$f":"IFERROR(HLOOKUP(BE$3,Pivot!$B$3:$BB$56,DataTab!$G26,FALSE),\"\")","v":""},{"$f":"IFERROR(HLOOKUP(BF$3,Pivot!$B$3:$BB$56,DataTab!$G26,FALSE),\"\")","v":""},{"$f":"IFERROR(HLOOKUP(BG$3,Pivot!$B$3:$BB$56,DataTab!$G26,FALSE),\"\")","v":""},{"$f":"IFERROR(HLOOKUP(BH$3,Pivot!$B$3:$BB$56,DataTab!$G26,FALSE),\"\")","v":""},null,""]
["Minnesota",6537,13,3,null,{"$f":"IF(ISBLANK(E27),\"\",VLOOKUP(E27,StateListAbbrev!$A$2:$B$53,2,FALSE))","v":""},{"$f":"IF(ISBLANK(E27),\"\",VLOOKUP(F27,'2012'!$A$10:$B$62,2,FALSE))","v":""},null,{"$f":"IFERROR(HLOOKUP(I$3,Pivot!$B$3:$BB$56,DataTab!$G27,FALSE),\"\")","v":""},{"$f":"IFERROR(HLOOKUP(J$3,Pivot!$B$3:$BB$56,DataTab!$G27,FALSE),\"\")","v":""},{"$f":"IFERROR(HLOOKUP(K$3,Pivot!$B$3:$BB$56,DataTab!$G27,FALSE),\"\")","v":""},{"$f":"IFERROR(HLOOKUP(L$3,Pivot!$B$3:$BB$56,DataTab!$G27,FALSE),\"\")","v":""},{"$f":"IFERROR(HLOOKUP(M$3,Pivot!$B$3:$BB$56,DataTab!$G27,FALSE),\"\")","v":""},{"$f":"IFERROR(HLOOKUP(N$3,Pivot!$B$3:$BB$56,DataTab!$G27,FALSE),\"\")","v":""},{"$f":"IFERROR(HLOOKUP(O$3,Pivot!$B$3:$BB$56,DataTab!$G27,FALSE),\"\")","v":""},{"$f":"IFERROR(HLOOKUP(P$3,Pivot!$B$3:$BB$56,DataTab!$G27,FALSE),\"\")","v":""},{"$f":"IFERROR(HLOOKUP(Q$3,Pivot!$B$3:$BB$56,DataTab!$G27,FALSE),\"\")","v":""},{"$f":"IFERROR(HLOOKUP(R$3,Pivot!$B$3:$BB$56,DataTab!$G27,FALSE),\"\")","v":""},{"$f":"IFERROR(HLOOKUP(S$3,Pivot!$B$3:$BB$56,DataTab!$G27,FALSE),\"\")","v":""},{"$f":"IFERROR(HLOOKUP(T$3,Pivot!$B$3:$BB$56,DataTab!$G27,FALSE),\"\")","v":""},{"$f":"IFERROR(HLOOKUP(U$3,Pivot!$B$3:$BB$56,DataTab!$G27,FALSE),\"\")","v":""},{"$f":"IFERROR(HLOOKUP(V$3,Pivot!$B$3:$BB$56,DataTab!$G27,FALSE),\"\")","v":""},{"$f":"IFERROR(HLOOKUP(W$3,Pivot!$B$3:$BB$56,DataTab!$G27,FALSE),\"\")","v":""},{"$f":"IFERROR(HLOOKUP(X$3,Pivot!$B$3:$BB$56,DataTab!$G27,FALSE),\"\")","v":""},{"$f":"IFERROR(HLOOKUP(Y$3,Pivot!$B$3:$BB$56,DataTab!$G27,FALSE),\"\")","v":""},{"$f":"IFERROR(HLOOKUP(Z$3,Pivot!$B$3:$BB$56,DataTab!$G27,FALSE),\"\")","v":""},{"$f":"IFERROR(HLOOKUP(AA$3,Pivot!$B$3:$BB$56,DataTab!$G27,FALSE),\"\")","v":""},{"$f":"IFERROR(HLOOKUP(AB$3,Pivot!$B$3:$BB$56,DataTab!$G27,FALSE),\"\")","v":""},{"$f":"IFERROR(HLOOKUP(AC$3,Pivot!$B$3:$BB$56,DataTab!$G27,FALSE),\"\")","v":""},{"$f":"IFERROR(HLOOKUP(AD$3,Pivot!$B$3:$BB$56,DataTab!$G27,FALSE),\"\")","v":""},{"$f":"IFERROR(HLOOKUP(AE$3,Pivot!$B$3:$BB$56,DataTab!$G27,FALSE),\"\")","v":""},{"$f":"IFERROR(HLOOKUP(AF$3,Pivot!$B$3:$BB$56,DataTab!$G27,FALSE),\"\")","v":""},{"$f":"IFERROR(HLOOKUP(AG$3,Pivot!$B$3:$BB$56,DataTab!$G27,FALSE),\"\")","v":""},{"$f":"IFERROR(HLOOKUP(AH$3,Pivot!$B$3:$BB$56,DataTab!$G27,FALSE),\"\")","v":""},{"$f":"IFERROR(HLOOKUP(AI$3,Pivot!$B$3:$BB$56,DataTab!$G27,FALSE),\"\")","v":""},{"$f":"IFERROR(HLOOKUP(AJ$3,Pivot!$B$3:$BB$56,DataTab!$G27,FALSE),\"\")","v":""},{"$f":"IFERROR(HLOOKUP(AK$3,Pivot!$B$3:$BB$56,DataTab!$G27,FALSE),\"\")","v":""},{"$f":"IFERROR(HLOOKUP(AL$3,Pivot!$B$3:$BB$56,DataTab!$G27,FALSE),\"\")","v":""},{"$f":"IFERROR(HLOOKUP(AM$3,Pivot!$B$3:$BB$56,DataTab!$G27,FALSE),\"\")","v":""},{"$f":"IFERROR(HLOOKUP(AN$3,Pivot!$B$3:$BB$56,DataTab!$G27,FALSE),\"\")","v":""},{"$f":"IFERROR(HLOOKUP(AO$3,Pivot!$B$3:$BB$56,DataTab!$G27,FALSE),\"\")","v":""},{"$f":"IFERROR(HLOOKUP(AP$3,Pivot!$B$3:$BB$56,DataTab!$G27,FALSE),\"\")","v":""},{"$f":"IFERROR(HLOOKUP(AQ$3,Pivot!$B$3:$BB$56,DataTab!$G27,FALSE),\"\")","v":""},{"$f":"IFERROR(HLOOKUP(AR$3,Pivot!$B$3:$BB$56,DataTab!$G27,FALSE),\"\")","v":""},{"$f":"IFERROR(HLOOKUP(AS$3,Pivot!$B$3:$BB$56,DataTab!$G27,FALSE),\"\")","v":""},{"$f":"IFERROR(HLOOKUP(AT$3,Pivot!$B$3:$BB$56,DataTab!$G27,FALSE),\"\")","v":""},{"$f":"IFERROR(HLOOKUP(AU$3,Pivot!$B$3:$BB$56,DataTab!$G27,FALSE),\"\")","v":""},{"$f":"IFERROR(HLOOKUP(AV$3,Pivot!$B$3:$BB$56,DataTab!$G27,FALSE),\"\")","v":""},{"$f":"IFERROR(HLOOKUP(AW$3,Pivot!$B$3:$BB$56,DataTab!$G27,FALSE),\"\")","v":""},{"$f":"IFERROR(HLOOKUP(AX$3,Pivot!$B$3:$BB$56,DataTab!$G27,FALSE),\"\")","v":""},{"$f":"IFERROR(HLOOKUP(AY$3,Pivot!$B$3:$BB$56,DataTab!$G27,FALSE),\"\")","v":""},{"$f":"IFERROR(HLOOKUP(AZ$3,Pivot!$B$3:$BB$56,DataTab!$G27,FALSE),\"\")","v":""},{"$f":"IFERROR(HLOOKUP(BA$3,Pivot!$B$3:$BB$56,DataTab!$G27,FALSE),\"\")","v":""},{"$f":"IFERROR(HLOOKUP(BB$3,Pivot!$B$3:$BB$56,DataTab!$G27,FALSE),\"\")","v":""},{"$f":"IFERROR(HLOOKUP(BC$3,Pivot!$B$3:$BB$56,DataTab!$G27,FALSE),\"\")","v":""},{"$f":"IFERROR(HLOOKUP(BD$3,Pivot!$B$3:$BB$56,DataTab!$G27,FALSE),\"\")","v":""},{"$f":"IFERROR(HLOOKUP(BE$3,Pivot!$B$3:$BB$56,DataTab!$G27,FALSE),\"\")","v":""},{"$f":"IFERROR(HLOOKUP(BF$3,Pivot!$B$3:$BB$56,DataTab!$G27,FALSE),\"\")","v":""},{"$f":"IFERROR(HLOOKUP(BG$3,Pivot!$B$3:$BB$56,DataTab!$G27,FALSE),\"\")","v":""},{"$f":"IFERROR(HLOOKUP(BH$3,Pivot!$B$3:$BB$56,DataTab!$G27,FALSE),\"\")","v":""},null,""]
["Mississippi",2744,21,5,null,{"$f":"IF(ISBLANK(E28),\"\",VLOOKUP(E28,StateListAbbrev!$A$2:$B$53,2,FALSE))","v":""},{"$f":"IF(ISBLANK(E28),\"\",VLOOKUP(F28,'2012'!$A$10:$B$62,2,FALSE))","v":""},null,{"$f":"IFERROR(HLOOKUP(I$3,Pivot!$B$3:$BB$56,DataTab!$G28,FALSE),\"\")","v":""},{"$f":"IFERROR(HLOOKUP(J$3,Pivot!$B$3:$BB$56,DataTab!$G28,FALSE),\"\")","v":""},{"$f":"IFERROR(HLOOKUP(K$3,Pivot!$B$3:$BB$56,DataTab!$G28,FALSE),\"\")","v":""},{"$f":"IFERROR(HLOOKUP(L$3,Pivot!$B$3:$BB$56,DataTab!$G28,FALSE),\"\")","v":""},{"$f":"IFERROR(HLOOKUP(M$3,Pivot!$B$3:$BB$56,DataTab!$G28,FALSE),\"\")","v":""},{"$f":"IFERROR(HLOOKUP(N$3,Pivot!$B$3:$BB$56,DataTab!$G28,FALSE),\"\")","v":""},{"$f":"IFERROR(HLOOKUP(O$3,Pivot!$B$3:$BB$56,DataTab!$G28,FALSE),\"\")","v":""},{"$f":"IFERROR(HLOOKUP(P$3,Pivot!$B$3:$BB$56,DataTab!$G28,FALSE),\"\")","v":""},{"$f":"IFERROR(HLOOKUP(Q$3,Pivot!$B$3:$BB$56,DataTab!$G28,FALSE),\"\")","v":""},{"$f":"IFERROR(HLOOKUP(R$3,Pivot!$B$3:$BB$56,DataTab!$G28,FALSE),\"\")","v":""},{"$f":"IFERROR(HLOOKUP(S$3,Pivot!$B$3:$BB$56,DataTab!$G28,FALSE),\"\")","v":""},{"$f":"IFERROR(HLOOKUP(T$3,Pivot!$B$3:$BB$56,DataTab!$G28,FALSE),\"\")","v":""},{"$f":"IFERROR(HLOOKUP(U$3,Pivot!$B$3:$BB$56,DataTab!$G28,FALSE),\"\")","v":""},{"$f":"IFERROR(HLOOKUP(V$3,Pivot!$B$3:$BB$56,DataTab!$G28,FALSE),\"\")","v":""},{"$f":"IFERROR(HLOOKUP(W$3,Pivot!$B$3:$BB$56,DataTab!$G28,FALSE),\"\")","v":""},{"$f":"IFERROR(HLOOKUP(X$3,Pivot!$B$3:$BB$56,DataTab!$G28,FALSE),\"\")","v":""},{"$f":"IFERROR(HLOOKUP(Y$3,Pivot!$B$3:$BB$56,DataTab!$G28,FALSE),\"\")","v":""},{"$f":"IFERROR(HLOOKUP(Z$3,Pivot!$B$3:$BB$56,DataTab!$G28,FALSE),\"\")","v":""},{"$f":"IFERROR(HLOOKUP(AA$3,Pivot!$B$3:$BB$56,DataTab!$G28,FALSE),\"\")","v":""},{"$f":"IFERROR(HLOOKUP(AB$3,Pivot!$B$3:$BB$56,DataTab!$G28,FALSE),\"\")","v":""},{"$f":"IFERROR(HLOOKUP(AC$3,Pivot!$B$3:$BB$56,DataTab!$G28,FALSE),\"\")","v":""},{"$f":"IFERROR(HLOOKUP(AD$3,Pivot!$B$3:$BB$56,DataTab!$G28,FALSE),\"\")","v":""},{"$f":"IFERROR(HLOOKUP(AE$3,Pivot!$B$3:$BB$56,DataTab!$G28,FALSE),\"\")","v":""},{"$f":"IFERROR(HLOOKUP(AF$3,Pivot!$B$3:$BB$56,DataTab!$G28,FALSE),\"\")","v":""},{"$f":"IFERROR(HLOOKUP(AG$3,Pivot!$B$3:$BB$56,DataTab!$G28,FALSE),\"\")","v":""},{"$f":"IFERROR(HLOOKUP(AH$3,Pivot!$B$3:$BB$56,DataTab!$G28,FALSE),\"\")","v":""},{"$f":"IFERROR(HLOOKUP(AI$3,Pivot!$B$3:$BB$56,DataTab!$G28,FALSE),\"\")","v":""},{"$f":"IFERROR(HLOOKUP(AJ$3,Pivot!$B$3:$BB$56,DataTab!$G28,FALSE),\"\")","v":""},{"$f":"IFERROR(HLOOKUP(AK$3,Pivot!$B$3:$BB$56,DataTab!$G28,FALSE),\"\")","v":""},{"$f":"IFERROR(HLOOKUP(AL$3,Pivot!$B$3:$BB$56,DataTab!$G28,FALSE),\"\")","v":""},{"$f":"IFERROR(HLOOKUP(AM$3,Pivot!$B$3:$BB$56,DataTab!$G28,FALSE),\"\")","v":""},{"$f":"IFERROR(HLOOKUP(AN$3,Pivot!$B$3:$BB$56,DataTab!$G28,FALSE),\"\")","v":""},{"$f":"IFERROR(HLOOKUP(AO$3,Pivot!$B$3:$BB$56,DataTab!$G28,FALSE),\"\")","v":""},{"$f":"IFERROR(HLOOKUP(AP$3,Pivot!$B$3:$BB$56,DataTab!$G28,FALSE),\"\")","v":""},{"$f":"IFERROR(HLOOKUP(AQ$3,Pivot!$B$3:$BB$56,DataTab!$G28,FALSE),\"\")","v":""},{"$f":"IFERROR(HLOOKUP(AR$3,Pivot!$B$3:$BB$56,DataTab!$G28,FALSE),\"\")","v":""},{"$f":"IFERROR(HLOOKUP(AS$3,Pivot!$B$3:$BB$56,DataTab!$G28,FALSE),\"\")","v":""},{"$f":"IFERROR(HLOOKUP(AT$3,Pivot!$B$3:$BB$56,DataTab!$G28,FALSE),\"\")","v":""},{"$f":"IFERROR(HLOOKUP(AU$3,Pivot!$B$3:$BB$56,DataTab!$G28,FALSE),\"\")","v":""},{"$f":"IFERROR(HLOOKUP(AV$3,Pivot!$B$3:$BB$56,DataTab!$G28,FALSE),\"\")","v":""},{"$f":"IFERROR(HLOOKUP(AW$3,Pivot!$B$3:$BB$56,DataTab!$G28,FALSE),\"\")","v":""},{"$f":"IFERROR(HLOOKUP(AX$3,Pivot!$B$3:$BB$56,DataTab!$G28,FALSE),\"\")","v":""},{"$f":"IFERROR(HLOOKUP(AY$3,Pivot!$B$3:$BB$56,DataTab!$G28,FALSE),\"\")","v":""},{"$f":"IFERROR(HLOOKUP(AZ$3,Pivot!$B$3:$BB$56,DataTab!$G28,FALSE),\"\")","v":""},{"$f":"IFERROR(HLOOKUP(BA$3,Pivot!$B$3:$BB$56,DataTab!$G28,FALSE),\"\")","v":""},{"$f":"IFERROR(HLOOKUP(BB$3,Pivot!$B$3:$BB$56,DataTab!$G28,FALSE),\"\")","v":""},{"$f":"IFERROR(HLOOKUP(BC$3,Pivot!$B$3:$BB$56,DataTab!$G28,FALSE),\"\")","v":""},{"$f":"IFERROR(HLOOKUP(BD$3,Pivot!$B$3:$BB$56,DataTab!$G28,FALSE),\"\")","v":""},{"$f":"IFERROR(HLOOKUP(BE$3,Pivot!$B$3:$BB$56,DataTab!$G28,FALSE),\"\")","v":""},{"$f":"IFERROR(HLOOKUP(BF$3,Pivot!$B$3:$BB$56,DataTab!$G28,FALSE),\"\")","v":""},{"$f":"IFERROR(HLOOKUP(BG$3,Pivot!$B$3:$BB$56,DataTab!$G28,FALSE),\"\")","v":""},{"$f":"IFERROR(HLOOKUP(BH$3,Pivot!$B$3:$BB$56,DataTab!$G28,FALSE),\"\")","v":""},null,""]
["Missouri",13264,5,1,null,{"$f":"IF(ISBLANK(E29),\"\",VLOOKUP(E29,StateListAbbrev!$A$2:$B$53,2,FALSE))","v":""},{"$f":"IF(ISBLANK(E29),\"\",VLOOKUP(F29,'2012'!$A$10:$B$62,2,FALSE))","v":""},null,{"$f":"IFERROR(HLOOKUP(I$3,Pivot!$B$3:$BB$56,DataTab!$G29,FALSE),\"\")","v":""},{"$f":"IFERROR(HLOOKUP(J$3,Pivot!$B$3:$BB$56,DataTab!$G29,FALSE),\"\")","v":""},{"$f":"IFERROR(HLOOKUP(K$3,Pivot!$B$3:$BB$56,DataTab!$G29,FALSE),\"\")","v":""},{"$f":"IFERROR(HLOOKUP(L$3,Pivot!$B$3:$BB$56,DataTab!$G29,FALSE),\"\")","v":""},{"$f":"IFERROR(HLOOKUP(M$3,Pivot!$B$3:$BB$56,DataTab!$G29,FALSE),\"\")","v":""},{"$f":"IFERROR(HLOOKUP(N$3,Pivot!$B$3:$BB$56,DataTab!$G29,FALSE),\"\")","v":""},{"$f":"IFERROR(HLOOKUP(O$3,Pivot!$B$3:$BB$56,DataTab!$G29,FALSE),\"\")","v":""},{"$f":"IFERROR(HLOOKUP(P$3,Pivot!$B$3:$BB$56,DataTab!$G29,FALSE),\"\")","v":""},{"$f":"IFERROR(HLOOKUP(Q$3,Pivot!$B$3:$BB$56,DataTab!$G29,FALSE),\"\")","v":""},{"$f":"IFERROR(HLOOKUP(R$3,Pivot!$B$3:$BB$56,DataTab!$G29,FALSE),\"\")","v":""},{"$f":"IFERROR(HLOOKUP(S$3,Pivot!$B$3:$BB$56,DataTab!$G29,FALSE),\"\")","v":""},{"$f":"IFERROR(HLOOKUP(T$3,Pivot!$B$3:$BB$56,DataTab!$G29,FALSE),\"\")","v":""},{"$f":"IFERROR(HLOOKUP(U$3,Pivot!$B$3:$BB$56,DataTab!$G29,FALSE),\"\")","v":""},{"$f":"IFERROR(HLOOKUP(V$3,Pivot!$B$3:$BB$56,DataTab!$G29,FALSE),\"\")","v":""},{"$f":"IFERROR(HLOOKUP(W$3,Pivot!$B$3:$BB$56,DataTab!$G29,FALSE),\"\")","v":""},{"$f":"IFERROR(HLOOKUP(X$3,Pivot!$B$3:$BB$56,DataTab!$G29,FALSE),\"\")","v":""},{"$f":"IFERROR(HLOOKUP(Y$3,Pivot!$B$3:$BB$56,DataTab!$G29,FALSE),\"\")","v":""},{"$f":"IFERROR(HLOOKUP(Z$3,Pivot!$B$3:$BB$56,DataTab!$G29,FALSE),\"\")","v":""},{"$f":"IFERROR(HLOOKUP(AA$3,Pivot!$B$3:$BB$56,DataTab!$G29,FALSE),\"\")","v":""},{"$f":"IFERROR(HLOOKUP(AB$3,Pivot!$B$3:$BB$56,DataTab!$G29,FALSE),\"\")","v":""},{"$f":"IFERROR(HLOOKUP(AC$3,Pivot!$B$3:$BB$56,DataTab!$G29,FALSE),\"\")","v":""},{"$f":"IFERROR(HLOOKUP(AD$3,Pivot!$B$3:$BB$56,DataTab!$G29,FALSE),\"\")","v":""},{"$f":"IFERROR(HLOOKUP(AE$3,Pivot!$B$3:$BB$56,DataTab!$G29,FALSE),\"\")","v":""},{"$f":"IFERROR(HLOOKUP(AF$3,Pivot!$B$3:$BB$56,DataTab!$G29,FALSE),\"\")","v":""},{"$f":"IFERROR(HLOOKUP(AG$3,Pivot!$B$3:$BB$56,DataTab!$G29,FALSE),\"\")","v":""},{"$f":"IFERROR(HLOOKUP(AH$3,Pivot!$B$3:$BB$56,DataTab!$G29,FALSE),\"\")","v":""},{"$f":"IFERROR(HLOOKUP(AI$3,Pivot!$B$3:$BB$56,DataTab!$G29,FALSE),\"\")","v":""},{"$f":"IFERROR(HLOOKUP(AJ$3,Pivot!$B$3:$BB$56,DataTab!$G29,FALSE),\"\")","v":""},{"$f":"IFERROR(HLOOKUP(AK$3,Pivot!$B$3:$BB$56,DataTab!$G29,FALSE),\"\")","v":""},{"$f":"IFERROR(HLOOKUP(AL$3,Pivot!$B$3:$BB$56,DataTab!$G29,FALSE),\"\")","v":""},{"$f":"IFERROR(HLOOKUP(AM$3,Pivot!$B$3:$BB$56,DataTab!$G29,FALSE),\"\")","v":""},{"$f":"IFERROR(HLOOKUP(AN$3,Pivot!$B$3:$BB$56,DataTab!$G29,FALSE),\"\")","v":""},{"$f":"IFERROR(HLOOKUP(AO$3,Pivot!$B$3:$BB$56,DataTab!$G29,FALSE),\"\")","v":""},{"$f":"IFERROR(HLOOKUP(AP$3,Pivot!$B$3:$BB$56,DataTab!$G29,FALSE),\"\")","v":""},{"$f":"IFERROR(HLOOKUP(AQ$3,Pivot!$B$3:$BB$56,DataTab!$G29,FALSE),\"\")","v":""},{"$f":"IFERROR(HLOOKUP(AR$3,Pivot!$B$3:$BB$56,DataTab!$G29,FALSE),\"\")","v":""},{"$f":"IFERROR(HLOOKUP(AS$3,Pivot!$B$3:$BB$56,DataTab!$G29,FALSE),\"\")","v":""},{"$f":"IFERROR(HLOOKUP(AT$3,Pivot!$B$3:$BB$56,DataTab!$G29,FALSE),\"\")","v":""},{"$f":"IFERROR(HLOOKUP(AU$3,Pivot!$B$3:$BB$56,DataTab!$G29,FALSE),\"\")","v":""},{"$f":"IFERROR(HLOOKUP(AV$3,Pivot!$B$3:$BB$56,DataTab!$G29,FALSE),\"\")","v":""},{"$f":"IFERROR(HLOOKUP(AW$3,Pivot!$B$3:$BB$56,DataTab!$G29,FALSE),\"\")","v":""},{"$f":"IFERROR(HLOOKUP(AX$3,Pivot!$B$3:$BB$56,DataTab!$G29,FALSE),\"\")","v":""},{"$f":"IFERROR(HLOOKUP(AY$3,Pivot!$B$3:$BB$56,DataTab!$G29,FALSE),\"\")","v":""},{"$f":"IFERROR(HLOOKUP(AZ$3,Pivot!$B$3:$BB$56,DataTab!$G29,FALSE),\"\")","v":""},{"$f":"IFERROR(HLOOKUP(BA$3,Pivot!$B$3:$BB$56,DataTab!$G29,FALSE),\"\")","v":""},{"$f":"IFERROR(HLOOKUP(BB$3,Pivot!$B$3:$BB$56,DataTab!$G29,FALSE),\"\")","v":""},{"$f":"IFERROR(HLOOKUP(BC$3,Pivot!$B$3:$BB$56,DataTab!$G29,FALSE),\"\")","v":""},{"$f":"IFERROR(HLOOKUP(BD$3,Pivot!$B$3:$BB$56,DataTab!$G29,FALSE),\"\")","v":""},{"$f":"IFERROR(HLOOKUP(BE$3,Pivot!$B$3:$BB$56,DataTab!$G29,FALSE),\"\")","v":""},{"$f":"IFERROR(HLOOKUP(BF$3,Pivot!$B$3:$BB$56,DataTab!$G29,FALSE),\"\")","v":""},{"$f":"IFERROR(HLOOKUP(BG$3,Pivot!$B$3:$BB$56,DataTab!$G29,FALSE),\"\")","v":""},{"$f":"IFERROR(HLOOKUP(BH$3,Pivot!$B$3:$BB$56,DataTab!$G29,FALSE),\"\")","v":""},null,""]
["Montana",228,49,10,null,{"$f":"IF(ISBLANK(E30),\"\",VLOOKUP(E30,StateListAbbrev!$A$2:$B$53,2,FALSE))","v":""},{"$f":"IF(ISBLANK(E30),\"\",VLOOKUP(F30,'2012'!$A$10:$B$62,2,FALSE))","v":""},null,{"$f":"IFERROR(HLOOKUP(I$3,Pivot!$B$3:$BB$56,DataTab!$G30,FALSE),\"\")","v":""},{"$f":"IFERROR(HLOOKUP(J$3,Pivot!$B$3:$BB$56,DataTab!$G30,FALSE),\"\")","v":""},{"$f":"IFERROR(HLOOKUP(K$3,Pivot!$B$3:$BB$56,DataTab!$G30,FALSE),\"\")","v":""},{"$f":"IFERROR(HLOOKUP(L$3,Pivot!$B$3:$BB$56,DataTab!$G30,FALSE),\"\")","v":""},{"$f":"IFERROR(HLOOKUP(M$3,Pivot!$B$3:$BB$56,DataTab!$G30,FALSE),\"\")","v":""},{"$f":"IFERROR(HLOOKUP(N$3,Pivot!$B$3:$BB$56,DataTab!$G30,FALSE),\"\")","v":""},{"$f":"IFERROR(HLOOKUP(O$3,Pivot!$B$3:$BB$56,DataTab!$G30,FALSE),\"\")","v":""},{"$f":"IFERROR(HLOOKUP(P$3,Pivot!$B$3:$BB$56,DataTab!$G30,FALSE),\"\")","v":""},{"$f":"IFERROR(HLOOKUP(Q$3,Pivot!$B$3:$BB$56,DataTab!$G30,FALSE),\"\")","v":""},{"$f":"IFERROR(HLOOKUP(R$3,Pivot!$B$3:$BB$56,DataTab!$G30,FALSE),\"\")","v":""},{"$f":"IFERROR(HLOOKUP(S$3,Pivot!$B$3:$BB$56,DataTab!$G30,FALSE),\"\")","v":""},{"$f":"IFERROR(HLOOKUP(T$3,Pivot!$B$3:$BB$56,DataTab!$G30,FALSE),\"\")","v":""},{"$f":"IFERROR(HLOOKUP(U$3,Pivot!$B$3:$BB$56,DataTab!$G30,FALSE),\"\")","v":""},{"$f":"IFERROR(HLOOKUP(V$3,Pivot!$B$3:$BB$56,DataTab!$G30,FALSE),\"\")","v":""},{"$f":"IFERROR(HLOOKUP(W$3,Pivot!$B$3:$BB$56,DataTab!$G30,FALSE),\"\")","v":""},{"$f":"IFERROR(HLOOKUP(X$3,Pivot!$B$3:$BB$56,DataTab!$G30,FALSE),\"\")","v":""},{"$f":"IFERROR(HLOOKUP(Y$3,Pivot!$B$3:$BB$56,DataTab!$G30,FALSE),\"\")","v":""},{"$f":"IFERROR(HLOOKUP(Z$3,Pivot!$B$3:$BB$56,DataTab!$G30,FALSE),\"\")","v":""},{"$f":"IFERROR(HLOOKUP(AA$3,Pivot!$B$3:$BB$56,DataTab!$G30,FALSE),\"\")","v":""},{"$f":"IFERROR(HLOOKUP(AB$3,Pivot!$B$3:$BB$56,DataTab!$G30,FALSE),\"\")","v":""},{"$f":"IFERROR(HLOOKUP(AC$3,Pivot!$B$3:$BB$56,DataTab!$G30,FALSE),\"\")","v":""},{"$f":"IFERROR(HLOOKUP(AD$3,Pivot!$B$3:$BB$56,DataTab!$G30,FALSE),\"\")","v":""},{"$f":"IFERROR(HLOOKUP(AE$3,Pivot!$B$3:$BB$56,DataTab!$G30,FALSE),\"\")","v":""},{"$f":"IFERROR(HLOOKUP(AF$3,Pivot!$B$3:$BB$56,DataTab!$G30,FALSE),\"\")","v":""},{"$f":"IFERROR(HLOOKUP(AG$3,Pivot!$B$3:$BB$56,DataTab!$G30,FALSE),\"\")","v":""},{"$f":"IFERROR(HLOOKUP(AH$3,Pivot!$B$3:$BB$56,DataTab!$G30,FALSE),\"\")","v":""},{"$f":"IFERROR(HLOOKUP(AI$3,Pivot!$B$3:$BB$56,DataTab!$G30,FALSE),\"\")","v":""},{"$f":"IFERROR(HLOOKUP(AJ$3,Pivot!$B$3:$BB$56,DataTab!$G30,FALSE),\"\")","v":""},{"$f":"IFERROR(HLOOKUP(AK$3,Pivot!$B$3:$BB$56,DataTab!$G30,FALSE),\"\")","v":""},{"$f":"IFERROR(HLOOKUP(AL$3,Pivot!$B$3:$BB$56,DataTab!$G30,FALSE),\"\")","v":""},{"$f":"IFERROR(HLOOKUP(AM$3,Pivot!$B$3:$BB$56,DataTab!$G30,FALSE),\"\")","v":""},{"$f":"IFERROR(HLOOKUP(AN$3,Pivot!$B$3:$BB$56,DataTab!$G30,FALSE),\"\")","v":""},{"$f":"IFERROR(HLOOKUP(AO$3,Pivot!$B$3:$BB$56,DataTab!$G30,FALSE),\"\")","v":""},{"$f":"IFERROR(HLOOKUP(AP$3,Pivot!$B$3:$BB$56,DataTab!$G30,FALSE),\"\")","v":""},{"$f":"IFERROR(HLOOKUP(AQ$3,Pivot!$B$3:$BB$56,DataTab!$G30,FALSE),\"\")","v":""},{"$f":"IFERROR(HLOOKUP(AR$3,Pivot!$B$3:$BB$56,DataTab!$G30,FALSE),\"\")","v":""},{"$f":"IFERROR(HLOOKUP(AS$3,Pivot!$B$3:$BB$56,DataTab!$G30,FALSE),\"\")","v":""},{"$f":"IFERROR(HLOOKUP(AT$3,Pivot!$B$3:$BB$56,DataTab!$G30,FALSE),\"\")","v":""},{"$f":"IFERROR(HLOOKUP(AU$3,Pivot!$B$3:$BB$56,DataTab!$G30,FALSE),\"\")","v":""},{"$f":"IFERROR(HLOOKUP(AV$3,Pivot!$B$3:$BB$56,DataTab!$G30,FALSE),\"\")","v":""},{"$f":"IFERROR(HLOOKUP(AW$3,Pivot!$B$3:$BB$56,DataTab!$G30,FALSE),\"\")","v":""},{"$f":"IFERROR(HLOOKUP(AX$3,Pivot!$B$3:$BB$56,DataTab!$G30,FALSE),\"\")","v":""},{"$f":"IFERROR(HLOOKUP(AY$3,Pivot!$B$3:$BB$56,DataTab!$G30,FALSE),\"\")","v":""},{"$f":"IFERROR(HLOOKUP(AZ$3,Pivot!$B$3:$BB$56,DataTab!$G30,FALSE),\"\")","v":""},{"$f":"IFERROR(HLOOKUP(BA$3,Pivot!$B$3:$BB$56,DataTab!$G30,FALSE),\"\")","v":""},{"$f":"IFERROR(HLOOKUP(BB$3,Pivot!$B$3:$BB$56,DataTab!$G30,FALSE),\"\")","v":""},{"$f":"IFERROR(HLOOKUP(BC$3,Pivot!$B$3:$BB$56,DataTab!$G30,FALSE),\"\")","v":""},{"$f":"IFERROR(HLOOKUP(BD$3,Pivot!$B$3:$BB$56,DataTab!$G30,FALSE),\"\")","v":""},{"$f":"IFERROR(HLOOKUP(BE$3,Pivot!$B$3:$BB$56,DataTab!$G30,FALSE),\"\")","v":""},{"$f":"IFERROR(HLOOKUP(BF$3,Pivot!$B$3:$BB$56,DataTab!$G30,FALSE),\"\")","v":""},{"$f":"IFERROR(HLOOKUP(BG$3,Pivot!$B$3:$BB$56,DataTab!$G30,FALSE),\"\")","v":""},{"$f":"IFERROR(HLOOKUP(BH$3,Pivot!$B$3:$BB$56,DataTab!$G30,FALSE),\"\")","v":""},null,""]
["Nebraska",1302,34,7,null,{"$f":"IF(ISBLANK(E31),\"\",VLOOKUP(E31,StateListAbbrev!$A$2:$B$53,2,FALSE))","v":""},{"$f":"IF(ISBLANK(E31),\"\",VLOOKUP(F31,'2012'!$A$10:$B$62,2,FALSE))","v":""},null,{"$f":"IFERROR(HLOOKUP(I$3,Pivot!$B$3:$BB$56,DataTab!$G31,FALSE),\"\")","v":""},{"$f":"IFERROR(HLOOKUP(J$3,Pivot!$B$3:$BB$56,DataTab!$G31,FALSE),\"\")","v":""},{"$f":"IFERROR(HLOOKUP(K$3,Pivot!$B$3:$BB$56,DataTab!$G31,FALSE),\"\")","v":""},{"$f":"IFERROR(HLOOKUP(L$3,Pivot!$B$3:$BB$56,DataTab!$G31,FALSE),\"\")","v":""},{"$f":"IFERROR(HLOOKUP(M$3,Pivot!$B$3:$BB$56,DataTab!$G31,FALSE),\"\")","v":""},{"$f":"IFERROR(HLOOKUP(N$3,Pivot!$B$3:$BB$56,DataTab!$G31,FALSE),\"\")","v":""},{"$f":"IFERROR(HLOOKUP(O$3,Pivot!$B$3:$BB$56,DataTab!$G31,FALSE),\"\")","v":""},{"$f":"IFERROR(HLOOKUP(P$3,Pivot!$B$3:$BB$56,DataTab!$G31,FALSE),\"\")","v":""},{"$f":"IFERROR(HLOOKUP(Q$3,Pivot!$B$3:$BB$56,DataTab!$G31,FALSE),\"\")","v":""},{"$f":"IFERROR(HLOOKUP(R$3,Pivot!$B$3:$BB$56,DataTab!$G31,FALSE),\"\")","v":""},{"$f":"IFERROR(HLOOKUP(S$3,Pivot!$B$3:$BB$56,DataTab!$G31,FALSE),\"\")","v":""},{"$f":"IFERROR(HLOOKUP(T$3,Pivot!$B$3:$BB$56,DataTab!$G31,FALSE),\"\")","v":""},{"$f":"IFERROR(HLOOKUP(U$3,Pivot!$B$3:$BB$56,DataTab!$G31,FALSE),\"\")","v":""},{"$f":"IFERROR(HLOOKUP(V$3,Pivot!$B$3:$BB$56,DataTab!$G31,FALSE),\"\")","v":""},{"$f":"IFERROR(HLOOKUP(W$3,Pivot!$B$3:$BB$56,DataTab!$G31,FALSE),\"\")","v":""},{"$f":"IFERROR(HLOOKUP(X$3,Pivot!$B$3:$BB$56,DataTab!$G31,FALSE),\"\")","v":""},{"$f":"IFERROR(HLOOKUP(Y$3,Pivot!$B$3:$BB$56,DataTab!$G31,FALSE),\"\")","v":""},{"$f":"IFERROR(HLOOKUP(Z$3,Pivot!$B$3:$BB$56,DataTab!$G31,FALSE),\"\")","v":""},{"$f":"IFERROR(HLOOKUP(AA$3,Pivot!$B$3:$BB$56,DataTab!$G31,FALSE),\"\")","v":""},{"$f":"IFERROR(HLOOKUP(AB$3,Pivot!$B$3:$BB$56,DataTab!$G31,FALSE),\"\")","v":""},{"$f":"IFERROR(HLOOKUP(AC$3,Pivot!$B$3:$BB$56,DataTab!$G31,FALSE),\"\")","v":""},{"$f":"IFERROR(HLOOKUP(AD$3,Pivot!$B$3:$BB$56,DataTab!$G31,FALSE),\"\")","v":""},{"$f":"IFERROR(HLOOKUP(AE$3,Pivot!$B$3:$BB$56,DataTab!$G31,FALSE),\"\")","v":""},{"$f":"IFERROR(HLOOKUP(AF$3,Pivot!$B$3:$BB$56,DataTab!$G31,FALSE),\"\")","v":""},{"$f":"IFERROR(HLOOKUP(AG$3,Pivot!$B$3:$BB$56,DataTab!$G31,FALSE),\"\")","v":""},{"$f":"IFERROR(HLOOKUP(AH$3,Pivot!$B$3:$BB$56,DataTab!$G31,FALSE),\"\")","v":""},{"$f":"IFERROR(HLOOKUP(AI$3,Pivot!$B$3:$BB$56,DataTab!$G31,FALSE),\"\")","v":""},{"$f":"IFERROR(HLOOKUP(AJ$3,Pivot!$B$3:$BB$56,DataTab!$G31,FALSE),\"\")","v":""},{"$f":"IFERROR(HLOOKUP(AK$3,Pivot!$B$3:$BB$56,DataTab!$G31,FALSE),\"\")","v":""},{"$f":"IFERROR(HLOOKUP(AL$3,Pivot!$B$3:$BB$56,DataTab!$G31,FALSE),\"\")","v":""},{"$f":"IFERROR(HLOOKUP(AM$3,Pivot!$B$3:$BB$56,DataTab!$G31,FALSE),\"\")","v":""},{"$f":"IFERROR(HLOOKUP(AN$3,Pivot!$B$3:$BB$56,DataTab!$G31,FALSE),\"\")","v":""},{"$f":"IFERROR(HLOOKUP(AO$3,Pivot!$B$3:$BB$56,DataTab!$G31,FALSE),\"\")","v":""},{"$f":"IFERROR(HLOOKUP(AP$3,Pivot!$B$3:$BB$56,DataTab!$G31,FALSE),\"\")","v":""},{"$f":"IFERROR(HLOOKUP(AQ$3,Pivot!$B$3:$BB$56,DataTab!$G31,FALSE),\"\")","v":""},{"$f":"IFERROR(HLOOKUP(AR$3,Pivot!$B$3:$BB$56,DataTab!$G31,FALSE),\"\")","v":""},{"$f":"IFERROR(HLOOKUP(AS$3,Pivot!$B$3:$BB$56,DataTab!$G31,FALSE),\"\")","v":""},{"$f":"IFERROR(HLOOKUP(AT$3,Pivot!$B$3:$BB$56,DataTab!$G31,FALSE),\"\")","v":""},{"$f":"IFERROR(HLOOKUP(AU$3,Pivot!$B$3:$BB$56,DataTab!$G31,FALSE),\"\")","v":""},{"$f":"IFERROR(HLOOKUP(AV$3,Pivot!$B$3:$BB$56,DataTab!$G31,FALSE),\"\")","v":""},{"$f":"IFERROR(HLOOKUP(AW$3,Pivot!$B$3:$BB$56,DataTab!$G31,FALSE),\"\")","v":""},{"$f":"IFERROR(HLOOKUP(AX$3,Pivot!$B$3:$BB$56,DataTab!$G31,FALSE),\"\")","v":""},{"$f":"IFERROR(HLOOKUP(AY$3,Pivot!$B$3:$BB$56,DataTab!$G31,FALSE),\"\")","v":""},{"$f":"IFERROR(HLOOKUP(AZ$3,Pivot!$B$3:$BB$56,DataTab!$G31,FALSE),\"\")","v":""},{"$f":"IFERROR(HLOOKUP(BA$3,Pivot!$B$3:$BB$56,DataTab!$G31,FALSE),\"\")","v":""},{"$f":"IFERROR(HLOOKUP(BB$3,Pivot!$B$3:$BB$56,DataTab!$G31,FALSE),\"\")","v":""},{"$f":"IFERROR(HLOOKUP(BC$3,Pivot!$B$3:$BB$56,DataTab!$G31,FALSE),\"\")","v":""},{"$f":"IFERROR(HLOOKUP(BD$3,Pivot!$B$3:$BB$56,DataTab!$G31,FALSE),\"\")","v":""},{"$f":"IFERROR(HLOOKUP(BE$3,Pivot!$B$3:$BB$56,DataTab!$G31,FALSE),\"\")","v":""},{"$f":"IFERROR(HLOOKUP(BF$3,Pivot!$B$3:$BB$56,DataTab!$G31,FALSE),\"\")","v":""},{"$f":"IFERROR(HLOOKUP(BG$3,Pivot!$B$3:$BB$56,DataTab!$G31,FALSE),\"\")","v":""},{"$f":"IFERROR(HLOOKUP(BH$3,Pivot!$B$3:$BB$56,DataTab!$G31,FALSE),\"\")","v":""},null,""]
["Nevada",1478,31,6,null,{"$f":"IF(ISBLANK(E32),\"\",VLOOKUP(E32,StateListAbbrev!$A$2:$B$53,2,FALSE))","v":""},{"$f":"IF(ISBLANK(E32),\"\",VLOOKUP(F32,'2012'!$A$10:$B$62,2,FALSE))","v":""},null,{"$f":"IFERROR(HLOOKUP(I$3,Pivot!$B$3:$BB$56,DataTab!$G32,FALSE),\"\")","v":""},{"$f":"IFERROR(HLOOKUP(J$3,Pivot!$B$3:$BB$56,DataTab!$G32,FALSE),\"\")","v":""},{"$f":"IFERROR(HLOOKUP(K$3,Pivot!$B$3:$BB$56,DataTab!$G32,FALSE),\"\")","v":""},{"$f":"IFERROR(HLOOKUP(L$3,Pivot!$B$3:$BB$56,DataTab!$G32,FALSE),\"\")","v":""},{"$f":"IFERROR(HLOOKUP(M$3,Pivot!$B$3:$BB$56,DataTab!$G32,FALSE),\"\")","v":""},{"$f":"IFERROR(HLOOKUP(N$3,Pivot!$B$3:$BB$56,DataTab!$G32,FALSE),\"\")","v":""},{"$f":"IFERROR(HLOOKUP(O$3,Pivot!$B$3:$BB$56,DataTab!$G32,FALSE),\"\")","v":""},{"$f":"IFERROR(HLOOKUP(P$3,Pivot!$B$3:$BB$56,DataTab!$G32,FALSE),\"\")","v":""},{"$f":"IFERROR(HLOOKUP(Q$3,Pivot!$B$3:$BB$56,DataTab!$G32,FALSE),\"\")","v":""},{"$f":"IFERROR(HLOOKUP(R$3,Pivot!$B$3:$BB$56,DataTab!$G32,FALSE),\"\")","v":""},{"$f":"IFERROR(HLOOKUP(S$3,Pivot!$B$3:$BB$56,DataTab!$G32,FALSE),\"\")","v":""},{"$f":"IFERROR(HLOOKUP(T$3,Pivot!$B$3:$BB$56,DataTab!$G32,FALSE),\"\")","v":""},{"$f":"IFERROR(HLOOKUP(U$3,Pivot!$B$3:$BB$56,DataTab!$G32,FALSE),\"\")","v":""},{"$f":"IFERROR(HLOOKUP(V$3,Pivot!$B$3:$BB$56,DataTab!$G32,FALSE),\"\")","v":""},{"$f":"IFERROR(HLOOKUP(W$3,Pivot!$B$3:$BB$56,DataTab!$G32,FALSE),\"\")","v":""},{"$f":"IFERROR(HLOOKUP(X$3,Pivot!$B$3:$BB$56,DataTab!$G32,FALSE),\"\")","v":""},{"$f":"IFERROR(HLOOKUP(Y$3,Pivot!$B$3:$BB$56,DataTab!$G32,FALSE),\"\")","v":""},{"$f":"IFERROR(HLOOKUP(Z$3,Pivot!$B$3:$BB$56,DataTab!$G32,FALSE),\"\")","v":""},{"$f":"IFERROR(HLOOKUP(AA$3,Pivot!$B$3:$BB$56,DataTab!$G32,FALSE),\"\")","v":""},{"$f":"IFERROR(HLOOKUP(AB$3,Pivot!$B$3:$BB$56,DataTab!$G32,FALSE),\"\")","v":""},{"$f":"IFERROR(HLOOKUP(AC$3,Pivot!$B$3:$BB$56,DataTab!$G32,FALSE),\"\")","v":""},{"$f":"IFERROR(HLOOKUP(AD$3,Pivot!$B$3:$BB$56,DataTab!$G32,FALSE),\"\")","v":""},{"$f":"IFERROR(HLOOKUP(AE$3,Pivot!$B$3:$BB$56,DataTab!$G32,FALSE),\"\")","v":""},{"$f":"IFERROR(HLOOKUP(AF$3,Pivot!$B$3:$BB$56,DataTab!$G32,FALSE),\"\")","v":""},{"$f":"IFERROR(HLOOKUP(AG$3,Pivot!$B$3:$BB$56,DataTab!$G32,FALSE),\"\")","v":""},{"$f":"IFERROR(HLOOKUP(AH$3,Pivot!$B$3:$BB$56,DataTab!$G32,FALSE),\"\")","v":""},{"$f":"IFERROR(HLOOKUP(AI$3,Pivot!$B$3:$BB$56,DataTab!$G32,FALSE),\"\")","v":""},{"$f":"IFERROR(HLOOKUP(AJ$3,Pivot!$B$3:$BB$56,DataTab!$G32,FALSE),\"\")","v":""},{"$f":"IFERROR(HLOOKUP(AK$3,Pivot!$B$3:$BB$56,DataTab!$G32,FALSE),\"\")","v":""},{"$f":"IFERROR(HLOOKUP(AL$3,Pivot!$B$3:$BB$56,DataTab!$G32,FALSE),\"\")","v":""},{"$f":"IFERROR(HLOOKUP(AM$3,Pivot!$B$3:$BB$56,DataTab!$G32,FALSE),\"\")","v":""},{"$f":"IFERROR(HLOOKUP(AN$3,Pivot!$B$3:$BB$56,DataTab!$G32,FALSE),\"\")","v":""},{"$f":"IFERROR(HLOOKUP(AO$3,Pivot!$B$3:$BB$56,DataTab!$G32,FALSE),\"\")","v":""},{"$f":"IFERROR(HLOOKUP(AP$3,Pivot!$B$3:$BB$56,DataTab!$G32,FALSE),\"\")","v":""},{"$f":"IFERROR(HLOOKUP(AQ$3,Pivot!$B$3:$BB$56,DataTab!$G32,FALSE),\"\")","v":""},{"$f":"IFERROR(HLOOKUP(AR$3,Pivot!$B$3:$BB$56,DataTab!$G32,FALSE),\"\")","v":""},{"$f":"IFERROR(HLOOKUP(AS$3,Pivot!$B$3:$BB$56,DataTab!$G32,FALSE),\"\")","v":""},{"$f":"IFERROR(HLOOKUP(AT$3,Pivot!$B$3:$BB$56,DataTab!$G32,FALSE),\"\")","v":""},{"$f":"IFERROR(HLOOKUP(AU$3,Pivot!$B$3:$BB$56,DataTab!$G32,FALSE),\"\")","v":""},{"$f":"IFERROR(HLOOKUP(AV$3,Pivot!$B$3:$BB$56,DataTab!$G32,FALSE),\"\")","v":""},{"$f":"IFERROR(HLOOKUP(AW$3,Pivot!$B$3:$BB$56,DataTab!$G32,FALSE),\"\")","v":""},{"$f":"IFERROR(HLOOKUP(AX$3,Pivot!$B$3:$BB$56,DataTab!$G32,FALSE),\"\")","v":""},{"$f":"IFERROR(HLOOKUP(AY$3,Pivot!$B$3:$BB$56,DataTab!$G32,FALSE),\"\")","v":""},{"$f":"IFERROR(HLOOKUP(AZ$3,Pivot!$B$3:$BB$56,DataTab!$G32,FALSE),\"\")","v":""},{"$f":"IFERROR(HLOOKUP(BA$3,Pivot!$B$3:$BB$56,DataTab!$G32,FALSE),\"\")","v":""},{"$f":"IFERROR(HLOOKUP(BB$3,Pivot!$B$3:$BB$56,DataTab!$G32,FALSE),\"\")","v":""},{"$f":"IFERROR(HLOOKUP(BC$3,Pivot!$B$3:$BB$56,DataTab!$G32,FALSE),\"\")","v":""},{"$f":"IFERROR(HLOOKUP(BD$3,Pivot!$B$3:$BB$56,DataTab!$G32,FALSE),\"\")","v":""},{"$f":"IFERROR(HLOOKUP(BE$3,Pivot!$B$3:$BB$56,DataTab!$G32,FALSE),\"\")","v":""},{"$f":"IFERROR(HLOOKUP(BF$3,Pivot!$B$3:$BB$56,DataTab!$G32,FALSE),\"\")","v":""},{"$f":"IFERROR(HLOOKUP(BG$3,Pivot!$B$3:$BB$56,DataTab!$G32,FALSE),\"\")","v":""},{"$f":"IFERROR(HLOOKUP(BH$3,Pivot!$B$3:$BB$56,DataTab!$G32,FALSE),\"\")","v":""},null,""]
["New Hampshire",283,47,10,null,{"$f":"IF(ISBLANK(E33),\"\",VLOOKUP(E33,StateListAbbrev!$A$2:$B$53,2,FALSE))","v":""},{"$f":"IF(ISBLANK(E33),\"\",VLOOKUP(F33,'2012'!$A$10:$B$62,2,FALSE))","v":""},null,{"$f":"IFERROR(HLOOKUP(I$3,Pivot!$B$3:$BB$56,DataTab!$G33,FALSE),\"\")","v":""},{"$f":"IFERROR(HLOOKUP(J$3,Pivot!$B$3:$BB$56,DataTab!$G33,FALSE),\"\")","v":""},{"$f":"IFERROR(HLOOKUP(K$3,Pivot!$B$3:$BB$56,DataTab!$G33,FALSE),\"\")","v":""},{"$f":"IFERROR(HLOOKUP(L$3,Pivot!$B$3:$BB$56,DataTab!$G33,FALSE),\"\")","v":""},{"$f":"IFERROR(HLOOKUP(M$3,Pivot!$B$3:$BB$56,DataTab!$G33,FALSE),\"\")","v":""},{"$f":"IFERROR(HLOOKUP(N$3,Pivot!$B$3:$BB$56,DataTab!$G33,FALSE),\"\")","v":""},{"$f":"IFERROR(HLOOKUP(O$3,Pivot!$B$3:$BB$56,DataTab!$G33,FALSE),\"\")","v":""},{"$f":"IFERROR(HLOOKUP(P$3,Pivot!$B$3:$BB$56,DataTab!$G33,FALSE),\"\")","v":""},{"$f":"IFERROR(HLOOKUP(Q$3,Pivot!$B$3:$BB$56,DataTab!$G33,FALSE),\"\")","v":""},{"$f":"IFERROR(HLOOKUP(R$3,Pivot!$B$3:$BB$56,DataTab!$G33,FALSE),\"\")","v":""},{"$f":"IFERROR(HLOOKUP(S$3,Pivot!$B$3:$BB$56,DataTab!$G33,FALSE),\"\")","v":""},{"$f":"IFERROR(HLOOKUP(T$3,Pivot!$B$3:$BB$56,DataTab!$G33,FALSE),\"\")","v":""},{"$f":"IFERROR(HLOOKUP(U$3,Pivot!$B$3:$BB$56,DataTab!$G33,FALSE),\"\")","v":""},{"$f":"IFERROR(HLOOKUP(V$3,Pivot!$B$3:$BB$56,DataTab!$G33,FALSE),\"\")","v":""},{"$f":"IFERROR(HLOOKUP(W$3,Pivot!$B$3:$BB$56,DataTab!$G33,FALSE),\"\")","v":""},{"$f":"IFERROR(HLOOKUP(X$3,Pivot!$B$3:$BB$56,DataTab!$G33,FALSE),\"\")","v":""},{"$f":"IFERROR(HLOOKUP(Y$3,Pivot!$B$3:$BB$56,DataTab!$G33,FALSE),\"\")","v":""},{"$f":"IFERROR(HLOOKUP(Z$3,Pivot!$B$3:$BB$56,DataTab!$G33,FALSE),\"\")","v":""},{"$f":"IFERROR(HLOOKUP(AA$3,Pivot!$B$3:$BB$56,DataTab!$G33,FALSE),\"\")","v":""},{"$f":"IFERROR(HLOOKUP(AB$3,Pivot!$B$3:$BB$56,DataTab!$G33,FALSE),\"\")","v":""},{"$f":"IFERROR(HLOOKUP(AC$3,Pivot!$B$3:$BB$56,DataTab!$G33,FALSE),\"\")","v":""},{"$f":"IFERROR(HLOOKUP(AD$3,Pivot!$B$3:$BB$56,DataTab!$G33,FALSE),\"\")","v":""},{"$f":"IFERROR(HLOOKUP(AE$3,Pivot!$B$3:$BB$56,DataTab!$G33,FALSE),\"\")","v":""},{"$f":"IFERROR(HLOOKUP(AF$3,Pivot!$B$3:$BB$56,DataTab!$G33,FALSE),\"\")","v":""},{"$f":"IFERROR(HLOOKUP(AG$3,Pivot!$B$3:$BB$56,DataTab!$G33,FALSE),\"\")","v":""},{"$f":"IFERROR(HLOOKUP(AH$3,Pivot!$B$3:$BB$56,DataTab!$G33,FALSE),\"\")","v":""},{"$f":"IFERROR(HLOOKUP(AI$3,Pivot!$B$3:$BB$56,DataTab!$G33,FALSE),\"\")","v":""},{"$f":"IFERROR(HLOOKUP(AJ$3,Pivot!$B$3:$BB$56,DataTab!$G33,FALSE),\"\")","v":""},{"$f":"IFERROR(HLOOKUP(AK$3,Pivot!$B$3:$BB$56,DataTab!$G33,FALSE),\"\")","v":""},{"$f":"IFERROR(HLOOKUP(AL$3,Pivot!$B$3:$BB$56,DataTab!$G33,FALSE),\"\")","v":""},{"$f":"IFERROR(HLOOKUP(AM$3,Pivot!$B$3:$BB$56,DataTab!$G33,FALSE),\"\")","v":""},{"$f":"IFERROR(HLOOKUP(AN$3,Pivot!$B$3:$BB$56,DataTab!$G33,FALSE),\"\")","v":""},{"$f":"IFERROR(HLOOKUP(AO$3,Pivot!$B$3:$BB$56,DataTab!$G33,FALSE),\"\")","v":""},{"$f":"IFERROR(HLOOKUP(AP$3,Pivot!$B$3:$BB$56,DataTab!$G33,FALSE),\"\")","v":""},{"$f":"IFERROR(HLOOKUP(AQ$3,Pivot!$B$3:$BB$56,DataTab!$G33,FALSE),\"\")","v":""},{"$f":"IFERROR(HLOOKUP(AR$3,Pivot!$B$3:$BB$56,DataTab!$G33,FALSE),\"\")","v":""},{"$f":"IFERROR(HLOOKUP(AS$3,Pivot!$B$3:$BB$56,DataTab!$G33,FALSE),\"\")","v":""},{"$f":"IFERROR(HLOOKUP(AT$3,Pivot!$B$3:$BB$56,DataTab!$G33,FALSE),\"\")","v":""},{"$f":"IFERROR(HLOOKUP(AU$3,Pivot!$B$3:$BB$56,DataTab!$G33,FALSE),\"\")","v":""},{"$f":"IFERROR(HLOOKUP(AV$3,Pivot!$B$3:$BB$56,DataTab!$G33,FALSE),\"\")","v":""},{"$f":"IFERROR(HLOOKUP(AW$3,Pivot!$B$3:$BB$56,DataTab!$G33,FALSE),\"\")","v":""},{"$f":"IFERROR(HLOOKUP(AX$3,Pivot!$B$3:$BB$56,DataTab!$G33,FALSE),\"\")","v":""},{"$f":"IFERROR(HLOOKUP(AY$3,Pivot!$B$3:$BB$56,DataTab!$G33,FALSE),\"\")","v":""},{"$f":"IFERROR(HLOOKUP(AZ$3,Pivot!$B$3:$BB$56,DataTab!$G33,FALSE),\"\")","v":""},{"$f":"IFERROR(HLOOKUP(BA$3,Pivot!$B$3:$BB$56,DataTab!$G33,FALSE),\"\")","v":""},{"$f":"IFERROR(HLOOKUP(BB$3,Pivot!$B$3:$BB$56,DataTab!$G33,FALSE),\"\")","v":""},{"$f":"IFERROR(HLOOKUP(BC$3,Pivot!$B$3:$BB$56,DataTab!$G33,FALSE),\"\")","v":""},{"$f":"IFERROR(HLOOKUP(BD$3,Pivot!$B$3:$BB$56,DataTab!$G33,FALSE),\"\")","v":""},{"$f":"IFERROR(HLOOKUP(BE$3,Pivot!$B$3:$BB$56,DataTab!$G33,FALSE),\"\")","v":""},{"$f":"IFERROR(HLOOKUP(BF$3,Pivot!$B$3:$BB$56,DataTab!$G33,FALSE),\"\")","v":""},{"$f":"IFERROR(HLOOKUP(BG$3,Pivot!$B$3:$BB$56,DataTab!$G33,FALSE),\"\")","v":""},{"$f":"IFERROR(HLOOKUP(BH$3,Pivot!$B$3:$BB$56,DataTab!$G33,FALSE),\"\")","v":""},null,""]
["New Jersey",2366,23,5,null,{"$f":"IF(ISBLANK(E34),\"\",VLOOKUP(E34,StateListAbbrev!$A$2:$B$53,2,FALSE))","v":""},{"$f":"IF(ISBLANK(E34),\"\",VLOOKUP(F34,'2012'!$A$10:$B$62,2,FALSE))","v":""},null,{"$f":"IFERROR(HLOOKUP(I$3,Pivot!$B$3:$BB$56,DataTab!$G34,FALSE),\"\")","v":""},{"$f":"IFERROR(HLOOKUP(J$3,Pivot!$B$3:$BB$56,DataTab!$G34,FALSE),\"\")","v":""},{"$f":"IFERROR(HLOOKUP(K$3,Pivot!$B$3:$BB$56,DataTab!$G34,FALSE),\"\")","v":""},{"$f":"IFERROR(HLOOKUP(L$3,Pivot!$B$3:$BB$56,DataTab!$G34,FALSE),\"\")","v":""},{"$f":"IFERROR(HLOOKUP(M$3,Pivot!$B$3:$BB$56,DataTab!$G34,FALSE),\"\")","v":""},{"$f":"IFERROR(HLOOKUP(N$3,Pivot!$B$3:$BB$56,DataTab!$G34,FALSE),\"\")","v":""},{"$f":"IFERROR(HLOOKUP(O$3,Pivot!$B$3:$BB$56,DataTab!$G34,FALSE),\"\")","v":""},{"$f":"IFERROR(HLOOKUP(P$3,Pivot!$B$3:$BB$56,DataTab!$G34,FALSE),\"\")","v":""},{"$f":"IFERROR(HLOOKUP(Q$3,Pivot!$B$3:$BB$56,DataTab!$G34,FALSE),\"\")","v":""},{"$f":"IFERROR(HLOOKUP(R$3,Pivot!$B$3:$BB$56,DataTab!$G34,FALSE),\"\")","v":""},{"$f":"IFERROR(HLOOKUP(S$3,Pivot!$B$3:$BB$56,DataTab!$G34,FALSE),\"\")","v":""},{"$f":"IFERROR(HLOOKUP(T$3,Pivot!$B$3:$BB$56,DataTab!$G34,FALSE),\"\")","v":""},{"$f":"IFERROR(HLOOKUP(U$3,Pivot!$B$3:$BB$56,DataTab!$G34,FALSE),\"\")","v":""},{"$f":"IFERROR(HLOOKUP(V$3,Pivot!$B$3:$BB$56,DataTab!$G34,FALSE),\"\")","v":""},{"$f":"IFERROR(HLOOKUP(W$3,Pivot!$B$3:$BB$56,DataTab!$G34,FALSE),\"\")","v":""},{"$f":"IFERROR(HLOOKUP(X$3,Pivot!$B$3:$BB$56,DataTab!$G34,FALSE),\"\")","v":""},{"$f":"IFERROR(HLOOKUP(Y$3,Pivot!$B$3:$BB$56,DataTab!$G34,FALSE),\"\")","v":""},{"$f":"IFERROR(HLOOKUP(Z$3,Pivot!$B$3:$BB$56,DataTab!$G34,FALSE),\"\")","v":""},{"$f":"IFERROR(HLOOKUP(AA$3,Pivot!$B$3:$BB$56,DataTab!$G34,FALSE),\"\")","v":""},{"$f":"IFERROR(HLOOKUP(AB$3,Pivot!$B$3:$BB$56,DataTab!$G34,FALSE),\"\")","v":""},{"$f":"IFERROR(HLOOKUP(AC$3,Pivot!$B$3:$BB$56,DataTab!$G34,FALSE),\"\")","v":""},{"$f":"IFERROR(HLOOKUP(AD$3,Pivot!$B$3:$BB$56,DataTab!$G34,FALSE),\"\")","v":""},{"$f":"IFERROR(HLOOKUP(AE$3,Pivot!$B$3:$BB$56,DataTab!$G34,FALSE),\"\")","v":""},{"$f":"IFERROR(HLOOKUP(AF$3,Pivot!$B$3:$BB$56,DataTab!$G34,FALSE),\"\")","v":""},{"$f":"IFERROR(HLOOKUP(AG$3,Pivot!$B$3:$BB$56,DataTab!$G34,FALSE),\"\")","v":""},{"$f":"IFERROR(HLOOKUP(AH$3,Pivot!$B$3:$BB$56,DataTab!$G34,FALSE),\"\")","v":""},{"$f":"IFERROR(HLOOKUP(AI$3,Pivot!$B$3:$BB$56,DataTab!$G34,FALSE),\"\")","v":""},{"$f":"IFERROR(HLOOKUP(AJ$3,Pivot!$B$3:$BB$56,DataTab!$G34,FALSE),\"\")","v":""},{"$f":"IFERROR(HLOOKUP(AK$3,Pivot!$B$3:$BB$56,DataTab!$G34,FALSE),\"\")","v":""},{"$f":"IFERROR(HLOOKUP(AL$3,Pivot!$B$3:$BB$56,DataTab!$G34,FALSE),\"\")","v":""},{"$f":"IFERROR(HLOOKUP(AM$3,Pivot!$B$3:$BB$56,DataTab!$G34,FALSE),\"\")","v":""},{"$f":"IFERROR(HLOOKUP(AN$3,Pivot!$B$3:$BB$56,DataTab!$G34,FALSE),\"\")","v":""},{"$f":"IFERROR(HLOOKUP(AO$3,Pivot!$B$3:$BB$56,DataTab!$G34,FALSE),\"\")","v":""},{"$f":"IFERROR(HLOOKUP(AP$3,Pivot!$B$3:$BB$56,DataTab!$G34,FALSE),\"\")","v":""},{"$f":"IFERROR(HLOOKUP(AQ$3,Pivot!$B$3:$BB$56,DataTab!$G34,FALSE),\"\")","v":""},{"$f":"IFERROR(HLOOKUP(AR$3,Pivot!$B$3:$BB$56,DataTab!$G34,FALSE),\"\")","v":""},{"$f":"IFERROR(HLOOKUP(AS$3,Pivot!$B$3:$BB$56,DataTab!$G34,FALSE),\"\")","v":""},{"$f":"IFERROR(HLOOKUP(AT$3,Pivot!$B$3:$BB$56,DataTab!$G34,FALSE),\"\")","v":""},{"$f":"IFERROR(HLOOKUP(AU$3,Pivot!$B$3:$BB$56,DataTab!$G34,FALSE),\"\")","v":""},{"$f":"IFERROR(HLOOKUP(AV$3,Pivot!$B$3:$BB$56,DataTab!$G34,FALSE),\"\")","v":""},{"$f":"IFERROR(HLOOKUP(AW$3,Pivot!$B$3:$BB$56,DataTab!$G34,FALSE),\"\")","v":""},{"$f":"IFERROR(HLOOKUP(AX$3,Pivot!$B$3:$BB$56,DataTab!$G34,FALSE),\"\")","v":""},{"$f":"IFERROR(HLOOKUP(AY$3,Pivot!$B$3:$BB$56,DataTab!$G34,FALSE),\"\")","v":""},{"$f":"IFERROR(HLOOKUP(AZ$3,Pivot!$B$3:$BB$56,DataTab!$G34,FALSE),\"\")","v":""},{"$f":"IFERROR(HLOOKUP(BA$3,Pivot!$B$3:$BB$56,DataTab!$G34,FALSE),\"\")","v":""},{"$f":"IFERROR(HLOOKUP(BB$3,Pivot!$B$3:$BB$56,DataTab!$G34,FALSE),\"\")","v":""},{"$f":"IFERROR(HLOOKUP(BC$3,Pivot!$B$3:$BB$56,DataTab!$G34,FALSE),\"\")","v":""},{"$f":"IFERROR(HLOOKUP(BD$3,Pivot!$B$3:$BB$56,DataTab!$G34,FALSE),\"\")","v":""},{"$f":"IFERROR(HLOOKUP(BE$3,Pivot!$B$3:$BB$56,DataTab!$G34,FALSE),\"\")","v":""},{"$f":"IFERROR(HLOOKUP(BF$3,Pivot!$B$3:$BB$56,DataTab!$G34,FALSE),\"\")","v":""},{"$f":"IFERROR(HLOOKUP(BG$3,Pivot!$B$3:$BB$56,DataTab!$G34,FALSE),\"\")","v":""},{"$f":"IFERROR(HLOOKUP(BH$3,Pivot!$B$3:$BB$56,DataTab!$G34,FALSE),\"\")","v":""},null,""]
["New Mexico",1359,33,7,null,{"$f":"IF(ISBLANK(E35),\"\",VLOOKUP(E35,StateListAbbrev!$A$2:$B$53,2,FALSE))","v":""},{"$f":"IF(ISBLANK(E35),\"\",VLOOKUP(F35,'2012'!$A$10:$B$62,2,FALSE))","v":""},null,{"$f":"IFERROR(HLOOKUP(I$3,Pivot!$B$3:$BB$56,DataTab!$G35,FALSE),\"\")","v":""},{"$f":"IFERROR(HLOOKUP(J$3,Pivot!$B$3:$BB$56,DataTab!$G35,FALSE),\"\")","v":""},{"$f":"IFERROR(HLOOKUP(K$3,Pivot!$B$3:$BB$56,DataTab!$G35,FALSE),\"\")","v":""},{"$f":"IFERROR(HLOOKUP(L$3,Pivot!$B$3:$BB$56,DataTab!$G35,FALSE),\"\")","v":""},{"$f":"IFERROR(HLOOKUP(M$3,Pivot!$B$3:$BB$56,DataTab!$G35,FALSE),\"\")","v":""},{"$f":"IFERROR(HLOOKUP(N$3,Pivot!$B$3:$BB$56,DataTab!$G35,FALSE),\"\")","v":""},{"$f":"IFERROR(HLOOKUP(O$3,Pivot!$B$3:$BB$56,DataTab!$G35,FALSE),\"\")","v":""},{"$f":"IFERROR(HLOOKUP(P$3,Pivot!$B$3:$BB$56,DataTab!$G35,FALSE),\"\")","v":""},{"$f":"IFERROR(HLOOKUP(Q$3,Pivot!$B$3:$BB$56,DataTab!$G35,FALSE),\"\")","v":""},{"$f":"IFERROR(HLOOKUP(R$3,Pivot!$B$3:$BB$56,DataTab!$G35,FALSE),\"\")","v":""},{"$f":"IFERROR(HLOOKUP(S$3,Pivot!$B$3:$BB$56,DataTab!$G35,FALSE),\"\")","v":""},{"$f":"IFERROR(HLOOKUP(T$3,Pivot!$B$3:$BB$56,DataTab!$G35,FALSE),\"\")","v":""},{"$f":"IFERROR(HLOOKUP(U$3,Pivot!$B$3:$BB$56,DataTab!$G35,FALSE),\"\")","v":""},{"$f":"IFERROR(HLOOKUP(V$3,Pivot!$B$3:$BB$56,DataTab!$G35,FALSE),\"\")","v":""},{"$f":"IFERROR(HLOOKUP(W$3,Pivot!$B$3:$BB$56,DataTab!$G35,FALSE),\"\")","v":""},{"$f":"IFERROR(HLOOKUP(X$3,Pivot!$B$3:$BB$56,DataTab!$G35,FALSE),\"\")","v":""},{"$f":"IFERROR(HLOOKUP(Y$3,Pivot!$B$3:$BB$56,DataTab!$G35,FALSE),\"\")","v":""},{"$f":"IFERROR(HLOOKUP(Z$3,Pivot!$B$3:$BB$56,DataTab!$G35,FALSE),\"\")","v":""},{"$f":"IFERROR(HLOOKUP(AA$3,Pivot!$B$3:$BB$56,DataTab!$G35,FALSE),\"\")","v":""},{"$f":"IFERROR(HLOOKUP(AB$3,Pivot!$B$3:$BB$56,DataTab!$G35,FALSE),\"\")","v":""},{"$f":"IFERROR(HLOOKUP(AC$3,Pivot!$B$3:$BB$56,DataTab!$G35,FALSE),\"\")","v":""},{"$f":"IFERROR(HLOOKUP(AD$3,Pivot!$B$3:$BB$56,DataTab!$G35,FALSE),\"\")","v":""},{"$f":"IFERROR(HLOOKUP(AE$3,Pivot!$B$3:$BB$56,DataTab!$G35,FALSE),\"\")","v":""},{"$f":"IFERROR(HLOOKUP(AF$3,Pivot!$B$3:$BB$56,DataTab!$G35,FALSE),\"\")","v":""},{"$f":"IFERROR(HLOOKUP(AG$3,Pivot!$B$3:$BB$56,DataTab!$G35,FALSE),\"\")","v":""},{"$f":"IFERROR(HLOOKUP(AH$3,Pivot!$B$3:$BB$56,DataTab!$G35,FALSE),\"\")","v":""},{"$f":"IFERROR(HLOOKUP(AI$3,Pivot!$B$3:$BB$56,DataTab!$G35,FALSE),\"\")","v":""},{"$f":"IFERROR(HLOOKUP(AJ$3,Pivot!$B$3:$BB$56,DataTab!$G35,FALSE),\"\")","v":""},{"$f":"IFERROR(HLOOKUP(AK$3,Pivot!$B$3:$BB$56,DataTab!$G35,FALSE),\"\")","v":""},{"$f":"IFERROR(HLOOKUP(AL$3,Pivot!$B$3:$BB$56,DataTab!$G35,FALSE),\"\")","v":""},{"$f":"IFERROR(HLOOKUP(AM$3,Pivot!$B$3:$BB$56,DataTab!$G35,FALSE),\"\")","v":""},{"$f":"IFERROR(HLOOKUP(AN$3,Pivot!$B$3:$BB$56,DataTab!$G35,FALSE),\"\")","v":""},{"$f":"IFERROR(HLOOKUP(AO$3,Pivot!$B$3:$BB$56,DataTab!$G35,FALSE),\"\")","v":""},{"$f":"IFERROR(HLOOKUP(AP$3,Pivot!$B$3:$BB$56,DataTab!$G35,FALSE),\"\")","v":""},{"$f":"IFERROR(HLOOKUP(AQ$3,Pivot!$B$3:$BB$56,DataTab!$G35,FALSE),\"\")","v":""},{"$f":"IFERROR(HLOOKUP(AR$3,Pivot!$B$3:$BB$56,DataTab!$G35,FALSE),\"\")","v":""},{"$f":"IFERROR(HLOOKUP(AS$3,Pivot!$B$3:$BB$56,DataTab!$G35,FALSE),\"\")","v":""},{"$f":"IFERROR(HLOOKUP(AT$3,Pivot!$B$3:$BB$56,DataTab!$G35,FALSE),\"\")","v":""},{"$f":"IFERROR(HLOOKUP(AU$3,Pivot!$B$3:$BB$56,DataTab!$G35,FALSE),\"\")","v":""},{"$f":"IFERROR(HLOOKUP(AV$3,Pivot!$B$3:$BB$56,DataTab!$G35,FALSE),\"\")","v":""},{"$f":"IFERROR(HLOOKUP(AW$3,Pivot!$B$3:$BB$56,DataTab!$G35,FALSE),\"\")","v":""},{"$f":"IFERROR(HLOOKUP(AX$3,Pivot!$B$3:$BB$56,DataTab!$G35,FALSE),\"\")","v":""},{"$f":"IFERROR(HLOOKUP(AY$3,Pivot!$B$3:$BB$56,DataTab!$G35,FALSE),\"\")","v":""},{"$f":"IFERROR(HLOOKUP(AZ$3,Pivot!$B$3:$BB$56,DataTab!$G35,FALSE),\"\")","v":""},{"$f":"IFERROR(HLOOKUP(BA$3,Pivot!$B$3:$BB$56,DataTab!$G35,FALSE),\"\")","v":""},{"$f":"IFERROR(HLOOKUP(BB$3,Pivot!$B$3:$BB$56,DataTab!$G35,FALSE),\"\")","v":""},{"$f":"IFERROR(HLOOKUP(BC$3,Pivot!$B$3:$BB$56,DataTab!$G35,FALSE),\"\")","v":""},{"$f":"IFERROR(HLOOKUP(BD$3,Pivot!$B$3:$BB$56,DataTab!$G35,FALSE),\"\")","v":""},{"$f":"IFERROR(HLOOKUP(BE$3,Pivot!$B$3:$BB$56,DataTab!$G35,FALSE),\"\")","v":""},{"$f":"IFERROR(HLOOKUP(BF$3,Pivot!$B$3:$BB$56,DataTab!$G35,FALSE),\"\")","v":""},{"$f":"IFERROR(HLOOKUP(BG$3,Pivot!$B$3:$BB$56,DataTab!$G35,FALSE),\"\")","v":""},{"$f":"IFERROR(HLOOKUP(BH$3,Pivot!$B$3:$BB$56,DataTab!$G35,FALSE),\"\")","v":""},null,""]
["New York",{"$f":"HLOOKUP(A36,$I$1:$BH$2,2,FALSE)","v":7561},10,2,null,{"$f":"IF(ISBLANK(E36),\"\",VLOOKUP(E36,StateListAbbrev!$A$2:$B$53,2,FALSE))","v":""},{"$f":"IF(ISBLANK(E36),\"\",VLOOKUP(F36,'2012'!$A$10:$B$62,2,FALSE))","v":""},null,{"$f":"IFERROR(HLOOKUP(I$3,Pivot!$B$3:$BB$56,DataTab!$G36,FALSE),\"\")","v":""},{"$f":"IFERROR(HLOOKUP(J$3,Pivot!$B$3:$BB$56,DataTab!$G36,FALSE),\"\")","v":""},{"$f":"IFERROR(HLOOKUP(K$3,Pivot!$B$3:$BB$56,DataTab!$G36,FALSE),\"\")","v":""},{"$f":"IFERROR(HLOOKUP(L$3,Pivot!$B$3:$BB$56,DataTab!$G36,FALSE),\"\")","v":""},{"$f":"IFERROR(HLOOKUP(M$3,Pivot!$B$3:$BB$56,DataTab!$G36,FALSE),\"\")","v":""},{"$f":"IFERROR(HLOOKUP(N$3,Pivot!$B$3:$BB$56,DataTab!$G36,FALSE),\"\")","v":""},{"$f":"IFERROR(HLOOKUP(O$3,Pivot!$B$3:$BB$56,DataTab!$G36,FALSE),\"\")","v":""},{"$f":"IFERROR(HLOOKUP(P$3,Pivot!$B$3:$BB$56,DataTab!$G36,FALSE),\"\")","v":""},{"$f":"IFERROR(HLOOKUP(Q$3,Pivot!$B$3:$BB$56,DataTab!$G36,FALSE),\"\")","v":""},{"$f":"IFERROR(HLOOKUP(R$3,Pivot!$B$3:$BB$56,DataTab!$G36,FALSE),\"\")","v":""},{"$f":"IFERROR(HLOOKUP(S$3,Pivot!$B$3:$BB$56,DataTab!$G36,FALSE),\"\")","v":""},{"$f":"IFERROR(HLOOKUP(T$3,Pivot!$B$3:$BB$56,DataTab!$G36,FALSE),\"\")","v":""},{"$f":"IFERROR(HLOOKUP(U$3,Pivot!$B$3:$BB$56,DataTab!$G36,FALSE),\"\")","v":""},{"$f":"IFERROR(HLOOKUP(V$3,Pivot!$B$3:$BB$56,DataTab!$G36,FALSE),\"\")","v":""},{"$f":"IFERROR(HLOOKUP(W$3,Pivot!$B$3:$BB$56,DataTab!$G36,FALSE),\"\")","v":""},{"$f":"IFERROR(HLOOKUP(X$3,Pivot!$B$3:$BB$56,DataTab!$G36,FALSE),\"\")","v":""},{"$f":"IFERROR(HLOOKUP(Y$3,Pivot!$B$3:$BB$56,DataTab!$G36,FALSE),\"\")","v":""},{"$f":"IFERROR(HLOOKUP(Z$3,Pivot!$B$3:$BB$56,DataTab!$G36,FALSE),\"\")","v":""},{"$f":"IFERROR(HLOOKUP(AA$3,Pivot!$B$3:$BB$56,DataTab!$G36,FALSE),\"\")","v":""},{"$f":"IFERROR(HLOOKUP(AB$3,Pivot!$B$3:$BB$56,DataTab!$G36,FALSE),\"\")","v":""},{"$f":"IFERROR(HLOOKUP(AC$3,Pivot!$B$3:$BB$56,DataTab!$G36,FALSE),\"\")","v":""},{"$f":"IFERROR(HLOOKUP(AD$3,Pivot!$B$3:$BB$56,DataTab!$G36,FALSE),\"\")","v":""},{"$f":"IFERROR(HLOOKUP(AE$3,Pivot!$B$3:$BB$56,DataTab!$G36,FALSE),\"\")","v":""},{"$f":"IFERROR(HLOOKUP(AF$3,Pivot!$B$3:$BB$56,DataTab!$G36,FALSE),\"\")","v":""},{"$f":"IFERROR(HLOOKUP(AG$3,Pivot!$B$3:$BB$56,DataTab!$G36,FALSE),\"\")","v":""},{"$f":"IFERROR(HLOOKUP(AH$3,Pivot!$B$3:$BB$56,DataTab!$G36,FALSE),\"\")","v":""},{"$f":"IFERROR(HLOOKUP(AI$3,Pivot!$B$3:$BB$56,DataTab!$G36,FALSE),\"\")","v":""},{"$f":"IFERROR(HLOOKUP(AJ$3,Pivot!$B$3:$BB$56,DataTab!$G36,FALSE),\"\")","v":""},{"$f":"IFERROR(HLOOKUP(AK$3,Pivot!$B$3:$BB$56,DataTab!$G36,FALSE),\"\")","v":""},{"$f":"IFERROR(HLOOKUP(AL$3,Pivot!$B$3:$BB$56,DataTab!$G36,FALSE),\"\")","v":""},{"$f":"IFERROR(HLOOKUP(AM$3,Pivot!$B$3:$BB$56,DataTab!$G36,FALSE),\"\")","v":""},{"$f":"IFERROR(HLOOKUP(AN$3,Pivot!$B$3:$BB$56,DataTab!$G36,FALSE),\"\")","v":""},{"$f":"IFERROR(HLOOKUP(AO$3,Pivot!$B$3:$BB$56,DataTab!$G36,FALSE),\"\")","v":""},{"$f":"IFERROR(HLOOKUP(AP$3,Pivot!$B$3:$BB$56,DataTab!$G36,FALSE),\"\")","v":""},{"$f":"IFERROR(HLOOKUP(AQ$3,Pivot!$B$3:$BB$56,DataTab!$G36,FALSE),\"\")","v":""},{"$f":"IFERROR(HLOOKUP(AR$3,Pivot!$B$3:$BB$56,DataTab!$G36,FALSE),\"\")","v":""},{"$f":"IFERROR(HLOOKUP(AS$3,Pivot!$B$3:$BB$56,DataTab!$G36,FALSE),\"\")","v":""},{"$f":"IFERROR(HLOOKUP(AT$3,Pivot!$B$3:$BB$56,DataTab!$G36,FALSE),\"\")","v":""},{"$f":"IFERROR(HLOOKUP(AU$3,Pivot!$B$3:$BB$56,DataTab!$G36,FALSE),\"\")","v":""},{"$f":"IFERROR(HLOOKUP(AV$3,Pivot!$B$3:$BB$56,DataTab!$G36,FALSE),\"\")","v":""},{"$f":"IFERROR(HLOOKUP(AW$3,Pivot!$B$3:$BB$56,DataTab!$G36,FALSE),\"\")","v":""},{"$f":"IFERROR(HLOOKUP(AX$3,Pivot!$B$3:$BB$56,DataTab!$G36,FALSE),\"\")","v":""},{"$f":"IFERROR(HLOOKUP(AY$3,Pivot!$B$3:$BB$56,DataTab!$G36,FALSE),\"\")","v":""},{"$f":"IFERROR(HLOOKUP(AZ$3,Pivot!$B$3:$BB$56,DataTab!$G36,FALSE),\"\")","v":""},{"$f":"IFERROR(HLOOKUP(BA$3,Pivot!$B$3:$BB$56,DataTab!$G36,FALSE),\"\")","v":""},{"$f":"IFERROR(HLOOKUP(BB$3,Pivot!$B$3:$BB$56,DataTab!$G36,FALSE),\"\")","v":""},{"$f":"IFERROR(HLOOKUP(BC$3,Pivot!$B$3:$BB$56,DataTab!$G36,FALSE),\"\")","v":""},{"$f":"IFERROR(HLOOKUP(BD$3,Pivot!$B$3:$BB$56,DataTab!$G36,FALSE),\"\")","v":""},{"$f":"IFERROR(HLOOKUP(BE$3,Pivot!$B$3:$BB$56,DataTab!$G36,FALSE),\"\")","v":""},{"$f":"IFERROR(HLOOKUP(BF$3,Pivot!$B$3:$BB$56,DataTab!$G36,FALSE),\"\")","v":""},{"$f":"IFERROR(HLOOKUP(BG$3,Pivot!$B$3:$BB$56,DataTab!$G36,FALSE),\"\")","v":""},{"$f":"IFERROR(HLOOKUP(BH$3,Pivot!$B$3:$BB$56,DataTab!$G36,FALSE),\"\")","v":""},null,""]
["North Carolina",3761,17,4,null,{"$f":"IF(ISBLANK(E37),\"\",VLOOKUP(E37,StateListAbbrev!$A$2:$B$53,2,FALSE))","v":""},{"$f":"IF(ISBLANK(E37),\"\",VLOOKUP(F37,'2012'!$A$10:$B$62,2,FALSE))","v":""},null,{"$f":"IFERROR(HLOOKUP(I$3,Pivot!$B$3:$BB$56,DataTab!$G37,FALSE),\"\")","v":""},{"$f":"IFERROR(HLOOKUP(J$3,Pivot!$B$3:$BB$56,DataTab!$G37,FALSE),\"\")","v":""},{"$f":"IFERROR(HLOOKUP(K$3,Pivot!$B$3:$BB$56,DataTab!$G37,FALSE),\"\")","v":""},{"$f":"IFERROR(HLOOKUP(L$3,Pivot!$B$3:$BB$56,DataTab!$G37,FALSE),\"\")","v":""},{"$f":"IFERROR(HLOOKUP(M$3,Pivot!$B$3:$BB$56,DataTab!$G37,FALSE),\"\")","v":""},{"$f":"IFERROR(HLOOKUP(N$3,Pivot!$B$3:$BB$56,DataTab!$G37,FALSE),\"\")","v":""},{"$f":"IFERROR(HLOOKUP(O$3,Pivot!$B$3:$BB$56,DataTab!$G37,FALSE),\"\")","v":""},{"$f":"IFERROR(HLOOKUP(P$3,Pivot!$B$3:$BB$56,DataTab!$G37,FALSE),\"\")","v":""},{"$f":"IFERROR(HLOOKUP(Q$3,Pivot!$B$3:$BB$56,DataTab!$G37,FALSE),\"\")","v":""},{"$f":"IFERROR(HLOOKUP(R$3,Pivot!$B$3:$BB$56,DataTab!$G37,FALSE),\"\")","v":""},{"$f":"IFERROR(HLOOKUP(S$3,Pivot!$B$3:$BB$56,DataTab!$G37,FALSE),\"\")","v":""},{"$f":"IFERROR(HLOOKUP(T$3,Pivot!$B$3:$BB$56,DataTab!$G37,FALSE),\"\")","v":""},{"$f":"IFERROR(HLOOKUP(U$3,Pivot!$B$3:$BB$56,DataTab!$G37,FALSE),\"\")","v":""},{"$f":"IFERROR(HLOOKUP(V$3,Pivot!$B$3:$BB$56,DataTab!$G37,FALSE),\"\")","v":""},{"$f":"IFERROR(HLOOKUP(W$3,Pivot!$B$3:$BB$56,DataTab!$G37,FALSE),\"\")","v":""},{"$f":"IFERROR(HLOOKUP(X$3,Pivot!$B$3:$BB$56,DataTab!$G37,FALSE),\"\")","v":""},{"$f":"IFERROR(HLOOKUP(Y$3,Pivot!$B$3:$BB$56,DataTab!$G37,FALSE),\"\")","v":""},{"$f":"IFERROR(HLOOKUP(Z$3,Pivot!$B$3:$BB$56,DataTab!$G37,FALSE),\"\")","v":""},{"$f":"IFERROR(HLOOKUP(AA$3,Pivot!$B$3:$BB$56,DataTab!$G37,FALSE),\"\")","v":""},{"$f":"IFERROR(HLOOKUP(AB$3,Pivot!$B$3:$BB$56,DataTab!$G37,FALSE),\"\")","v":""},{"$f":"IFERROR(HLOOKUP(AC$3,Pivot!$B$3:$BB$56,DataTab!$G37,FALSE),\"\")","v":""},{"$f":"IFERROR(HLOOKUP(AD$3,Pivot!$B$3:$BB$56,DataTab!$G37,FALSE),\"\")","v":""},{"$f":"IFERROR(HLOOKUP(AE$3,Pivot!$B$3:$BB$56,DataTab!$G37,FALSE),\"\")","v":""},{"$f":"IFERROR(HLOOKUP(AF$3,Pivot!$B$3:$BB$56,DataTab!$G37,FALSE),\"\")","v":""},{"$f":"IFERROR(HLOOKUP(AG$3,Pivot!$B$3:$BB$56,DataTab!$G37,FALSE),\"\")","v":""},{"$f":"IFERROR(HLOOKUP(AH$3,Pivot!$B$3:$BB$56,DataTab!$G37,FALSE),\"\")","v":""},{"$f":"IFERROR(HLOOKUP(AI$3,Pivot!$B$3:$BB$56,DataTab!$G37,FALSE),\"\")","v":""},{"$f":"IFERROR(HLOOKUP(AJ$3,Pivot!$B$3:$BB$56,DataTab!$G37,FALSE),\"\")","v":""},{"$f":"IFERROR(HLOOKUP(AK$3,Pivot!$B$3:$BB$56,DataTab!$G37,FALSE),\"\")","v":""},{"$f":"IFERROR(HLOOKUP(AL$3,Pivot!$B$3:$BB$56,DataTab!$G37,FALSE),\"\")","v":""},{"$f":"IFERROR(HLOOKUP(AM$3,Pivot!$B$3:$BB$56,DataTab!$G37,FALSE),\"\")","v":""},{"$f":"IFERROR(HLOOKUP(AN$3,Pivot!$B$3:$BB$56,DataTab!$G37,FALSE),\"\")","v":""},{"$f":"IFERROR(HLOOKUP(AO$3,Pivot!$B$3:$BB$56,DataTab!$G37,FALSE),\"\")","v":""},{"$f":"IFERROR(HLOOKUP(AP$3,Pivot!$B$3:$BB$56,DataTab!$G37,FALSE),\"\")","v":""},{"$f":"IFERROR(HLOOKUP(AQ$3,Pivot!$B$3:$BB$56,DataTab!$G37,FALSE),\"\")","v":""},{"$f":"IFERROR(HLOOKUP(AR$3,Pivot!$B$3:$BB$56,DataTab!$G37,FALSE),\"\")","v":""},{"$f":"IFERROR(HLOOKUP(AS$3,Pivot!$B$3:$BB$56,DataTab!$G37,FALSE),\"\")","v":""},{"$f":"IFERROR(HLOOKUP(AT$3,Pivot!$B$3:$BB$56,DataTab!$G37,FALSE),\"\")","v":""},{"$f":"IFERROR(HLOOKUP(AU$3,Pivot!$B$3:$BB$56,DataTab!$G37,FALSE),\"\")","v":""},{"$f":"IFERROR(HLOOKUP(AV$3,Pivot!$B$3:$BB$56,DataTab!$G37,FALSE),\"\")","v":""},{"$f":"IFERROR(HLOOKUP(AW$3,Pivot!$B$3:$BB$56,DataTab!$G37,FALSE),\"\")","v":""},{"$f":"IFERROR(HLOOKUP(AX$3,Pivot!$B$3:$BB$56,DataTab!$G37,FALSE),\"\")","v":""},{"$f":"IFERROR(HLOOKUP(AY$3,Pivot!$B$3:$BB$56,DataTab!$G37,FALSE),\"\")","v":""},{"$f":"IFERROR(HLOOKUP(AZ$3,Pivot!$B$3:$BB$56,DataTab!$G37,FALSE),\"\")","v":""},{"$f":"IFERROR(HLOOKUP(BA$3,Pivot!$B$3:$BB$56,DataTab!$G37,FALSE),\"\")","v":""},{"$f":"IFERROR(HLOOKUP(BB$3,Pivot!$B$3:$BB$56,DataTab!$G37,FALSE),\"\")","v":""},{"$f":"IFERROR(HLOOKUP(BC$3,Pivot!$B$3:$BB$56,DataTab!$G37,FALSE),\"\")","v":""},{"$f":"IFERROR(HLOOKUP(BD$3,Pivot!$B$3:$BB$56,DataTab!$G37,FALSE),\"\")","v":""},{"$f":"IFERROR(HLOOKUP(BE$3,Pivot!$B$3:$BB$56,DataTab!$G37,FALSE),\"\")","v":""},{"$f":"IFERROR(HLOOKUP(BF$3,Pivot!$B$3:$BB$56,DataTab!$G37,FALSE),\"\")","v":""},{"$f":"IFERROR(HLOOKUP(BG$3,Pivot!$B$3:$BB$56,DataTab!$G37,FALSE),\"\")","v":""},{"$f":"IFERROR(HLOOKUP(BH$3,Pivot!$B$3:$BB$56,DataTab!$G37,FALSE),\"\")","v":""},null,{"$f":"IF(E37=\"\",\"\",\", \" &E37)","v":""}]
["North Dakota",196,50,10,null,{"$f":"IF(ISBLANK(E38),\"\",VLOOKUP(E38,StateListAbbrev!$A$2:$B$53,2,FALSE))","v":""},{"$f":"IF(ISBLANK(E38),\"\",VLOOKUP(F38,'2012'!$A$10:$B$62,2,FALSE))","v":""},null,{"$f":"IFERROR(HLOOKUP(I$3,Pivot!$B$3:$BB$56,DataTab!$G38,FALSE),\"\")","v":""},{"$f":"IFERROR(HLOOKUP(J$3,Pivot!$B$3:$BB$56,DataTab!$G38,FALSE),\"\")","v":""},{"$f":"IFERROR(HLOOKUP(K$3,Pivot!$B$3:$BB$56,DataTab!$G38,FALSE),\"\")","v":""},{"$f":"IFERROR(HLOOKUP(L$3,Pivot!$B$3:$BB$56,DataTab!$G38,FALSE),\"\")","v":""},{"$f":"IFERROR(HLOOKUP(M$3,Pivot!$B$3:$BB$56,DataTab!$G38,FALSE),\"\")","v":""},{"$f":"IFERROR(HLOOKUP(N$3,Pivot!$B$3:$BB$56,DataTab!$G38,FALSE),\"\")","v":""},{"$f":"IFERROR(HLOOKUP(O$3,Pivot!$B$3:$BB$56,DataTab!$G38,FALSE),\"\")","v":""},{"$f":"IFERROR(HLOOKUP(P$3,Pivot!$B$3:$BB$56,DataTab!$G38,FALSE),\"\")","v":""},{"$f":"IFERROR(HLOOKUP(Q$3,Pivot!$B$3:$BB$56,DataTab!$G38,FALSE),\"\")","v":""},{"$f":"IFERROR(HLOOKUP(R$3,Pivot!$B$3:$BB$56,DataTab!$G38,FALSE),\"\")","v":""},{"$f":"IFERROR(HLOOKUP(S$3,Pivot!$B$3:$BB$56,DataTab!$G38,FALSE),\"\")","v":""},{"$f":"IFERROR(HLOOKUP(T$3,Pivot!$B$3:$BB$56,DataTab!$G38,FALSE),\"\")","v":""},{"$f":"IFERROR(HLOOKUP(U$3,Pivot!$B$3:$BB$56,DataTab!$G38,FALSE),\"\")","v":""},{"$f":"IFERROR(HLOOKUP(V$3,Pivot!$B$3:$BB$56,DataTab!$G38,FALSE),\"\")","v":""},{"$f":"IFERROR(HLOOKUP(W$3,Pivot!$B$3:$BB$56,DataTab!$G38,FALSE),\"\")","v":""},{"$f":"IFERROR(HLOOKUP(X$3,Pivot!$B$3:$BB$56,DataTab!$G38,FALSE),\"\")","v":""},{"$f":"IFERROR(HLOOKUP(Y$3,Pivot!$B$3:$BB$56,DataTab!$G38,FALSE),\"\")","v":""},{"$f":"IFERROR(HLOOKUP(Z$3,Pivot!$B$3:$BB$56,DataTab!$G38,FALSE),\"\")","v":""},{"$f":"IFERROR(HLOOKUP(AA$3,Pivot!$B$3:$BB$56,DataTab!$G38,FALSE),\"\")","v":""},{"$f":"IFERROR(HLOOKUP(AB$3,Pivot!$B$3:$BB$56,DataTab!$G38,FALSE),\"\")","v":""},{"$f":"IFERROR(HLOOKUP(AC$3,Pivot!$B$3:$BB$56,DataTab!$G38,FALSE),\"\")","v":""},{"$f":"IFERROR(HLOOKUP(AD$3,Pivot!$B$3:$BB$56,DataTab!$G38,FALSE),\"\")","v":""},{"$f":"IFERROR(HLOOKUP(AE$3,Pivot!$B$3:$BB$56,DataTab!$G38,FALSE),\"\")","v":""},{"$f":"IFERROR(HLOOKUP(AF$3,Pivot!$B$3:$BB$56,DataTab!$G38,FALSE),\"\")","v":""},{"$f":"IFERROR(HLOOKUP(AG$3,Pivot!$B$3:$BB$56,DataTab!$G38,FALSE),\"\")","v":""},{"$f":"IFERROR(HLOOKUP(AH$3,Pivot!$B$3:$BB$56,DataTab!$G38,FALSE),\"\")","v":""},{"$f":"IFERROR(HLOOKUP(AI$3,Pivot!$B$3:$BB$56,DataTab!$G38,FALSE),\"\")","v":""},{"$f":"IFERROR(HLOOKUP(AJ$3,Pivot!$B$3:$BB$56,DataTab!$G38,FALSE),\"\")","v":""},{"$f":"IFERROR(HLOOKUP(AK$3,Pivot!$B$3:$BB$56,DataTab!$G38,FALSE),\"\")","v":""},{"$f":"IFERROR(HLOOKUP(AL$3,Pivot!$B$3:$BB$56,DataTab!$G38,FALSE),\"\")","v":""},{"$f":"IFERROR(HLOOKUP(AM$3,Pivot!$B$3:$BB$56,DataTab!$G38,FALSE),\"\")","v":""},{"$f":"IFERROR(HLOOKUP(AN$3,Pivot!$B$3:$BB$56,DataTab!$G38,FALSE),\"\")","v":""},{"$f":"IFERROR(HLOOKUP(AO$3,Pivot!$B$3:$BB$56,DataTab!$G38,FALSE),\"\")","v":""},{"$f":"IFERROR(HLOOKUP(AP$3,Pivot!$B$3:$BB$56,DataTab!$G38,FALSE),\"\")","v":""},{"$f":"IFERROR(HLOOKUP(AQ$3,Pivot!$B$3:$BB$56,DataTab!$G38,FALSE),\"\")","v":""},{"$f":"IFERROR(HLOOKUP(AR$3,Pivot!$B$3:$BB$56,DataTab!$G38,FALSE),\"\")","v":""},{"$f":"IFERROR(HLOOKUP(AS$3,Pivot!$B$3:$BB$56,DataTab!$G38,FALSE),\"\")","v":""},{"$f":"IFERROR(HLOOKUP(AT$3,Pivot!$B$3:$BB$56,DataTab!$G38,FALSE),\"\")","v":""},{"$f":"IFERROR(HLOOKUP(AU$3,Pivot!$B$3:$BB$56,DataTab!$G38,FALSE),\"\")","v":""},{"$f":"IFERROR(HLOOKUP(AV$3,Pivot!$B$3:$BB$56,DataTab!$G38,FALSE),\"\")","v":""},{"$f":"IFERROR(HLOOKUP(AW$3,Pivot!$B$3:$BB$56,DataTab!$G38,FALSE),\"\")","v":""},{"$f":"IFERROR(HLOOKUP(AX$3,Pivot!$B$3:$BB$56,DataTab!$G38,FALSE),\"\")","v":""},{"$f":"IFERROR(HLOOKUP(AY$3,Pivot!$B$3:$BB$56,DataTab!$G38,FALSE),\"\")","v":""},{"$f":"IFERROR(HLOOKUP(AZ$3,Pivot!$B$3:$BB$56,DataTab!$G38,FALSE),\"\")","v":""},{"$f":"IFERROR(HLOOKUP(BA$3,Pivot!$B$3:$BB$56,DataTab!$G38,FALSE),\"\")","v":""},{"$f":"IFERROR(HLOOKUP(BB$3,Pivot!$B$3:$BB$56,DataTab!$G38,FALSE),\"\")","v":""},{"$f":"IFERROR(HLOOKUP(BC$3,Pivot!$B$3:$BB$56,DataTab!$G38,FALSE),\"\")","v":""},{"$f":"IFERROR(HLOOKUP(BD$3,Pivot!$B$3:$BB$56,DataTab!$G38,FALSE),\"\")","v":""},{"$f":"IFERROR(HLOOKUP(BE$3,Pivot!$B$3:$BB$56,DataTab!$G38,FALSE),\"\")","v":""},{"$f":"IFERROR(HLOOKUP(BF$3,Pivot!$B$3:$BB$56,DataTab!$G38,FALSE),\"\")","v":""},{"$f":"IFERROR(HLOOKUP(BG$3,Pivot!$B$3:$BB$56,DataTab!$G38,FALSE),\"\")","v":""},{"$f":"IFERROR(HLOOKUP(BH$3,Pivot!$B$3:$BB$56,DataTab!$G38,FALSE),\"\")","v":""},null,""]
["Ohio",6872,12,3,null,{"$f":"IF(ISBLANK(E39),\"\",VLOOKUP(E39,StateListAbbrev!$A$2:$B$53,2,FALSE))","v":""},{"$f":"IF(ISBLANK(E39),\"\",VLOOKUP(F39,'2012'!$A$10:$B$62,2,FALSE))","v":""},null,{"$f":"IFERROR(HLOOKUP(I$3,Pivot!$B$3:$BB$56,DataTab!$G39,FALSE),\"\")","v":""},{"$f":"IFERROR(HLOOKUP(J$3,Pivot!$B$3:$BB$56,DataTab!$G39,FALSE),\"\")","v":""},{"$f":"IFERROR(HLOOKUP(K$3,Pivot!$B$3:$BB$56,DataTab!$G39,FALSE),\"\")","v":""},{"$f":"IFERROR(HLOOKUP(L$3,Pivot!$B$3:$BB$56,DataTab!$G39,FALSE),\"\")","v":""},{"$f":"IFERROR(HLOOKUP(M$3,Pivot!$B$3:$BB$56,DataTab!$G39,FALSE),\"\")","v":""},{"$f":"IFERROR(HLOOKUP(N$3,Pivot!$B$3:$BB$56,DataTab!$G39,FALSE),\"\")","v":""},{"$f":"IFERROR(HLOOKUP(O$3,Pivot!$B$3:$BB$56,DataTab!$G39,FALSE),\"\")","v":""},{"$f":"IFERROR(HLOOKUP(P$3,Pivot!$B$3:$BB$56,DataTab!$G39,FALSE),\"\")","v":""},{"$f":"IFERROR(HLOOKUP(Q$3,Pivot!$B$3:$BB$56,DataTab!$G39,FALSE),\"\")","v":""},{"$f":"IFERROR(HLOOKUP(R$3,Pivot!$B$3:$BB$56,DataTab!$G39,FALSE),\"\")","v":""},{"$f":"IFERROR(HLOOKUP(S$3,Pivot!$B$3:$BB$56,DataTab!$G39,FALSE),\"\")","v":""},{"$f":"IFERROR(HLOOKUP(T$3,Pivot!$B$3:$BB$56,DataTab!$G39,FALSE),\"\")","v":""},{"$f":"IFERROR(HLOOKUP(U$3,Pivot!$B$3:$BB$56,DataTab!$G39,FALSE),\"\")","v":""},{"$f":"IFERROR(HLOOKUP(V$3,Pivot!$B$3:$BB$56,DataTab!$G39,FALSE),\"\")","v":""},{"$f":"IFERROR(HLOOKUP(W$3,Pivot!$B$3:$BB$56,DataTab!$G39,FALSE),\"\")","v":""},{"$f":"IFERROR(HLOOKUP(X$3,Pivot!$B$3:$BB$56,DataTab!$G39,FALSE),\"\")","v":""},{"$f":"IFERROR(HLOOKUP(Y$3,Pivot!$B$3:$BB$56,DataTab!$G39,FALSE),\"\")","v":""},{"$f":"IFERROR(HLOOKUP(Z$3,Pivot!$B$3:$BB$56,DataTab!$G39,FALSE),\"\")","v":""},{"$f":"IFERROR(HLOOKUP(AA$3,Pivot!$B$3:$BB$56,DataTab!$G39,FALSE),\"\")","v":""},{"$f":"IFERROR(HLOOKUP(AB$3,Pivot!$B$3:$BB$56,DataTab!$G39,FALSE),\"\")","v":""},{"$f":"IFERROR(HLOOKUP(AC$3,Pivot!$B$3:$BB$56,DataTab!$G39,FALSE),\"\")","v":""},{"$f":"IFERROR(HLOOKUP(AD$3,Pivot!$B$3:$BB$56,DataTab!$G39,FALSE),\"\")","v":""},{"$f":"IFERROR(HLOOKUP(AE$3,Pivot!$B$3:$BB$56,DataTab!$G39,FALSE),\"\")","v":""},{"$f":"IFERROR(HLOOKUP(AF$3,Pivot!$B$3:$BB$56,DataTab!$G39,FALSE),\"\")","v":""},{"$f":"IFERROR(HLOOKUP(AG$3,Pivot!$B$3:$BB$56,DataTab!$G39,FALSE),\"\")","v":""},{"$f":"IFERROR(HLOOKUP(AH$3,Pivot!$B$3:$BB$56,DataTab!$G39,FALSE),\"\")","v":""},{"$f":"IFERROR(HLOOKUP(AI$3,Pivot!$B$3:$BB$56,DataTab!$G39,FALSE),\"\")","v":""},{"$f":"IFERROR(HLOOKUP(AJ$3,Pivot!$B$3:$BB$56,DataTab!$G39,FALSE),\"\")","v":""},{"$f":"IFERROR(HLOOKUP(AK$3,Pivot!$B$3:$BB$56,DataTab!$G39,FALSE),\"\")","v":""},{"$f":"IFERROR(HLOOKUP(AL$3,Pivot!$B$3:$BB$56,DataTab!$G39,FALSE),\"\")","v":""},{"$f":"IFERROR(HLOOKUP(AM$3,Pivot!$B$3:$BB$56,DataTab!$G39,FALSE),\"\")","v":""},{"$f":"IFERROR(HLOOKUP(AN$3,Pivot!$B$3:$BB$56,DataTab!$G39,FALSE),\"\")","v":""},{"$f":"IFERROR(HLOOKUP(AO$3,Pivot!$B$3:$BB$56,DataTab!$G39,FALSE),\"\")","v":""},{"$f":"IFERROR(HLOOKUP(AP$3,Pivot!$B$3:$BB$56,DataTab!$G39,FALSE),\"\")","v":""},{"$f":"IFERROR(HLOOKUP(AQ$3,Pivot!$B$3:$BB$56,DataTab!$G39,FALSE),\"\")","v":""},{"$f":"IFERROR(HLOOKUP(AR$3,Pivot!$B$3:$BB$56,DataTab!$G39,FALSE),\"\")","v":""},{"$f":"IFERROR(HLOOKUP(AS$3,Pivot!$B$3:$BB$56,DataTab!$G39,FALSE),\"\")","v":""},{"$f":"IFERROR(HLOOKUP(AT$3,Pivot!$B$3:$BB$56,DataTab!$G39,FALSE),\"\")","v":""},{"$f":"IFERROR(HLOOKUP(AU$3,Pivot!$B$3:$BB$56,DataTab!$G39,FALSE),\"\")","v":""},{"$f":"IFERROR(HLOOKUP(AV$3,Pivot!$B$3:$BB$56,DataTab!$G39,FALSE),\"\")","v":""},{"$f":"IFERROR(HLOOKUP(AW$3,Pivot!$B$3:$BB$56,DataTab!$G39,FALSE),\"\")","v":""},{"$f":"IFERROR(HLOOKUP(AX$3,Pivot!$B$3:$BB$56,DataTab!$G39,FALSE),\"\")","v":""},{"$f":"IFERROR(HLOOKUP(AY$3,Pivot!$B$3:$BB$56,DataTab!$G39,FALSE),\"\")","v":""},{"$f":"IFERROR(HLOOKUP(AZ$3,Pivot!$B$3:$BB$56,DataTab!$G39,FALSE),\"\")","v":""},{"$f":"IFERROR(HLOOKUP(BA$3,Pivot!$B$3:$BB$56,DataTab!$G39,FALSE),\"\")","v":""},{"$f":"IFERROR(HLOOKUP(BB$3,Pivot!$B$3:$BB$56,DataTab!$G39,FALSE),\"\")","v":""},{"$f":"IFERROR(HLOOKUP(BC$3,Pivot!$B$3:$BB$56,DataTab!$G39,FALSE),\"\")","v":""},{"$f":"IFERROR(HLOOKUP(BD$3,Pivot!$B$3:$BB$56,DataTab!$G39,FALSE),\"\")","v":""},{"$f":"IFERROR(HLOOKUP(BE$3,Pivot!$B$3:$BB$56,DataTab!$G39,FALSE),\"\")","v":""},{"$f":"IFERROR(HLOOKUP(BF$3,Pivot!$B$3:$BB$56,DataTab!$G39,FALSE),\"\")","v":""},{"$f":"IFERROR(HLOOKUP(BG$3,Pivot!$B$3:$BB$56,DataTab!$G39,FALSE),\"\")","v":""},{"$f":"IFERROR(HLOOKUP(BH$3,Pivot!$B$3:$BB$56,DataTab!$G39,FALSE),\"\")","v":""},null,""]
["Oklahoma",1491,30,6,null,{"$f":"IF(ISBLANK(E40),\"\",VLOOKUP(E40,StateListAbbrev!$A$2:$B$53,2,FALSE))","v":""},{"$f":"IF(ISBLANK(E40),\"\",VLOOKUP(F40,'2012'!$A$10:$B$62,2,FALSE))","v":""},null,{"$f":"IFERROR(HLOOKUP(I$3,Pivot!$B$3:$BB$56,DataTab!$G40,FALSE),\"\")","v":""},{"$f":"IFERROR(HLOOKUP(J$3,Pivot!$B$3:$BB$56,DataTab!$G40,FALSE),\"\")","v":""},{"$f":"IFERROR(HLOOKUP(K$3,Pivot!$B$3:$BB$56,DataTab!$G40,FALSE),\"\")","v":""},{"$f":"IFERROR(HLOOKUP(L$3,Pivot!$B$3:$BB$56,DataTab!$G40,FALSE),\"\")","v":""},{"$f":"IFERROR(HLOOKUP(M$3,Pivot!$B$3:$BB$56,DataTab!$G40,FALSE),\"\")","v":""},{"$f":"IFERROR(HLOOKUP(N$3,Pivot!$B$3:$BB$56,DataTab!$G40,FALSE),\"\")","v":""},{"$f":"IFERROR(HLOOKUP(O$3,Pivot!$B$3:$BB$56,DataTab!$G40,FALSE),\"\")","v":""},{"$f":"IFERROR(HLOOKUP(P$3,Pivot!$B$3:$BB$56,DataTab!$G40,FALSE),\"\")","v":""},{"$f":"IFERROR(HLOOKUP(Q$3,Pivot!$B$3:$BB$56,DataTab!$G40,FALSE),\"\")","v":""},{"$f":"IFERROR(HLOOKUP(R$3,Pivot!$B$3:$BB$56,DataTab!$G40,FALSE),\"\")","v":""},{"$f":"IFERROR(HLOOKUP(S$3,Pivot!$B$3:$BB$56,DataTab!$G40,FALSE),\"\")","v":""},{"$f":"IFERROR(HLOOKUP(T$3,Pivot!$B$3:$BB$56,DataTab!$G40,FALSE),\"\")","v":""},{"$f":"IFERROR(HLOOKUP(U$3,Pivot!$B$3:$BB$56,DataTab!$G40,FALSE),\"\")","v":""},{"$f":"IFERROR(HLOOKUP(V$3,Pivot!$B$3:$BB$56,DataTab!$G40,FALSE),\"\")","v":""},{"$f":"IFERROR(HLOOKUP(W$3,Pivot!$B$3:$BB$56,DataTab!$G40,FALSE),\"\")","v":""},{"$f":"IFERROR(HLOOKUP(X$3,Pivot!$B$3:$BB$56,DataTab!$G40,FALSE),\"\")","v":""},{"$f":"IFERROR(HLOOKUP(Y$3,Pivot!$B$3:$BB$56,DataTab!$G40,FALSE),\"\")","v":""},{"$f":"IFERROR(HLOOKUP(Z$3,Pivot!$B$3:$BB$56,DataTab!$G40,FALSE),\"\")","v":""},{"$f":"IFERROR(HLOOKUP(AA$3,Pivot!$B$3:$BB$56,DataTab!$G40,FALSE),\"\")","v":""},{"$f":"IFERROR(HLOOKUP(AB$3,Pivot!$B$3:$BB$56,DataTab!$G40,FALSE),\"\")","v":""},{"$f":"IFERROR(HLOOKUP(AC$3,Pivot!$B$3:$BB$56,DataTab!$G40,FALSE),\"\")","v":""},{"$f":"IFERROR(HLOOKUP(AD$3,Pivot!$B$3:$BB$56,DataTab!$G40,FALSE),\"\")","v":""},{"$f":"IFERROR(HLOOKUP(AE$3,Pivot!$B$3:$BB$56,DataTab!$G40,FALSE),\"\")","v":""},{"$f":"IFERROR(HLOOKUP(AF$3,Pivot!$B$3:$BB$56,DataTab!$G40,FALSE),\"\")","v":""},{"$f":"IFERROR(HLOOKUP(AG$3,Pivot!$B$3:$BB$56,DataTab!$G40,FALSE),\"\")","v":""},{"$f":"IFERROR(HLOOKUP(AH$3,Pivot!$B$3:$BB$56,DataTab!$G40,FALSE),\"\")","v":""},{"$f":"IFERROR(HLOOKUP(AI$3,Pivot!$B$3:$BB$56,DataTab!$G40,FALSE),\"\")","v":""},{"$f":"IFERROR(HLOOKUP(AJ$3,Pivot!$B$3:$BB$56,DataTab!$G40,FALSE),\"\")","v":""},{"$f":"IFERROR(HLOOKUP(AK$3,Pivot!$B$3:$BB$56,DataTab!$G40,FALSE),\"\")","v":""},{"$f":"IFERROR(HLOOKUP(AL$3,Pivot!$B$3:$BB$56,DataTab!$G40,FALSE),\"\")","v":""},{"$f":"IFERROR(HLOOKUP(AM$3,Pivot!$B$3:$BB$56,DataTab!$G40,FALSE),\"\")","v":""},{"$f":"IFERROR(HLOOKUP(AN$3,Pivot!$B$3:$BB$56,DataTab!$G40,FALSE),\"\")","v":""},{"$f":"IFERROR(HLOOKUP(AO$3,Pivot!$B$3:$BB$56,DataTab!$G40,FALSE),\"\")","v":""},{"$f":"IFERROR(HLOOKUP(AP$3,Pivot!$B$3:$BB$56,DataTab!$G40,FALSE),\"\")","v":""},{"$f":"IFERROR(HLOOKUP(AQ$3,Pivot!$B$3:$BB$56,DataTab!$G40,FALSE),\"\")","v":""},{"$f":"IFERROR(HLOOKUP(AR$3,Pivot!$B$3:$BB$56,DataTab!$G40,FALSE),\"\")","v":""},{"$f":"IFERROR(HLOOKUP(AS$3,Pivot!$B$3:$BB$56,DataTab!$G40,FALSE),\"\")","v":""},{"$f":"IFERROR(HLOOKUP(AT$3,Pivot!$B$3:$BB$56,DataTab!$G40,FALSE),\"\")","v":""},{"$f":"IFERROR(HLOOKUP(AU$3,Pivot!$B$3:$BB$56,DataTab!$G40,FALSE),\"\")","v":""},{"$f":"IFERROR(HLOOKUP(AV$3,Pivot!$B$3:$BB$56,DataTab!$G40,FALSE),\"\")","v":""},{"$f":"IFERROR(HLOOKUP(AW$3,Pivot!$B$3:$BB$56,DataTab!$G40,FALSE),\"\")","v":""},{"$f":"IFERROR(HLOOKUP(AX$3,Pivot!$B$3:$BB$56,DataTab!$G40,FALSE),\"\")","v":""},{"$f":"IFERROR(HLOOKUP(AY$3,Pivot!$B$3:$BB$56,DataTab!$G40,FALSE),\"\")","v":""},{"$f":"IFERROR(HLOOKUP(AZ$3,Pivot!$B$3:$BB$56,DataTab!$G40,FALSE),\"\")","v":""},{"$f":"IFERROR(HLOOKUP(BA$3,Pivot!$B$3:$BB$56,DataTab!$G40,FALSE),\"\")","v":""},{"$f":"IFERROR(HLOOKUP(BB$3,Pivot!$B$3:$BB$56,DataTab!$G40,FALSE),\"\")","v":""},{"$f":"IFERROR(HLOOKUP(BC$3,Pivot!$B$3:$BB$56,DataTab!$G40,FALSE),\"\")","v":""},{"$f":"IFERROR(HLOOKUP(BD$3,Pivot!$B$3:$BB$56,DataTab!$G40,FALSE),\"\")","v":""},{"$f":"IFERROR(HLOOKUP(BE$3,Pivot!$B$3:$BB$56,DataTab!$G40,FALSE),\"\")","v":""},{"$f":"IFERROR(HLOOKUP(BF$3,Pivot!$B$3:$BB$56,DataTab!$G40,FALSE),\"\")","v":""},{"$f":"IFERROR(HLOOKUP(BG$3,Pivot!$B$3:$BB$56,DataTab!$G40,FALSE),\"\")","v":""},{"$f":"IFERROR(HLOOKUP(BH$3,Pivot!$B$3:$BB$56,DataTab!$G40,FALSE),\"\")","v":""},null,""]
["Oregon",954,40,8,null,{"$f":"IF(ISBLANK(E41),\"\",VLOOKUP(E41,StateListAbbrev!$A$2:$B$53,2,FALSE))","v":""},{"$f":"IF(ISBLANK(E41),\"\",VLOOKUP(F41,'2012'!$A$10:$B$62,2,FALSE))","v":""},null,{"$f":"IFERROR(HLOOKUP(I$3,Pivot!$B$3:$BB$56,DataTab!$G41,FALSE),\"\")","v":""},{"$f":"IFERROR(HLOOKUP(J$3,Pivot!$B$3:$BB$56,DataTab!$G41,FALSE),\"\")","v":""},{"$f":"IFERROR(HLOOKUP(K$3,Pivot!$B$3:$BB$56,DataTab!$G41,FALSE),\"\")","v":""},{"$f":"IFERROR(HLOOKUP(L$3,Pivot!$B$3:$BB$56,DataTab!$G41,FALSE),\"\")","v":""},{"$f":"IFERROR(HLOOKUP(M$3,Pivot!$B$3:$BB$56,DataTab!$G41,FALSE),\"\")","v":""},{"$f":"IFERROR(HLOOKUP(N$3,Pivot!$B$3:$BB$56,DataTab!$G41,FALSE),\"\")","v":""},{"$f":"IFERROR(HLOOKUP(O$3,Pivot!$B$3:$BB$56,DataTab!$G41,FALSE),\"\")","v":""},{"$f":"IFERROR(HLOOKUP(P$3,Pivot!$B$3:$BB$56,DataTab!$G41,FALSE),\"\")","v":""},{"$f":"IFERROR(HLOOKUP(Q$3,Pivot!$B$3:$BB$56,DataTab!$G41,FALSE),\"\")","v":""},{"$f":"IFERROR(HLOOKUP(R$3,Pivot!$B$3:$BB$56,DataTab!$G41,FALSE),\"\")","v":""},{"$f":"IFERROR(HLOOKUP(S$3,Pivot!$B$3:$BB$56,DataTab!$G41,FALSE),\"\")","v":""},{"$f":"IFERROR(HLOOKUP(T$3,Pivot!$B$3:$BB$56,DataTab!$G41,FALSE),\"\")","v":""},{"$f":"IFERROR(HLOOKUP(U$3,Pivot!$B$3:$BB$56,DataTab!$G41,FALSE),\"\")","v":""},{"$f":"IFERROR(HLOOKUP(V$3,Pivot!$B$3:$BB$56,DataTab!$G41,FALSE),\"\")","v":""},{"$f":"IFERROR(HLOOKUP(W$3,Pivot!$B$3:$BB$56,DataTab!$G41,FALSE),\"\")","v":""},{"$f":"IFERROR(HLOOKUP(X$3,Pivot!$B$3:$BB$56,DataTab!$G41,FALSE),\"\")","v":""},{"$f":"IFERROR(HLOOKUP(Y$3,Pivot!$B$3:$BB$56,DataTab!$G41,FALSE),\"\")","v":""},{"$f":"IFERROR(HLOOKUP(Z$3,Pivot!$B$3:$BB$56,DataTab!$G41,FALSE),\"\")","v":""},{"$f":"IFERROR(HLOOKUP(AA$3,Pivot!$B$3:$BB$56,DataTab!$G41,FALSE),\"\")","v":""},{"$f":"IFERROR(HLOOKUP(AB$3,Pivot!$B$3:$BB$56,DataTab!$G41,FALSE),\"\")","v":""},{"$f":"IFERROR(HLOOKUP(AC$3,Pivot!$B$3:$BB$56,DataTab!$G41,FALSE),\"\")","v":""},{"$f":"IFERROR(HLOOKUP(AD$3,Pivot!$B$3:$BB$56,DataTab!$G41,FALSE),\"\")","v":""},{"$f":"IFERROR(HLOOKUP(AE$3,Pivot!$B$3:$BB$56,DataTab!$G41,FALSE),\"\")","v":""},{"$f":"IFERROR(HLOOKUP(AF$3,Pivot!$B$3:$BB$56,DataTab!$G41,FALSE),\"\")","v":""},{"$f":"IFERROR(HLOOKUP(AG$3,Pivot!$B$3:$BB$56,DataTab!$G41,FALSE),\"\")","v":""},{"$f":"IFERROR(HLOOKUP(AH$3,Pivot!$B$3:$BB$56,DataTab!$G41,FALSE),\"\")","v":""},{"$f":"IFERROR(HLOOKUP(AI$3,Pivot!$B$3:$BB$56,DataTab!$G41,FALSE),\"\")","v":""},{"$f":"IFERROR(HLOOKUP(AJ$3,Pivot!$B$3:$BB$56,DataTab!$G41,FALSE),\"\")","v":""},{"$f":"IFERROR(HLOOKUP(AK$3,Pivot!$B$3:$BB$56,DataTab!$G41,FALSE),\"\")","v":""},{"$f":"IFERROR(HLOOKUP(AL$3,Pivot!$B$3:$BB$56,DataTab!$G41,FALSE),\"\")","v":""},{"$f":"IFERROR(HLOOKUP(AM$3,Pivot!$B$3:$BB$56,DataTab!$G41,FALSE),\"\")","v":""},{"$f":"IFERROR(HLOOKUP(AN$3,Pivot!$B$3:$BB$56,DataTab!$G41,FALSE),\"\")","v":""},{"$f":"IFERROR(HLOOKUP(AO$3,Pivot!$B$3:$BB$56,DataTab!$G41,FALSE),\"\")","v":""},{"$f":"IFERROR(HLOOKUP(AP$3,Pivot!$B$3:$BB$56,DataTab!$G41,FALSE),\"\")","v":""},{"$f":"IFERROR(HLOOKUP(AQ$3,Pivot!$B$3:$BB$56,DataTab!$G41,FALSE),\"\")","v":""},{"$f":"IFERROR(HLOOKUP(AR$3,Pivot!$B$3:$BB$56,DataTab!$G41,FALSE),\"\")","v":""},{"$f":"IFERROR(HLOOKUP(AS$3,Pivot!$B$3:$BB$56,DataTab!$G41,FALSE),\"\")","v":""},{"$f":"IFERROR(HLOOKUP(AT$3,Pivot!$B$3:$BB$56,DataTab!$G41,FALSE),\"\")","v":""},{"$f":"IFERROR(HLOOKUP(AU$3,Pivot!$B$3:$BB$56,DataTab!$G41,FALSE),\"\")","v":""},{"$f":"IFERROR(HLOOKUP(AV$3,Pivot!$B$3:$BB$56,DataTab!$G41,FALSE),\"\")","v":""},{"$f":"IFERROR(HLOOKUP(AW$3,Pivot!$B$3:$BB$56,DataTab!$G41,FALSE),\"\")","v":""},{"$f":"IFERROR(HLOOKUP(AX$3,Pivot!$B$3:$BB$56,DataTab!$G41,FALSE),\"\")","v":""},{"$f":"IFERROR(HLOOKUP(AY$3,Pivot!$B$3:$BB$56,DataTab!$G41,FALSE),\"\")","v":""},{"$f":"IFERROR(HLOOKUP(AZ$3,Pivot!$B$3:$BB$56,DataTab!$G41,FALSE),\"\")","v":""},{"$f":"IFERROR(HLOOKUP(BA$3,Pivot!$B$3:$BB$56,DataTab!$G41,FALSE),\"\")","v":""},{"$f":"IFERROR(HLOOKUP(BB$3,Pivot!$B$3:$BB$56,DataTab!$G41,FALSE),\"\")","v":""},{"$f":"IFERROR(HLOOKUP(BC$3,Pivot!$B$3:$BB$56,DataTab!$G41,FALSE),\"\")","v":""},{"$f":"IFERROR(HLOOKUP(BD$3,Pivot!$B$3:$BB$56,DataTab!$G41,FALSE),\"\")","v":""},{"$f":"IFERROR(HLOOKUP(BE$3,Pivot!$B$3:$BB$56,DataTab!$G41,FALSE),\"\")","v":""},{"$f":"IFERROR(HLOOKUP(BF$3,Pivot!$B$3:$BB$56,DataTab!$G41,FALSE),\"\")","v":""},{"$f":"IFERROR(HLOOKUP(BG$3,Pivot!$B$3:$BB$56,DataTab!$G41,FALSE),\"\")","v":""},{"$f":"IFERROR(HLOOKUP(BH$3,Pivot!$B$3:$BB$56,DataTab!$G41,FALSE),\"\")","v":""},null,""]
["Pennsylvania",4588,15,3,null,{"$f":"IF(ISBLANK(E42),\"\",VLOOKUP(E42,StateListAbbrev!$A$2:$B$53,2,FALSE))","v":""},{"$f":"IF(ISBLANK(E42),\"\",VLOOKUP(F42,'2012'!$A$10:$B$62,2,FALSE))","v":""},null,{"$f":"IFERROR(HLOOKUP(I$3,Pivot!$B$3:$BB$56,DataTab!$G42,FALSE),\"\")","v":""},{"$f":"IFERROR(HLOOKUP(J$3,Pivot!$B$3:$BB$56,DataTab!$G42,FALSE),\"\")","v":""},{"$f":"IFERROR(HLOOKUP(K$3,Pivot!$B$3:$BB$56,DataTab!$G42,FALSE),\"\")","v":""},{"$f":"IFERROR(HLOOKUP(L$3,Pivot!$B$3:$BB$56,DataTab!$G42,FALSE),\"\")","v":""},{"$f":"IFERROR(HLOOKUP(M$3,Pivot!$B$3:$BB$56,DataTab!$G42,FALSE),\"\")","v":""},{"$f":"IFERROR(HLOOKUP(N$3,Pivot!$B$3:$BB$56,DataTab!$G42,FALSE),\"\")","v":""},{"$f":"IFERROR(HLOOKUP(O$3,Pivot!$B$3:$BB$56,DataTab!$G42,FALSE),\"\")","v":""},{"$f":"IFERROR(HLOOKUP(P$3,Pivot!$B$3:$BB$56,DataTab!$G42,FALSE),\"\")","v":""},{"$f":"IFERROR(HLOOKUP(Q$3,Pivot!$B$3:$BB$56,DataTab!$G42,FALSE),\"\")","v":""},{"$f":"IFERROR(HLOOKUP(R$3,Pivot!$B$3:$BB$56,DataTab!$G42,FALSE),\"\")","v":""},{"$f":"IFERROR(HLOOKUP(S$3,Pivot!$B$3:$BB$56,DataTab!$G42,FALSE),\"\")","v":""},{"$f":"IFERROR(HLOOKUP(T$3,Pivot!$B$3:$BB$56,DataTab!$G42,FALSE),\"\")","v":""},{"$f":"IFERROR(HLOOKUP(U$3,Pivot!$B$3:$BB$56,DataTab!$G42,FALSE),\"\")","v":""},{"$f":"IFERROR(HLOOKUP(V$3,Pivot!$B$3:$BB$56,DataTab!$G42,FALSE),\"\")","v":""},{"$f":"IFERROR(HLOOKUP(W$3,Pivot!$B$3:$BB$56,DataTab!$G42,FALSE),\"\")","v":""},{"$f":"IFERROR(HLOOKUP(X$3,Pivot!$B$3:$BB$56,DataTab!$G42,FALSE),\"\")","v":""},{"$f":"IFERROR(HLOOKUP(Y$3,Pivot!$B$3:$BB$56,DataTab!$G42,FALSE),\"\")","v":""},{"$f":"IFERROR(HLOOKUP(Z$3,Pivot!$B$3:$BB$56,DataTab!$G42,FALSE),\"\")","v":""},{"$f":"IFERROR(HLOOKUP(AA$3,Pivot!$B$3:$BB$56,DataTab!$G42,FALSE),\"\")","v":""},{"$f":"IFERROR(HLOOKUP(AB$3,Pivot!$B$3:$BB$56,DataTab!$G42,FALSE),\"\")","v":""},{"$f":"IFERROR(HLOOKUP(AC$3,Pivot!$B$3:$BB$56,DataTab!$G42,FALSE),\"\")","v":""},{"$f":"IFERROR(HLOOKUP(AD$3,Pivot!$B$3:$BB$56,DataTab!$G42,FALSE),\"\")","v":""},{"$f":"IFERROR(HLOOKUP(AE$3,Pivot!$B$3:$BB$56,DataTab!$G42,FALSE),\"\")","v":""},{"$f":"IFERROR(HLOOKUP(AF$3,Pivot!$B$3:$BB$56,DataTab!$G42,FALSE),\"\")","v":""},{"$f":"IFERROR(HLOOKUP(AG$3,Pivot!$B$3:$BB$56,DataTab!$G42,FALSE),\"\")","v":""},{"$f":"IFERROR(HLOOKUP(AH$3,Pivot!$B$3:$BB$56,DataTab!$G42,FALSE),\"\")","v":""},{"$f":"IFERROR(HLOOKUP(AI$3,Pivot!$B$3:$BB$56,DataTab!$G42,FALSE),\"\")","v":""},{"$f":"IFERROR(HLOOKUP(AJ$3,Pivot!$B$3:$BB$56,DataTab!$G42,FALSE),\"\")","v":""},{"$f":"IFERROR(HLOOKUP(AK$3,Pivot!$B$3:$BB$56,DataTab!$G42,FALSE),\"\")","v":""},{"$f":"IFERROR(HLOOKUP(AL$3,Pivot!$B$3:$BB$56,DataTab!$G42,FALSE),\"\")","v":""},{"$f":"IFERROR(HLOOKUP(AM$3,Pivot!$B$3:$BB$56,DataTab!$G42,FALSE),\"\")","v":""},{"$f":"IFERROR(HLOOKUP(AN$3,Pivot!$B$3:$BB$56,DataTab!$G42,FALSE),\"\")","v":""},{"$f":"IFERROR(HLOOKUP(AO$3,Pivot!$B$3:$BB$56,DataTab!$G42,FALSE),\"\")","v":""},{"$f":"IFERROR(HLOOKUP(AP$3,Pivot!$B$3:$BB$56,DataTab!$G42,FALSE),\"\")","v":""},{"$f":"IFERROR(HLOOKUP(AQ$3,Pivot!$B$3:$BB$56,DataTab!$G42,FALSE),\"\")","v":""},{"$f":"IFERROR(HLOOKUP(AR$3,Pivot!$B$3:$BB$56,DataTab!$G42,FALSE),\"\")","v":""},{"$f":"IFERROR(HLOOKUP(AS$3,Pivot!$B$3:$BB$56,DataTab!$G42,FALSE),\"\")","v":""},{"$f":"IFERROR(HLOOKUP(AT$3,Pivot!$B$3:$BB$56,DataTab!$G42,FALSE),\"\")","v":""},{"$f":"IFERROR(HLOOKUP(AU$3,Pivot!$B$3:$BB$56,DataTab!$G42,FALSE),\"\")","v":""},{"$f":"IFERROR(HLOOKUP(AV$3,Pivot!$B$3:$BB$56,DataTab!$G42,FALSE),\"\")","v":""},{"$f":"IFERROR(HLOOKUP(AW$3,Pivot!$B$3:$BB$56,DataTab!$G42,FALSE),\"\")","v":""},{"$f":"IFERROR(HLOOKUP(AX$3,Pivot!$B$3:$BB$56,DataTab!$G42,FALSE),\"\")","v":""},{"$f":"IFERROR(HLOOKUP(AY$3,Pivot!$B$3:$BB$56,DataTab!$G42,FALSE),\"\")","v":""},{"$f":"IFERROR(HLOOKUP(AZ$3,Pivot!$B$3:$BB$56,DataTab!$G42,FALSE),\"\")","v":""},{"$f":"IFERROR(HLOOKUP(BA$3,Pivot!$B$3:$BB$56,DataTab!$G42,FALSE),\"\")","v":""},{"$f":"IFERROR(HLOOKUP(BB$3,Pivot!$B$3:$BB$56,DataTab!$G42,FALSE),\"\")","v":""},{"$f":"IFERROR(HLOOKUP(BC$3,Pivot!$B$3:$BB$56,DataTab!$G42,FALSE),\"\")","v":""},{"$f":"IFERROR(HLOOKUP(BD$3,Pivot!$B$3:$BB$56,DataTab!$G42,FALSE),\"\")","v":""},{"$f":"IFERROR(HLOOKUP(BE$3,Pivot!$B$3:$BB$56,DataTab!$G42,FALSE),\"\")","v":""},{"$f":"IFERROR(HLOOKUP(BF$3,Pivot!$B$3:$BB$56,DataTab!$G42,FALSE),\"\")","v":""},{"$f":"IFERROR(HLOOKUP(BG$3,Pivot!$B$3:$BB$56,DataTab!$G42,FALSE),\"\")","v":""},{"$f":"IFERROR(HLOOKUP(BH$3,Pivot!$B$3:$BB$56,DataTab!$G42,FALSE),\"\")","v":""},null,""]
["Rhode Island",462,44,9,null,{"$f":"IF(ISBLANK(E43),\"\",VLOOKUP(E43,StateListAbbrev!$A$2:$B$53,2,FALSE))","v":""},{"$f":"IF(ISBLANK(E43),\"\",VLOOKUP(F43,'2012'!$A$10:$B$62,2,FALSE))","v":""},null,{"$f":"IFERROR(HLOOKUP(I$3,Pivot!$B$3:$BB$56,DataTab!$G43,FALSE),\"\")","v":""},{"$f":"IFERROR(HLOOKUP(J$3,Pivot!$B$3:$BB$56,DataTab!$G43,FALSE),\"\")","v":""},{"$f":"IFERROR(HLOOKUP(K$3,Pivot!$B$3:$BB$56,DataTab!$G43,FALSE),\"\")","v":""},{"$f":"IFERROR(HLOOKUP(L$3,Pivot!$B$3:$BB$56,DataTab!$G43,FALSE),\"\")","v":""},{"$f":"IFERROR(HLOOKUP(M$3,Pivot!$B$3:$BB$56,DataTab!$G43,FALSE),\"\")","v":""},{"$f":"IFERROR(HLOOKUP(N$3,Pivot!$B$3:$BB$56,DataTab!$G43,FALSE),\"\")","v":""},{"$f":"IFERROR(HLOOKUP(O$3,Pivot!$B$3:$BB$56,DataTab!$G43,FALSE),\"\")","v":""},{"$f":"IFERROR(HLOOKUP(P$3,Pivot!$B$3:$BB$56,DataTab!$G43,FALSE),\"\")","v":""},{"$f":"IFERROR(HLOOKUP(Q$3,Pivot!$B$3:$BB$56,DataTab!$G43,FALSE),\"\")","v":""},{"$f":"IFERROR(HLOOKUP(R$3,Pivot!$B$3:$BB$56,DataTab!$G43,FALSE),\"\")","v":""},{"$f":"IFERROR(HLOOKUP(S$3,Pivot!$B$3:$BB$56,DataTab!$G43,FALSE),\"\")","v":""},{"$f":"IFERROR(HLOOKUP(T$3,Pivot!$B$3:$BB$56,DataTab!$G43,FALSE),\"\")","v":""},{"$f":"IFERROR(HLOOKUP(U$3,Pivot!$B$3:$BB$56,DataTab!$G43,FALSE),\"\")","v":""},{"$f":"IFERROR(HLOOKUP(V$3,Pivot!$B$3:$BB$56,DataTab!$G43,FALSE),\"\")","v":""},{"$f":"IFERROR(HLOOKUP(W$3,Pivot!$B$3:$BB$56,DataTab!$G43,FALSE),\"\")","v":""},{"$f":"IFERROR(HLOOKUP(X$3,Pivot!$B$3:$BB$56,DataTab!$G43,FALSE),\"\")","v":""},{"$f":"IFERROR(HLOOKUP(Y$3,Pivot!$B$3:$BB$56,DataTab!$G43,FALSE),\"\")","v":""},{"$f":"IFERROR(HLOOKUP(Z$3,Pivot!$B$3:$BB$56,DataTab!$G43,FALSE),\"\")","v":""},{"$f":"IFERROR(HLOOKUP(AA$3,Pivot!$B$3:$BB$56,DataTab!$G43,FALSE),\"\")","v":""},{"$f":"IFERROR(HLOOKUP(AB$3,Pivot!$B$3:$BB$56,DataTab!$G43,FALSE),\"\")","v":""},{"$f":"IFERROR(HLOOKUP(AC$3,Pivot!$B$3:$BB$56,DataTab!$G43,FALSE),\"\")","v":""},{"$f":"IFERROR(HLOOKUP(AD$3,Pivot!$B$3:$BB$56,DataTab!$G43,FALSE),\"\")","v":""},{"$f":"IFERROR(HLOOKUP(AE$3,Pivot!$B$3:$BB$56,DataTab!$G43,FALSE),\"\")","v":""},{"$f":"IFERROR(HLOOKUP(AF$3,Pivot!$B$3:$BB$56,DataTab!$G43,FALSE),\"\")","v":""},{"$f":"IFERROR(HLOOKUP(AG$3,Pivot!$B$3:$BB$56,DataTab!$G43,FALSE),\"\")","v":""},{"$f":"IFERROR(HLOOKUP(AH$3,Pivot!$B$3:$BB$56,DataTab!$G43,FALSE),\"\")","v":""},{"$f":"IFERROR(HLOOKUP(AI$3,Pivot!$B$3:$BB$56,DataTab!$G43,FALSE),\"\")","v":""},{"$f":"IFERROR(HLOOKUP(AJ$3,Pivot!$B$3:$BB$56,DataTab!$G43,FALSE),\"\")","v":""},{"$f":"IFERROR(HLOOKUP(AK$3,Pivot!$B$3:$BB$56,DataTab!$G43,FALSE),\"\")","v":""},{"$f":"IFERROR(HLOOKUP(AL$3,Pivot!$B$3:$BB$56,DataTab!$G43,FALSE),\"\")","v":""},{"$f":"IFERROR(HLOOKUP(AM$3,Pivot!$B$3:$BB$56,DataTab!$G43,FALSE),\"\")","v":""},{"$f":"IFERROR(HLOOKUP(AN$3,Pivot!$B$3:$BB$56,DataTab!$G43,FALSE),\"\")","v":""},{"$f":"IFERROR(HLOOKUP(AO$3,Pivot!$B$3:$BB$56,DataTab!$G43,FALSE),\"\")","v":""},{"$f":"IFERROR(HLOOKUP(AP$3,Pivot!$B$3:$BB$56,DataTab!$G43,FALSE),\"\")","v":""},{"$f":"IFERROR(HLOOKUP(AQ$3,Pivot!$B$3:$BB$56,DataTab!$G43,FALSE),\"\")","v":""},{"$f":"IFERROR(HLOOKUP(AR$3,Pivot!$B$3:$BB$56,DataTab!$G43,FALSE),\"\")","v":""},{"$f":"IFERROR(HLOOKUP(AS$3,Pivot!$B$3:$BB$56,DataTab!$G43,FALSE),\"\")","v":""},{"$f":"IFERROR(HLOOKUP(AT$3,Pivot!$B$3:$BB$56,DataTab!$G43,FALSE),\"\")","v":""},{"$f":"IFERROR(HLOOKUP(AU$3,Pivot!$B$3:$BB$56,DataTab!$G43,FALSE),\"\")","v":""},{"$f":"IFERROR(HLOOKUP(AV$3,Pivot!$B$3:$BB$56,DataTab!$G43,FALSE),\"\")","v":""},{"$f":"IFERROR(HLOOKUP(AW$3,Pivot!$B$3:$BB$56,DataTab!$G43,FALSE),\"\")","v":""},{"$f":"IFERROR(HLOOKUP(AX$3,Pivot!$B$3:$BB$56,DataTab!$G43,FALSE),\"\")","v":""},{"$f":"IFERROR(HLOOKUP(AY$3,Pivot!$B$3:$BB$56,DataTab!$G43,FALSE),\"\")","v":""},{"$f":"IFERROR(HLOOKUP(AZ$3,Pivot!$B$3:$BB$56,DataTab!$G43,FALSE),\"\")","v":""},{"$f":"IFERROR(HLOOKUP(BA$3,Pivot!$B$3:$BB$56,DataTab!$G43,FALSE),\"\")","v":""},{"$f":"IFERROR(HLOOKUP(BB$3,Pivot!$B$3:$BB$56,DataTab!$G43,FALSE),\"\")","v":""},{"$f":"IFERROR(HLOOKUP(BC$3,Pivot!$B$3:$BB$56,DataTab!$G43,FALSE),\"\")","v":""},{"$f":"IFERROR(HLOOKUP(BD$3,Pivot!$B$3:$BB$56,DataTab!$G43,FALSE),\"\")","v":""},{"$f":"IFERROR(HLOOKUP(BE$3,Pivot!$B$3:$BB$56,DataTab!$G43,FALSE),\"\")","v":""},{"$f":"IFERROR(HLOOKUP(BF$3,Pivot!$B$3:$BB$56,DataTab!$G43,FALSE),\"\")","v":""},{"$f":"IFERROR(HLOOKUP(BG$3,Pivot!$B$3:$BB$56,DataTab!$G43,FALSE),\"\")","v":""},{"$f":"IFERROR(HLOOKUP(BH$3,Pivot!$B$3:$BB$56,DataTab!$G43,FALSE),\"\")","v":""},null,""]
["South Carolina",1583,29,6,null,{"$f":"IF(ISBLANK(E44),\"\",VLOOKUP(E44,StateListAbbrev!$A$2:$B$53,2,FALSE))","v":""},{"$f":"IF(ISBLANK(E44),\"\",VLOOKUP(F44,'2012'!$A$10:$B$62,2,FALSE))","v":""},null,{"$f":"IFERROR(HLOOKUP(I$3,Pivot!$B$3:$BB$56,DataTab!$G44,FALSE),\"\")","v":""},{"$f":"IFERROR(HLOOKUP(J$3,Pivot!$B$3:$BB$56,DataTab!$G44,FALSE),\"\")","v":""},{"$f":"IFERROR(HLOOKUP(K$3,Pivot!$B$3:$BB$56,DataTab!$G44,FALSE),\"\")","v":""},{"$f":"IFERROR(HLOOKUP(L$3,Pivot!$B$3:$BB$56,DataTab!$G44,FALSE),\"\")","v":""},{"$f":"IFERROR(HLOOKUP(M$3,Pivot!$B$3:$BB$56,DataTab!$G44,FALSE),\"\")","v":""},{"$f":"IFERROR(HLOOKUP(N$3,Pivot!$B$3:$BB$56,DataTab!$G44,FALSE),\"\")","v":""},{"$f":"IFERROR(HLOOKUP(O$3,Pivot!$B$3:$BB$56,DataTab!$G44,FALSE),\"\")","v":""},{"$f":"IFERROR(HLOOKUP(P$3,Pivot!$B$3:$BB$56,DataTab!$G44,FALSE),\"\")","v":""},{"$f":"IFERROR(HLOOKUP(Q$3,Pivot!$B$3:$BB$56,DataTab!$G44,FALSE),\"\")","v":""},{"$f":"IFERROR(HLOOKUP(R$3,Pivot!$B$3:$BB$56,DataTab!$G44,FALSE),\"\")","v":""},{"$f":"IFERROR(HLOOKUP(S$3,Pivot!$B$3:$BB$56,DataTab!$G44,FALSE),\"\")","v":""},{"$f":"IFERROR(HLOOKUP(T$3,Pivot!$B$3:$BB$56,DataTab!$G44,FALSE),\"\")","v":""},{"$f":"IFERROR(HLOOKUP(U$3,Pivot!$B$3:$BB$56,DataTab!$G44,FALSE),\"\")","v":""},{"$f":"IFERROR(HLOOKUP(V$3,Pivot!$B$3:$BB$56,DataTab!$G44,FALSE),\"\")","v":""},{"$f":"IFERROR(HLOOKUP(W$3,Pivot!$B$3:$BB$56,DataTab!$G44,FALSE),\"\")","v":""},{"$f":"IFERROR(HLOOKUP(X$3,Pivot!$B$3:$BB$56,DataTab!$G44,FALSE),\"\")","v":""},{"$f":"IFERROR(HLOOKUP(Y$3,Pivot!$B$3:$BB$56,DataTab!$G44,FALSE),\"\")","v":""},{"$f":"IFERROR(HLOOKUP(Z$3,Pivot!$B$3:$BB$56,DataTab!$G44,FALSE),\"\")","v":""},{"$f":"IFERROR(HLOOKUP(AA$3,Pivot!$B$3:$BB$56,DataTab!$G44,FALSE),\"\")","v":""},{"$f":"IFERROR(HLOOKUP(AB$3,Pivot!$B$3:$BB$56,DataTab!$G44,FALSE),\"\")","v":""},{"$f":"IFERROR(HLOOKUP(AC$3,Pivot!$B$3:$BB$56,DataTab!$G44,FALSE),\"\")","v":""},{"$f":"IFERROR(HLOOKUP(AD$3,Pivot!$B$3:$BB$56,DataTab!$G44,FALSE),\"\")","v":""},{"$f":"IFERROR(HLOOKUP(AE$3,Pivot!$B$3:$BB$56,DataTab!$G44,FALSE),\"\")","v":""},{"$f":"IFERROR(HLOOKUP(AF$3,Pivot!$B$3:$BB$56,DataTab!$G44,FALSE),\"\")","v":""},{"$f":"IFERROR(HLOOKUP(AG$3,Pivot!$B$3:$BB$56,DataTab!$G44,FALSE),\"\")","v":""},{"$f":"IFERROR(HLOOKUP(AH$3,Pivot!$B$3:$BB$56,DataTab!$G44,FALSE),\"\")","v":""},{"$f":"IFERROR(HLOOKUP(AI$3,Pivot!$B$3:$BB$56,DataTab!$G44,FALSE),\"\")","v":""},{"$f":"IFERROR(HLOOKUP(AJ$3,Pivot!$B$3:$BB$56,DataTab!$G44,FALSE),\"\")","v":""},{"$f":"IFERROR(HLOOKUP(AK$3,Pivot!$B$3:$BB$56,DataTab!$G44,FALSE),\"\")","v":""},{"$f":"IFERROR(HLOOKUP(AL$3,Pivot!$B$3:$BB$56,DataTab!$G44,FALSE),\"\")","v":""},{"$f":"IFERROR(HLOOKUP(AM$3,Pivot!$B$3:$BB$56,DataTab!$G44,FALSE),\"\")","v":""},{"$f":"IFERROR(HLOOKUP(AN$3,Pivot!$B$3:$BB$56,DataTab!$G44,FALSE),\"\")","v":""},{"$f":"IFERROR(HLOOKUP(AO$3,Pivot!$B$3:$BB$56,DataTab!$G44,FALSE),\"\")","v":""},{"$f":"IFERROR(HLOOKUP(AP$3,Pivot!$B$3:$BB$56,DataTab!$G44,FALSE),\"\")","v":""},{"$f":"IFERROR(HLOOKUP(AQ$3,Pivot!$B$3:$BB$56,DataTab!$G44,FALSE),\"\")","v":""},{"$f":"IFERROR(HLOOKUP(AR$3,Pivot!$B$3:$BB$56,DataTab!$G44,FALSE),\"\")","v":""},{"$f":"IFERROR(HLOOKUP(AS$3,Pivot!$B$3:$BB$56,DataTab!$G44,FALSE),\"\")","v":""},{"$f":"IFERROR(HLOOKUP(AT$3,Pivot!$B$3:$BB$56,DataTab!$G44,FALSE),\"\")","v":""},{"$f":"IFERROR(HLOOKUP(AU$3,Pivot!$B$3:$BB$56,DataTab!$G44,FALSE),\"\")","v":""},{"$f":"IFERROR(HLOOKUP(AV$3,Pivot!$B$3:$BB$56,DataTab!$G44,FALSE),\"\")","v":""},{"$f":"IFERROR(HLOOKUP(AW$3,Pivot!$B$3:$BB$56,DataTab!$G44,FALSE),\"\")","v":""},{"$f":"IFERROR(HLOOKUP(AX$3,Pivot!$B$3:$BB$56,DataTab!$G44,FALSE),\"\")","v":""},{"$f":"IFERROR(HLOOKUP(AY$3,Pivot!$B$3:$BB$56,DataTab!$G44,FALSE),\"\")","v":""},{"$f":"IFERROR(HLOOKUP(AZ$3,Pivot!$B$3:$BB$56,DataTab!$G44,FALSE),\"\")","v":""},{"$f":"IFERROR(HLOOKUP(BA$3,Pivot!$B$3:$BB$56,DataTab!$G44,FALSE),\"\")","v":""},{"$f":"IFERROR(HLOOKUP(BB$3,Pivot!$B$3:$BB$56,DataTab!$G44,FALSE),\"\")","v":""},{"$f":"IFERROR(HLOOKUP(BC$3,Pivot!$B$3:$BB$56,DataTab!$G44,FALSE),\"\")","v":""},{"$f":"IFERROR(HLOOKUP(BD$3,Pivot!$B$3:$BB$56,DataTab!$G44,FALSE),\"\")","v":""},{"$f":"IFERROR(HLOOKUP(BE$3,Pivot!$B$3:$BB$56,DataTab!$G44,FALSE),\"\")","v":""},{"$f":"IFERROR(HLOOKUP(BF$3,Pivot!$B$3:$BB$56,DataTab!$G44,FALSE),\"\")","v":""},{"$f":"IFERROR(HLOOKUP(BG$3,Pivot!$B$3:$BB$56,DataTab!$G44,FALSE),\"\")","v":""},{"$f":"IFERROR(HLOOKUP(BH$3,Pivot!$B$3:$BB$56,DataTab!$G44,FALSE),\"\")","v":""},null,""]
["South Dakota",394,45,9,null,{"$f":"IF(ISBLANK(E45),\"\",VLOOKUP(E45,StateListAbbrev!$A$2:$B$53,2,FALSE))","v":""},{"$f":"IF(ISBLANK(E45),\"\",VLOOKUP(F45,'2012'!$A$10:$B$62,2,FALSE))","v":""},null,{"$f":"IFERROR(HLOOKUP(I$3,Pivot!$B$3:$BB$56,DataTab!$G45,FALSE),\"\")","v":""},{"$f":"IFERROR(HLOOKUP(J$3,Pivot!$B$3:$BB$56,DataTab!$G45,FALSE),\"\")","v":""},{"$f":"IFERROR(HLOOKUP(K$3,Pivot!$B$3:$BB$56,DataTab!$G45,FALSE),\"\")","v":""},{"$f":"IFERROR(HLOOKUP(L$3,Pivot!$B$3:$BB$56,DataTab!$G45,FALSE),\"\")","v":""},{"$f":"IFERROR(HLOOKUP(M$3,Pivot!$B$3:$BB$56,DataTab!$G45,FALSE),\"\")","v":""},{"$f":"IFERROR(HLOOKUP(N$3,Pivot!$B$3:$BB$56,DataTab!$G45,FALSE),\"\")","v":""},{"$f":"IFERROR(HLOOKUP(O$3,Pivot!$B$3:$BB$56,DataTab!$G45,FALSE),\"\")","v":""},{"$f":"IFERROR(HLOOKUP(P$3,Pivot!$B$3:$BB$56,DataTab!$G45,FALSE),\"\")","v":""},{"$f":"IFERROR(HLOOKUP(Q$3,Pivot!$B$3:$BB$56,DataTab!$G45,FALSE),\"\")","v":""},{"$f":"IFERROR(HLOOKUP(R$3,Pivot!$B$3:$BB$56,DataTab!$G45,FALSE),\"\")","v":""},{"$f":"IFERROR(HLOOKUP(S$3,Pivot!$B$3:$BB$56,DataTab!$G45,FALSE),\"\")","v":""},{"$f":"IFERROR(HLOOKUP(T$3,Pivot!$B$3:$BB$56,DataTab!$G45,FALSE),\"\")","v":""},{"$f":"IFERROR(HLOOKUP(U$3,Pivot!$B$3:$BB$56,DataTab!$G45,FALSE),\"\")","v":""},{"$f":"IFERROR(HLOOKUP(V$3,Pivot!$B$3:$BB$56,DataTab!$G45,FALSE),\"\")","v":""},{"$f":"IFERROR(HLOOKUP(W$3,Pivot!$B$3:$BB$56,DataTab!$G45,FALSE),\"\")","v":""},{"$f":"IFERROR(HLOOKUP(X$3,Pivot!$B$3:$BB$56,DataTab!$G45,FALSE),\"\")","v":""},{"$f":"IFERROR(HLOOKUP(Y$3,Pivot!$B$3:$BB$56,DataTab!$G45,FALSE),\"\")","v":""},{"$f":"IFERROR(HLOOKUP(Z$3,Pivot!$B$3:$BB$56,DataTab!$G45,FALSE),\"\")","v":""},{"$f":"IFERROR(HLOOKUP(AA$3,Pivot!$B$3:$BB$56,DataTab!$G45,FALSE),\"\")","v":""},{"$f":"IFERROR(HLOOKUP(AB$3,Pivot!$B$3:$BB$56,DataTab!$G45,FALSE),\"\")","v":""},{"$f":"IFERROR(HLOOKUP(AC$3,Pivot!$B$3:$BB$56,DataTab!$G45,FALSE),\"\")","v":""},{"$f":"IFERROR(HLOOKUP(AD$3,Pivot!$B$3:$BB$56,DataTab!$G45,FALSE),\"\")","v":""},{"$f":"IFERROR(HLOOKUP(AE$3,Pivot!$B$3:$BB$56,DataTab!$G45,FALSE),\"\")","v":""},{"$f":"IFERROR(HLOOKUP(AF$3,Pivot!$B$3:$BB$56,DataTab!$G45,FALSE),\"\")","v":""},{"$f":"IFERROR(HLOOKUP(AG$3,Pivot!$B$3:$BB$56,DataTab!$G45,FALSE),\"\")","v":""},{"$f":"IFERROR(HLOOKUP(AH$3,Pivot!$B$3:$BB$56,DataTab!$G45,FALSE),\"\")","v":""},{"$f":"IFERROR(HLOOKUP(AI$3,Pivot!$B$3:$BB$56,DataTab!$G45,FALSE),\"\")","v":""},{"$f":"IFERROR(HLOOKUP(AJ$3,Pivot!$B$3:$BB$56,DataTab!$G45,FALSE),\"\")","v":""},{"$f":"IFERROR(HLOOKUP(AK$3,Pivot!$B$3:$BB$56,DataTab!$G45,FALSE),\"\")","v":""},{"$f":"IFERROR(HLOOKUP(AL$3,Pivot!$B$3:$BB$56,DataTab!$G45,FALSE),\"\")","v":""},{"$f":"IFERROR(HLOOKUP(AM$3,Pivot!$B$3:$BB$56,DataTab!$G45,FALSE),\"\")","v":""},{"$f":"IFERROR(HLOOKUP(AN$3,Pivot!$B$3:$BB$56,DataTab!$G45,FALSE),\"\")","v":""},{"$f":"IFERROR(HLOOKUP(AO$3,Pivot!$B$3:$BB$56,DataTab!$G45,FALSE),\"\")","v":""},{"$f":"IFERROR(HLOOKUP(AP$3,Pivot!$B$3:$BB$56,DataTab!$G45,FALSE),\"\")","v":""},{"$f":"IFERROR(HLOOKUP(AQ$3,Pivot!$B$3:$BB$56,DataTab!$G45,FALSE),\"\")","v":""},{"$f":"IFERROR(HLOOKUP(AR$3,Pivot!$B$3:$BB$56,DataTab!$G45,FALSE),\"\")","v":""},{"$f":"IFERROR(HLOOKUP(AS$3,Pivot!$B$3:$BB$56,DataTab!$G45,FALSE),\"\")","v":""},{"$f":"IFERROR(HLOOKUP(AT$3,Pivot!$B$3:$BB$56,DataTab!$G45,FALSE),\"\")","v":""},{"$f":"IFERROR(HLOOKUP(AU$3,Pivot!$B$3:$BB$56,DataTab!$G45,FALSE),\"\")","v":""},{"$f":"IFERROR(HLOOKUP(AV$3,Pivot!$B$3:$BB$56,DataTab!$G45,FALSE),\"\")","v":""},{"$f":"IFERROR(HLOOKUP(AW$3,Pivot!$B$3:$BB$56,DataTab!$G45,FALSE),\"\")","v":""},{"$f":"IFERROR(HLOOKUP(AX$3,Pivot!$B$3:$BB$56,DataTab!$G45,FALSE),\"\")","v":""},{"$f":"IFERROR(HLOOKUP(AY$3,Pivot!$B$3:$BB$56,DataTab!$G45,FALSE),\"\")","v":""},{"$f":"IFERROR(HLOOKUP(AZ$3,Pivot!$B$3:$BB$56,DataTab!$G45,FALSE),\"\")","v":""},{"$f":"IFERROR(HLOOKUP(BA$3,Pivot!$B$3:$BB$56,DataTab!$G45,FALSE),\"\")","v":""},{"$f":"IFERROR(HLOOKUP(BB$3,Pivot!$B$3:$BB$56,DataTab!$G45,FALSE),\"\")","v":""},{"$f":"IFERROR(HLOOKUP(BC$3,Pivot!$B$3:$BB$56,DataTab!$G45,FALSE),\"\")","v":""},{"$f":"IFERROR(HLOOKUP(BD$3,Pivot!$B$3:$BB$56,DataTab!$G45,FALSE),\"\")","v":""},{"$f":"IFERROR(HLOOKUP(BE$3,Pivot!$B$3:$BB$56,DataTab!$G45,FALSE),\"\")","v":""},{"$f":"IFERROR(HLOOKUP(BF$3,Pivot!$B$3:$BB$56,DataTab!$G45,FALSE),\"\")","v":""},{"$f":"IFERROR(HLOOKUP(BG$3,Pivot!$B$3:$BB$56,DataTab!$G45,FALSE),\"\")","v":""},{"$f":"IFERROR(HLOOKUP(BH$3,Pivot!$B$3:$BB$56,DataTab!$G45,FALSE),\"\")","v":""},null,""]
["Tennessee",4648,14,3,null,{"$f":"IF(ISBLANK(E46),\"\",VLOOKUP(E46,StateListAbbrev!$A$2:$B$53,2,FALSE))","v":""},{"$f":"IF(ISBLANK(E46),\"\",VLOOKUP(F46,'2012'!$A$10:$B$62,2,FALSE))","v":""},null,{"$f":"IFERROR(HLOOKUP(I$3,Pivot!$B$3:$BB$56,DataTab!$G46,FALSE),\"\")","v":""},{"$f":"IFERROR(HLOOKUP(J$3,Pivot!$B$3:$BB$56,DataTab!$G46,FALSE),\"\")","v":""},{"$f":"IFERROR(HLOOKUP(K$3,Pivot!$B$3:$BB$56,DataTab!$G46,FALSE),\"\")","v":""},{"$f":"IFERROR(HLOOKUP(L$3,Pivot!$B$3:$BB$56,DataTab!$G46,FALSE),\"\")","v":""},{"$f":"IFERROR(HLOOKUP(M$3,Pivot!$B$3:$BB$56,DataTab!$G46,FALSE),\"\")","v":""},{"$f":"IFERROR(HLOOKUP(N$3,Pivot!$B$3:$BB$56,DataTab!$G46,FALSE),\"\")","v":""},{"$f":"IFERROR(HLOOKUP(O$3,Pivot!$B$3:$BB$56,DataTab!$G46,FALSE),\"\")","v":""},{"$f":"IFERROR(HLOOKUP(P$3,Pivot!$B$3:$BB$56,DataTab!$G46,FALSE),\"\")","v":""},{"$f":"IFERROR(HLOOKUP(Q$3,Pivot!$B$3:$BB$56,DataTab!$G46,FALSE),\"\")","v":""},{"$f":"IFERROR(HLOOKUP(R$3,Pivot!$B$3:$BB$56,DataTab!$G46,FALSE),\"\")","v":""},{"$f":"IFERROR(HLOOKUP(S$3,Pivot!$B$3:$BB$56,DataTab!$G46,FALSE),\"\")","v":""},{"$f":"IFERROR(HLOOKUP(T$3,Pivot!$B$3:$BB$56,DataTab!$G46,FALSE),\"\")","v":""},{"$f":"IFERROR(HLOOKUP(U$3,Pivot!$B$3:$BB$56,DataTab!$G46,FALSE),\"\")","v":""},{"$f":"IFERROR(HLOOKUP(V$3,Pivot!$B$3:$BB$56,DataTab!$G46,FALSE),\"\")","v":""},{"$f":"IFERROR(HLOOKUP(W$3,Pivot!$B$3:$BB$56,DataTab!$G46,FALSE),\"\")","v":""},{"$f":"IFERROR(HLOOKUP(X$3,Pivot!$B$3:$BB$56,DataTab!$G46,FALSE),\"\")","v":""},{"$f":"IFERROR(HLOOKUP(Y$3,Pivot!$B$3:$BB$56,DataTab!$G46,FALSE),\"\")","v":""},{"$f":"IFERROR(HLOOKUP(Z$3,Pivot!$B$3:$BB$56,DataTab!$G46,FALSE),\"\")","v":""},{"$f":"IFERROR(HLOOKUP(AA$3,Pivot!$B$3:$BB$56,DataTab!$G46,FALSE),\"\")","v":""},{"$f":"IFERROR(HLOOKUP(AB$3,Pivot!$B$3:$BB$56,DataTab!$G46,FALSE),\"\")","v":""},{"$f":"IFERROR(HLOOKUP(AC$3,Pivot!$B$3:$BB$56,DataTab!$G46,FALSE),\"\")","v":""},{"$f":"IFERROR(HLOOKUP(AD$3,Pivot!$B$3:$BB$56,DataTab!$G46,FALSE),\"\")","v":""},{"$f":"IFERROR(HLOOKUP(AE$3,Pivot!$B$3:$BB$56,DataTab!$G46,FALSE),\"\")","v":""},{"$f":"IFERROR(HLOOKUP(AF$3,Pivot!$B$3:$BB$56,DataTab!$G46,FALSE),\"\")","v":""},{"$f":"IFERROR(HLOOKUP(AG$3,Pivot!$B$3:$BB$56,DataTab!$G46,FALSE),\"\")","v":""},{"$f":"IFERROR(HLOOKUP(AH$3,Pivot!$B$3:$BB$56,DataTab!$G46,FALSE),\"\")","v":""},{"$f":"IFERROR(HLOOKUP(AI$3,Pivot!$B$3:$BB$56,DataTab!$G46,FALSE),\"\")","v":""},{"$f":"IFERROR(HLOOKUP(AJ$3,Pivot!$B$3:$BB$56,DataTab!$G46,FALSE),\"\")","v":""},{"$f":"IFERROR(HLOOKUP(AK$3,Pivot!$B$3:$BB$56,DataTab!$G46,FALSE),\"\")","v":""},{"$f":"IFERROR(HLOOKUP(AL$3,Pivot!$B$3:$BB$56,DataTab!$G46,FALSE),\"\")","v":""},{"$f":"IFERROR(HLOOKUP(AM$3,Pivot!$B$3:$BB$56,DataTab!$G46,FALSE),\"\")","v":""},{"$f":"IFERROR(HLOOKUP(AN$3,Pivot!$B$3:$BB$56,DataTab!$G46,FALSE),\"\")","v":""},{"$f":"IFERROR(HLOOKUP(AO$3,Pivot!$B$3:$BB$56,DataTab!$G46,FALSE),\"\")","v":""},{"$f":"IFERROR(HLOOKUP(AP$3,Pivot!$B$3:$BB$56,DataTab!$G46,FALSE),\"\")","v":""},{"$f":"IFERROR(HLOOKUP(AQ$3,Pivot!$B$3:$BB$56,DataTab!$G46,FALSE),\"\")","v":""},{"$f":"IFERROR(HLOOKUP(AR$3,Pivot!$B$3:$BB$56,DataTab!$G46,FALSE),\"\")","v":""},{"$f":"IFERROR(HLOOKUP(AS$3,Pivot!$B$3:$BB$56,DataTab!$G46,FALSE),\"\")","v":""},{"$f":"IFERROR(HLOOKUP(AT$3,Pivot!$B$3:$BB$56,DataTab!$G46,FALSE),\"\")","v":""},{"$f":"IFERROR(HLOOKUP(AU$3,Pivot!$B$3:$BB$56,DataTab!$G46,FALSE),\"\")","v":""},{"$f":"IFERROR(HLOOKUP(AV$3,Pivot!$B$3:$BB$56,DataTab!$G46,FALSE),\"\")","v":""},{"$f":"IFERROR(HLOOKUP(AW$3,Pivot!$B$3:$BB$56,DataTab!$G46,FALSE),\"\")","v":""},{"$f":"IFERROR(HLOOKUP(AX$3,Pivot!$B$3:$BB$56,DataTab!$G46,FALSE),\"\")","v":""},{"$f":"IFERROR(HLOOKUP(AY$3,Pivot!$B$3:$BB$56,DataTab!$G46,FALSE),\"\")","v":""},{"$f":"IFERROR(HLOOKUP(AZ$3,Pivot!$B$3:$BB$56,DataTab!$G46,FALSE),\"\")","v":""},{"$f":"IFERROR(HLOOKUP(BA$3,Pivot!$B$3:$BB$56,DataTab!$G46,FALSE),\"\")","v":""},{"$f":"IFERROR(HLOOKUP(BB$3,Pivot!$B$3:$BB$56,DataTab!$G46,FALSE),\"\")","v":""},{"$f":"IFERROR(HLOOKUP(BC$3,Pivot!$B$3:$BB$56,DataTab!$G46,FALSE),\"\")","v":""},{"$f":"IFERROR(HLOOKUP(BD$3,Pivot!$B$3:$BB$56,DataTab!$G46,FALSE),\"\")","v":""},{"$f":"IFERROR(HLOOKUP(BE$3,Pivot!$B$3:$BB$56,DataTab!$G46,FALSE),\"\")","v":""},{"$f":"IFERROR(HLOOKUP(BF$3,Pivot!$B$3:$BB$56,DataTab!$G46,FALSE),\"\")","v":""},{"$f":"IFERROR(HLOOKUP(BG$3,Pivot!$B$3:$BB$56,DataTab!$G46,FALSE),\"\")","v":""},{"$f":"IFERROR(HLOOKUP(BH$3,Pivot!$B$3:$BB$56,DataTab!$G46,FALSE),\"\")","v":""},null,""]
["Texas",16780,2,1,null,{"$f":"IF(ISBLANK(E47),\"\",VLOOKUP(E47,StateListAbbrev!$A$2:$B$53,2,FALSE))","v":""},{"$f":"IF(ISBLANK(E47),\"\",VLOOKUP(F47,'2012'!$A$10:$B$62,2,FALSE))","v":""},null,{"$f":"IFERROR(HLOOKUP(I$3,Pivot!$B$3:$BB$56,DataTab!$G47,FALSE),\"\")","v":""},{"$f":"IFERROR(HLOOKUP(J$3,Pivot!$B$3:$BB$56,DataTab!$G47,FALSE),\"\")","v":""},{"$f":"IFERROR(HLOOKUP(K$3,Pivot!$B$3:$BB$56,DataTab!$G47,FALSE),\"\")","v":""},{"$f":"IFERROR(HLOOKUP(L$3,Pivot!$B$3:$BB$56,DataTab!$G47,FALSE),\"\")","v":""},{"$f":"IFERROR(HLOOKUP(M$3,Pivot!$B$3:$BB$56,DataTab!$G47,FALSE),\"\")","v":""},{"$f":"IFERROR(HLOOKUP(N$3,Pivot!$B$3:$BB$56,DataTab!$G47,FALSE),\"\")","v":""},{"$f":"IFERROR(HLOOKUP(O$3,Pivot!$B$3:$BB$56,DataTab!$G47,FALSE),\"\")","v":""},{"$f":"IFERROR(HLOOKUP(P$3,Pivot!$B$3:$BB$56,DataTab!$G47,FALSE),\"\")","v":""},{"$f":"IFERROR(HLOOKUP(Q$3,Pivot!$B$3:$BB$56,DataTab!$G47,FALSE),\"\")","v":""},{"$f":"IFERROR(HLOOKUP(R$3,Pivot!$B$3:$BB$56,DataTab!$G47,FALSE),\"\")","v":""},{"$f":"IFERROR(HLOOKUP(S$3,Pivot!$B$3:$BB$56,DataTab!$G47,FALSE),\"\")","v":""},{"$f":"IFERROR(HLOOKUP(T$3,Pivot!$B$3:$BB$56,DataTab!$G47,FALSE),\"\")","v":""},{"$f":"IFERROR(HLOOKUP(U$3,Pivot!$B$3:$BB$56,DataTab!$G47,FALSE),\"\")","v":""},{"$f":"IFERROR(HLOOKUP(V$3,Pivot!$B$3:$BB$56,DataTab!$G47,FALSE),\"\")","v":""},{"$f":"IFERROR(HLOOKUP(W$3,Pivot!$B$3:$BB$56,DataTab!$G47,FALSE),\"\")","v":""},{"$f":"IFERROR(HLOOKUP(X$3,Pivot!$B$3:$BB$56,DataTab!$G47,FALSE),\"\")","v":""},{"$f":"IFERROR(HLOOKUP(Y$3,Pivot!$B$3:$BB$56,DataTab!$G47,FALSE),\"\")","v":""},{"$f":"IFERROR(HLOOKUP(Z$3,Pivot!$B$3:$BB$56,DataTab!$G47,FALSE),\"\")","v":""},{"$f":"IFERROR(HLOOKUP(AA$3,Pivot!$B$3:$BB$56,DataTab!$G47,FALSE),\"\")","v":""},{"$f":"IFERROR(HLOOKUP(AB$3,Pivot!$B$3:$BB$56,DataTab!$G47,FALSE),\"\")","v":""},{"$f":"IFERROR(HLOOKUP(AC$3,Pivot!$B$3:$BB$56,DataTab!$G47,FALSE),\"\")","v":""},{"$f":"IFERROR(HLOOKUP(AD$3,Pivot!$B$3:$BB$56,DataTab!$G47,FALSE),\"\")","v":""},{"$f":"IFERROR(HLOOKUP(AE$3,Pivot!$B$3:$BB$56,DataTab!$G47,FALSE),\"\")","v":""},{"$f":"IFERROR(HLOOKUP(AF$3,Pivot!$B$3:$BB$56,DataTab!$G47,FALSE),\"\")","v":""},{"$f":"IFERROR(HLOOKUP(AG$3,Pivot!$B$3:$BB$56,DataTab!$G47,FALSE),\"\")","v":""},{"$f":"IFERROR(HLOOKUP(AH$3,Pivot!$B$3:$BB$56,DataTab!$G47,FALSE),\"\")","v":""},{"$f":"IFERROR(HLOOKUP(AI$3,Pivot!$B$3:$BB$56,DataTab!$G47,FALSE),\"\")","v":""},{"$f":"IFERROR(HLOOKUP(AJ$3,Pivot!$B$3:$BB$56,DataTab!$G47,FALSE),\"\")","v":""},{"$f":"IFERROR(HLOOKUP(AK$3,Pivot!$B$3:$BB$56,DataTab!$G47,FALSE),\"\")","v":""},{"$f":"IFERROR(HLOOKUP(AL$3,Pivot!$B$3:$BB$56,DataTab!$G47,FALSE),\"\")","v":""},{"$f":"IFERROR(HLOOKUP(AM$3,Pivot!$B$3:$BB$56,DataTab!$G47,FALSE),\"\")","v":""},{"$f":"IFERROR(HLOOKUP(AN$3,Pivot!$B$3:$BB$56,DataTab!$G47,FALSE),\"\")","v":""},{"$f":"IFERROR(HLOOKUP(AO$3,Pivot!$B$3:$BB$56,DataTab!$G47,FALSE),\"\")","v":""},{"$f":"IFERROR(HLOOKUP(AP$3,Pivot!$B$3:$BB$56,DataTab!$G47,FALSE),\"\")","v":""},{"$f":"IFERROR(HLOOKUP(AQ$3,Pivot!$B$3:$BB$56,DataTab!$G47,FALSE),\"\")","v":""},{"$f":"IFERROR(HLOOKUP(AR$3,Pivot!$B$3:$BB$56,DataTab!$G47,FALSE),\"\")","v":""},{"$f":"IFERROR(HLOOKUP(AS$3,Pivot!$B$3:$BB$56,DataTab!$G47,FALSE),\"\")","v":""},{"$f":"IFERROR(HLOOKUP(AT$3,Pivot!$B$3:$BB$56,DataTab!$G47,FALSE),\"\")","v":""},{"$f":"IFERROR(HLOOKUP(AU$3,Pivot!$B$3:$BB$56,DataTab!$G47,FALSE),\"\")","v":""},{"$f":"IFERROR(HLOOKUP(AV$3,Pivot!$B$3:$BB$56,DataTab!$G47,FALSE),\"\")","v":""},{"$f":"IFERROR(HLOOKUP(AW$3,Pivot!$B$3:$BB$56,DataTab!$G47,FALSE),\"\")","v":""},{"$f":"IFERROR(HLOOKUP(AX$3,Pivot!$B$3:$BB$56,DataTab!$G47,FALSE),\"\")","v":""},{"$f":"IFERROR(HLOOKUP(AY$3,Pivot!$B$3:$BB$56,DataTab!$G47,FALSE),\"\")","v":""},{"$f":"IFERROR(HLOOKUP(AZ$3,Pivot!$B$3:$BB$56,DataTab!$G47,FALSE),\"\")","v":""},{"$f":"IFERROR(HLOOKUP(BA$3,Pivot!$B$3:$BB$56,DataTab!$G47,FALSE),\"\")","v":""},{"$f":"IFERROR(HLOOKUP(BB$3,Pivot!$B$3:$BB$56,DataTab!$G47,FALSE),\"\")","v":""},{"$f":"IFERROR(HLOOKUP(BC$3,Pivot!$B$3:$BB$56,DataTab!$G47,FALSE),\"\")","v":""},{"$f":"IFERROR(HLOOKUP(BD$3,Pivot!$B$3:$BB$56,DataTab!$G47,FALSE),\"\")","v":""},{"$f":"IFERROR(HLOOKUP(BE$3,Pivot!$B$3:$BB$56,DataTab!$G47,FALSE),\"\")","v":""},{"$f":"IFERROR(HLOOKUP(BF$3,Pivot!$B$3:$BB$56,DataTab!$G47,FALSE),\"\")","v":""},{"$f":"IFERROR(HLOOKUP(BG$3,Pivot!$B$3:$BB$56,DataTab!$G47,FALSE),\"\")","v":""},{"$f":"IFERROR(HLOOKUP(BH$3,Pivot!$B$3:$BB$56,DataTab!$G47,FALSE),\"\")","v":""},null,""]
["Utah",1154,37,8,null,{"$f":"IF(ISBLANK(E48),\"\",VLOOKUP(E48,StateListAbbrev!$A$2:$B$53,2,FALSE))","v":""},{"$f":"IF(ISBLANK(E48),\"\",VLOOKUP(F48,'2012'!$A$10:$B$62,2,FALSE))","v":""},null,{"$f":"IFERROR(HLOOKUP(I$3,Pivot!$B$3:$BB$56,DataTab!$G48,FALSE),\"\")","v":""},{"$f":"IFERROR(HLOOKUP(J$3,Pivot!$B$3:$BB$56,DataTab!$G48,FALSE),\"\")","v":""},{"$f":"IFERROR(HLOOKUP(K$3,Pivot!$B$3:$BB$56,DataTab!$G48,FALSE),\"\")","v":""},{"$f":"IFERROR(HLOOKUP(L$3,Pivot!$B$3:$BB$56,DataTab!$G48,FALSE),\"\")","v":""},{"$f":"IFERROR(HLOOKUP(M$3,Pivot!$B$3:$BB$56,DataTab!$G48,FALSE),\"\")","v":""},{"$f":"IFERROR(HLOOKUP(N$3,Pivot!$B$3:$BB$56,DataTab!$G48,FALSE),\"\")","v":""},{"$f":"IFERROR(HLOOKUP(O$3,Pivot!$B$3:$BB$56,DataTab!$G48,FALSE),\"\")","v":""},{"$f":"IFERROR(HLOOKUP(P$3,Pivot!$B$3:$BB$56,DataTab!$G48,FALSE),\"\")","v":""},{"$f":"IFERROR(HLOOKUP(Q$3,Pivot!$B$3:$BB$56,DataTab!$G48,FALSE),\"\")","v":""},{"$f":"IFERROR(HLOOKUP(R$3,Pivot!$B$3:$BB$56,DataTab!$G48,FALSE),\"\")","v":""},{"$f":"IFERROR(HLOOKUP(S$3,Pivot!$B$3:$BB$56,DataTab!$G48,FALSE),\"\")","v":""},{"$f":"IFERROR(HLOOKUP(T$3,Pivot!$B$3:$BB$56,DataTab!$G48,FALSE),\"\")","v":""},{"$f":"IFERROR(HLOOKUP(U$3,Pivot!$B$3:$BB$56,DataTab!$G48,FALSE),\"\")","v":""},{"$f":"IFERROR(HLOOKUP(V$3,Pivot!$B$3:$BB$56,DataTab!$G48,FALSE),\"\")","v":""},{"$f":"IFERROR(HLOOKUP(W$3,Pivot!$B$3:$BB$56,DataTab!$G48,FALSE),\"\")","v":""},{"$f":"IFERROR(HLOOKUP(X$3,Pivot!$B$3:$BB$56,DataTab!$G48,FALSE),\"\")","v":""},{"$f":"IFERROR(HLOOKUP(Y$3,Pivot!$B$3:$BB$56,DataTab!$G48,FALSE),\"\")","v":""},{"$f":"IFERROR(HLOOKUP(Z$3,Pivot!$B$3:$BB$56,DataTab!$G48,FALSE),\"\")","v":""},{"$f":"IFERROR(HLOOKUP(AA$3,Pivot!$B$3:$BB$56,DataTab!$G48,FALSE),\"\")","v":""},{"$f":"IFERROR(HLOOKUP(AB$3,Pivot!$B$3:$BB$56,DataTab!$G48,FALSE),\"\")","v":""},{"$f":"IFERROR(HLOOKUP(AC$3,Pivot!$B$3:$BB$56,DataTab!$G48,FALSE),\"\")","v":""},{"$f":"IFERROR(HLOOKUP(AD$3,Pivot!$B$3:$BB$56,DataTab!$G48,FALSE),\"\")","v":""},{"$f":"IFERROR(HLOOKUP(AE$3,Pivot!$B$3:$BB$56,DataTab!$G48,FALSE),\"\")","v":""},{"$f":"IFERROR(HLOOKUP(AF$3,Pivot!$B$3:$BB$56,DataTab!$G48,FALSE),\"\")","v":""},{"$f":"IFERROR(HLOOKUP(AG$3,Pivot!$B$3:$BB$56,DataTab!$G48,FALSE),\"\")","v":""},{"$f":"IFERROR(HLOOKUP(AH$3,Pivot!$B$3:$BB$56,DataTab!$G48,FALSE),\"\")","v":""},{"$f":"IFERROR(HLOOKUP(AI$3,Pivot!$B$3:$BB$56,DataTab!$G48,FALSE),\"\")","v":""},{"$f":"IFERROR(HLOOKUP(AJ$3,Pivot!$B$3:$BB$56,DataTab!$G48,FALSE),\"\")","v":""},{"$f":"IFERROR(HLOOKUP(AK$3,Pivot!$B$3:$BB$56,DataTab!$G48,FALSE),\"\")","v":""},{"$f":"IFERROR(HLOOKUP(AL$3,Pivot!$B$3:$BB$56,DataTab!$G48,FALSE),\"\")","v":""},{"$f":"IFERROR(HLOOKUP(AM$3,Pivot!$B$3:$BB$56,DataTab!$G48,FALSE),\"\")","v":""},{"$f":"IFERROR(HLOOKUP(AN$3,Pivot!$B$3:$BB$56,DataTab!$G48,FALSE),\"\")","v":""},{"$f":"IFERROR(HLOOKUP(AO$3,Pivot!$B$3:$BB$56,DataTab!$G48,FALSE),\"\")","v":""},{"$f":"IFERROR(HLOOKUP(AP$3,Pivot!$B$3:$BB$56,DataTab!$G48,FALSE),\"\")","v":""},{"$f":"IFERROR(HLOOKUP(AQ$3,Pivot!$B$3:$BB$56,DataTab!$G48,FALSE),\"\")","v":""},{"$f":"IFERROR(HLOOKUP(AR$3,Pivot!$B$3:$BB$56,DataTab!$G48,FALSE),\"\")","v":""},{"$f":"IFERROR(HLOOKUP(AS$3,Pivot!$B$3:$BB$56,DataTab!$G48,FALSE),\"\")","v":""},{"$f":"IFERROR(HLOOKUP(AT$3,Pivot!$B$3:$BB$56,DataTab!$G48,FALSE),\"\")","v":""},{"$f":"IFERROR(HLOOKUP(AU$3,Pivot!$B$3:$BB$56,DataTab!$G48,FALSE),\"\")","v":""},{"$f":"IFERROR(HLOOKUP(AV$3,Pivot!$B$3:$BB$56,DataTab!$G48,FALSE),\"\")","v":""},{"$f":"IFERROR(HLOOKUP(AW$3,Pivot!$B$3:$BB$56,DataTab!$G48,FALSE),\"\")","v":""},{"$f":"IFERROR(HLOOKUP(AX$3,Pivot!$B$3:$BB$56,DataTab!$G48,FALSE),\"\")","v":""},{"$f":"IFERROR(HLOOKUP(AY$3,Pivot!$B$3:$BB$56,DataTab!$G48,FALSE),\"\")","v":""},{"$f":"IFERROR(HLOOKUP(AZ$3,Pivot!$B$3:$BB$56,DataTab!$G48,FALSE),\"\")","v":""},{"$f":"IFERROR(HLOOKUP(BA$3,Pivot!$B$3:$BB$56,DataTab!$G48,FALSE),\"\")","v":""},{"$f":"IFERROR(HLOOKUP(BB$3,Pivot!$B$3:$BB$56,DataTab!$G48,FALSE),\"\")","v":""},{"$f":"IFERROR(HLOOKUP(BC$3,Pivot!$B$3:$BB$56,DataTab!$G48,FALSE),\"\")","v":""},{"$f":"IFERROR(HLOOKUP(BD$3,Pivot!$B$3:$BB$56,DataTab!$G48,FALSE),\"\")","v":""},{"$f":"IFERROR(HLOOKUP(BE$3,Pivot!$B$3:$BB$56,DataTab!$G48,FALSE),\"\")","v":""},{"$f":"IFERROR(HLOOKUP(BF$3,Pivot!$B$3:$BB$56,DataTab!$G48,FALSE),\"\")","v":""},{"$f":"IFERROR(HLOOKUP(BG$3,Pivot!$B$3:$BB$56,DataTab!$G48,FALSE),\"\")","v":""},{"$f":"IFERROR(HLOOKUP(BH$3,Pivot!$B$3:$BB$56,DataTab!$G48,FALSE),\"\")","v":""},null,""]
["Vermont",156,51,10,null,{"$f":"IF(ISBLANK(E49),\"\",VLOOKUP(E49,StateListAbbrev!$A$2:$B$53,2,FALSE))","v":""},{"$f":"IF(ISBLANK(E49),\"\",VLOOKUP(F49,'2012'!$A$10:$B$62,2,FALSE))","v":""},null,{"$f":"IFERROR(HLOOKUP(I$3,Pivot!$B$3:$BB$56,DataTab!$G49,FALSE),\"\")","v":""},{"$f":"IFERROR(HLOOKUP(J$3,Pivot!$B$3:$BB$56,DataTab!$G49,FALSE),\"\")","v":""},{"$f":"IFERROR(HLOOKUP(K$3,Pivot!$B$3:$BB$56,DataTab!$G49,FALSE),\"\")","v":""},{"$f":"IFERROR(HLOOKUP(L$3,Pivot!$B$3:$BB$56,DataTab!$G49,FALSE),\"\")","v":""},{"$f":"IFERROR(HLOOKUP(M$3,Pivot!$B$3:$BB$56,DataTab!$G49,FALSE),\"\")","v":""},{"$f":"IFERROR(HLOOKUP(N$3,Pivot!$B$3:$BB$56,DataTab!$G49,FALSE),\"\")","v":""},{"$f":"IFERROR(HLOOKUP(O$3,Pivot!$B$3:$BB$56,DataTab!$G49,FALSE),\"\")","v":""},{"$f":"IFERROR(HLOOKUP(P$3,Pivot!$B$3:$BB$56,DataTab!$G49,FALSE),\"\")","v":""},{"$f":"IFERROR(HLOOKUP(Q$3,Pivot!$B$3:$BB$56,DataTab!$G49,FALSE),\"\")","v":""},{"$f":"IFERROR(HLOOKUP(R$3,Pivot!$B$3:$BB$56,DataTab!$G49,FALSE),\"\")","v":""},{"$f":"IFERROR(HLOOKUP(S$3,Pivot!$B$3:$BB$56,DataTab!$G49,FALSE),\"\")","v":""},{"$f":"IFERROR(HLOOKUP(T$3,Pivot!$B$3:$BB$56,DataTab!$G49,FALSE),\"\")","v":""},{"$f":"IFERROR(HLOOKUP(U$3,Pivot!$B$3:$BB$56,DataTab!$G49,FALSE),\"\")","v":""},{"$f":"IFERROR(HLOOKUP(V$3,Pivot!$B$3:$BB$56,DataTab!$G49,FALSE),\"\")","v":""},{"$f":"IFERROR(HLOOKUP(W$3,Pivot!$B$3:$BB$56,DataTab!$G49,FALSE),\"\")","v":""},{"$f":"IFERROR(HLOOKUP(X$3,Pivot!$B$3:$BB$56,DataTab!$G49,FALSE),\"\")","v":""},{"$f":"IFERROR(HLOOKUP(Y$3,Pivot!$B$3:$BB$56,DataTab!$G49,FALSE),\"\")","v":""},{"$f":"IFERROR(HLOOKUP(Z$3,Pivot!$B$3:$BB$56,DataTab!$G49,FALSE),\"\")","v":""},{"$f":"IFERROR(HLOOKUP(AA$3,Pivot!$B$3:$BB$56,DataTab!$G49,FALSE),\"\")","v":""},{"$f":"IFERROR(HLOOKUP(AB$3,Pivot!$B$3:$BB$56,DataTab!$G49,FALSE),\"\")","v":""},{"$f":"IFERROR(HLOOKUP(AC$3,Pivot!$B$3:$BB$56,DataTab!$G49,FALSE),\"\")","v":""},{"$f":"IFERROR(HLOOKUP(AD$3,Pivot!$B$3:$BB$56,DataTab!$G49,FALSE),\"\")","v":""},{"$f":"IFERROR(HLOOKUP(AE$3,Pivot!$B$3:$BB$56,DataTab!$G49,FALSE),\"\")","v":""},{"$f":"IFERROR(HLOOKUP(AF$3,Pivot!$B$3:$BB$56,DataTab!$G49,FALSE),\"\")","v":""},{"$f":"IFERROR(HLOOKUP(AG$3,Pivot!$B$3:$BB$56,DataTab!$G49,FALSE),\"\")","v":""},{"$f":"IFERROR(HLOOKUP(AH$3,Pivot!$B$3:$BB$56,DataTab!$G49,FALSE),\"\")","v":""},{"$f":"IFERROR(HLOOKUP(AI$3,Pivot!$B$3:$BB$56,DataTab!$G49,FALSE),\"\")","v":""},{"$f":"IFERROR(HLOOKUP(AJ$3,Pivot!$B$3:$BB$56,DataTab!$G49,FALSE),\"\")","v":""},{"$f":"IFERROR(HLOOKUP(AK$3,Pivot!$B$3:$BB$56,DataTab!$G49,FALSE),\"\")","v":""},{"$f":"IFERROR(HLOOKUP(AL$3,Pivot!$B$3:$BB$56,DataTab!$G49,FALSE),\"\")","v":""},{"$f":"IFERROR(HLOOKUP(AM$3,Pivot!$B$3:$BB$56,DataTab!$G49,FALSE),\"\")","v":""},{"$f":"IFERROR(HLOOKUP(AN$3,Pivot!$B$3:$BB$56,DataTab!$G49,FALSE),\"\")","v":""},{"$f":"IFERROR(HLOOKUP(AO$3,Pivot!$B$3:$BB$56,DataTab!$G49,FALSE),\"\")","v":""},{"$f":"IFERROR(HLOOKUP(AP$3,Pivot!$B$3:$BB$56,DataTab!$G49,FALSE),\"\")","v":""},{"$f":"IFERROR(HLOOKUP(AQ$3,Pivot!$B$3:$BB$56,DataTab!$G49,FALSE),\"\")","v":""},{"$f":"IFERROR(HLOOKUP(AR$3,Pivot!$B$3:$BB$56,DataTab!$G49,FALSE),\"\")","v":""},{"$f":"IFERROR(HLOOKUP(AS$3,Pivot!$B$3:$BB$56,DataTab!$G49,FALSE),\"\")","v":""},{"$f":"IFERROR(HLOOKUP(AT$3,Pivot!$B$3:$BB$56,DataTab!$G49,FALSE),\"\")","v":""},{"$f":"IFERROR(HLOOKUP(AU$3,Pivot!$B$3:$BB$56,DataTab!$G49,FALSE),\"\")","v":""},{"$f":"IFERROR(HLOOKUP(AV$3,Pivot!$B$3:$BB$56,DataTab!$G49,FALSE),\"\")","v":""},{"$f":"IFERROR(HLOOKUP(AW$3,Pivot!$B$3:$BB$56,DataTab!$G49,FALSE),\"\")","v":""},{"$f":"IFERROR(HLOOKUP(AX$3,Pivot!$B$3:$BB$56,DataTab!$G49,FALSE),\"\")","v":""},{"$f":"IFERROR(HLOOKUP(AY$3,Pivot!$B$3:$BB$56,DataTab!$G49,FALSE),\"\")","v":""},{"$f":"IFERROR(HLOOKUP(AZ$3,Pivot!$B$3:$BB$56,DataTab!$G49,FALSE),\"\")","v":""},{"$f":"IFERROR(HLOOKUP(BA$3,Pivot!$B$3:$BB$56,DataTab!$G49,FALSE),\"\")","v":""},{"$f":"IFERROR(HLOOKUP(BB$3,Pivot!$B$3:$BB$56,DataTab!$G49,FALSE),\"\")","v":""},{"$f":"IFERROR(HLOOKUP(BC$3,Pivot!$B$3:$BB$56,DataTab!$G49,FALSE),\"\")","v":""},{"$f":"IFERROR(HLOOKUP(BD$3,Pivot!$B$3:$BB$56,DataTab!$G49,FALSE),\"\")","v":""},{"$f":"IFERROR(HLOOKUP(BE$3,Pivot!$B$3:$BB$56,DataTab!$G49,FALSE),\"\")","v":""},{"$f":"IFERROR(HLOOKUP(BF$3,Pivot!$B$3:$BB$56,DataTab!$G49,FALSE),\"\")","v":""},{"$f":"IFERROR(HLOOKUP(BG$3,Pivot!$B$3:$BB$56,DataTab!$G49,FALSE),\"\")","v":""},{"$f":"IFERROR(HLOOKUP(BH$3,Pivot!$B$3:$BB$56,DataTab!$G49,FALSE),\"\")","v":""},null,""]
["Virginia",4311,16,4,null,{"$f":"IF(ISBLANK(E50),\"\",VLOOKUP(E50,StateListAbbrev!$A$2:$B$53,2,FALSE))","v":""},{"$f":"IF(ISBLANK(E50),\"\",VLOOKUP(F50,'2012'!$A$10:$B$62,2,FALSE))","v":""},null,{"$f":"IFERROR(HLOOKUP(I$3,Pivot!$B$3:$BB$56,DataTab!$G50,FALSE),\"\")","v":""},{"$f":"IFERROR(HLOOKUP(J$3,Pivot!$B$3:$BB$56,DataTab!$G50,FALSE),\"\")","v":""},{"$f":"IFERROR(HLOOKUP(K$3,Pivot!$B$3:$BB$56,DataTab!$G50,FALSE),\"\")","v":""},{"$f":"IFERROR(HLOOKUP(L$3,Pivot!$B$3:$BB$56,DataTab!$G50,FALSE),\"\")","v":""},{"$f":"IFERROR(HLOOKUP(M$3,Pivot!$B$3:$BB$56,DataTab!$G50,FALSE),\"\")","v":""},{"$f":"IFERROR(HLOOKUP(N$3,Pivot!$B$3:$BB$56,DataTab!$G50,FALSE),\"\")","v":""},{"$f":"IFERROR(HLOOKUP(O$3,Pivot!$B$3:$BB$56,DataTab!$G50,FALSE),\"\")","v":""},{"$f":"IFERROR(HLOOKUP(P$3,Pivot!$B$3:$BB$56,DataTab!$G50,FALSE),\"\")","v":""},{"$f":"IFERROR(HLOOKUP(Q$3,Pivot!$B$3:$BB$56,DataTab!$G50,FALSE),\"\")","v":""},{"$f":"IFERROR(HLOOKUP(R$3,Pivot!$B$3:$BB$56,DataTab!$G50,FALSE),\"\")","v":""},{"$f":"IFERROR(HLOOKUP(S$3,Pivot!$B$3:$BB$56,DataTab!$G50,FALSE),\"\")","v":""},{"$f":"IFERROR(HLOOKUP(T$3,Pivot!$B$3:$BB$56,DataTab!$G50,FALSE),\"\")","v":""},{"$f":"IFERROR(HLOOKUP(U$3,Pivot!$B$3:$BB$56,DataTab!$G50,FALSE),\"\")","v":""},{"$f":"IFERROR(HLOOKUP(V$3,Pivot!$B$3:$BB$56,DataTab!$G50,FALSE),\"\")","v":""},{"$f":"IFERROR(HLOOKUP(W$3,Pivot!$B$3:$BB$56,DataTab!$G50,FALSE),\"\")","v":""},{"$f":"IFERROR(HLOOKUP(X$3,Pivot!$B$3:$BB$56,DataTab!$G50,FALSE),\"\")","v":""},{"$f":"IFERROR(HLOOKUP(Y$3,Pivot!$B$3:$BB$56,DataTab!$G50,FALSE),\"\")","v":""},{"$f":"IFERROR(HLOOKUP(Z$3,Pivot!$B$3:$BB$56,DataTab!$G50,FALSE),\"\")","v":""},{"$f":"IFERROR(HLOOKUP(AA$3,Pivot!$B$3:$BB$56,DataTab!$G50,FALSE),\"\")","v":""},{"$f":"IFERROR(HLOOKUP(AB$3,Pivot!$B$3:$BB$56,DataTab!$G50,FALSE),\"\")","v":""},{"$f":"IFERROR(HLOOKUP(AC$3,Pivot!$B$3:$BB$56,DataTab!$G50,FALSE),\"\")","v":""},{"$f":"IFERROR(HLOOKUP(AD$3,Pivot!$B$3:$BB$56,DataTab!$G50,FALSE),\"\")","v":""},{"$f":"IFERROR(HLOOKUP(AE$3,Pivot!$B$3:$BB$56,DataTab!$G50,FALSE),\"\")","v":""},{"$f":"IFERROR(HLOOKUP(AF$3,Pivot!$B$3:$BB$56,DataTab!$G50,FALSE),\"\")","v":""},{"$f":"IFERROR(HLOOKUP(AG$3,Pivot!$B$3:$BB$56,DataTab!$G50,FALSE),\"\")","v":""},{"$f":"IFERROR(HLOOKUP(AH$3,Pivot!$B$3:$BB$56,DataTab!$G50,FALSE),\"\")","v":""},{"$f":"IFERROR(HLOOKUP(AI$3,Pivot!$B$3:$BB$56,DataTab!$G50,FALSE),\"\")","v":""},{"$f":"IFERROR(HLOOKUP(AJ$3,Pivot!$B$3:$BB$56,DataTab!$G50,FALSE),\"\")","v":""},{"$f":"IFERROR(HLOOKUP(AK$3,Pivot!$B$3:$BB$56,DataTab!$G50,FALSE),\"\")","v":""},{"$f":"IFERROR(HLOOKUP(AL$3,Pivot!$B$3:$BB$56,DataTab!$G50,FALSE),\"\")","v":""},{"$f":"IFERROR(HLOOKUP(AM$3,Pivot!$B$3:$BB$56,DataTab!$G50,FALSE),\"\")","v":""},{"$f":"IFERROR(HLOOKUP(AN$3,Pivot!$B$3:$BB$56,DataTab!$G50,FALSE),\"\")","v":""},{"$f":"IFERROR(HLOOKUP(AO$3,Pivot!$B$3:$BB$56,DataTab!$G50,FALSE),\"\")","v":""},{"$f":"IFERROR(HLOOKUP(AP$3,Pivot!$B$3:$BB$56,DataTab!$G50,FALSE),\"\")","v":""},{"$f":"IFERROR(HLOOKUP(AQ$3,Pivot!$B$3:$BB$56,DataTab!$G50,FALSE),\"\")","v":""},{"$f":"IFERROR(HLOOKUP(AR$3,Pivot!$B$3:$BB$56,DataTab!$G50,FALSE),\"\")","v":""},{"$f":"IFERROR(HLOOKUP(AS$3,Pivot!$B$3:$BB$56,DataTab!$G50,FALSE),\"\")","v":""},{"$f":"IFERROR(HLOOKUP(AT$3,Pivot!$B$3:$BB$56,DataTab!$G50,FALSE),\"\")","v":""},{"$f":"IFERROR(HLOOKUP(AU$3,Pivot!$B$3:$BB$56,DataTab!$G50,FALSE),\"\")","v":""},{"$f":"IFERROR(HLOOKUP(AV$3,Pivot!$B$3:$BB$56,DataTab!$G50,FALSE),\"\")","v":""},{"$f":"IFERROR(HLOOKUP(AW$3,Pivot!$B$3:$BB$56,DataTab!$G50,FALSE),\"\")","v":""},{"$f":"IFERROR(HLOOKUP(AX$3,Pivot!$B$3:$BB$56,DataTab!$G50,FALSE),\"\")","v":""},{"$f":"IFERROR(HLOOKUP(AY$3,Pivot!$B$3:$BB$56,DataTab!$G50,FALSE),\"\")","v":""},{"$f":"IFERROR(HLOOKUP(AZ$3,Pivot!$B$3:$BB$56,DataTab!$G50,FALSE),\"\")","v":""},{"$f":"IFERROR(HLOOKUP(BA$3,Pivot!$B$3:$BB$56,DataTab!$G50,FALSE),\"\")","v":""},{"$f":"IFERROR(HLOOKUP(BB$3,Pivot!$B$3:$BB$56,DataTab!$G50,FALSE),\"\")","v":""},{"$f":"IFERROR(HLOOKUP(BC$3,Pivot!$B$3:$BB$56,DataTab!$G50,FALSE),\"\")","v":""},{"$f":"IFERROR(HLOOKUP(BD$3,Pivot!$B$3:$BB$56,DataTab!$G50,FALSE),\"\")","v":""},{"$f":"IFERROR(HLOOKUP(BE$3,Pivot!$B$3:$BB$56,DataTab!$G50,FALSE),\"\")","v":""},{"$f":"IFERROR(HLOOKUP(BF$3,Pivot!$B$3:$BB$56,DataTab!$G50,FALSE),\"\")","v":""},{"$f":"IFERROR(HLOOKUP(BG$3,Pivot!$B$3:$BB$56,DataTab!$G50,FALSE),\"\")","v":""},{"$f":"IFERROR(HLOOKUP(BH$3,Pivot!$B$3:$BB$56,DataTab!$G50,FALSE),\"\")","v":""},null,""]
["Washington",2704,22,5,null,{"$f":"IF(ISBLANK(E51),\"\",VLOOKUP(E51,StateListAbbrev!$A$2:$B$53,2,FALSE))","v":""},{"$f":"IF(ISBLANK(E51),\"\",VLOOKUP(F51,'2012'!$A$10:$B$62,2,FALSE))","v":""},null,{"$f":"IFERROR(HLOOKUP(I$3,Pivot!$B$3:$BB$56,DataTab!$G51,FALSE),\"\")","v":""},{"$f":"IFERROR(HLOOKUP(J$3,Pivot!$B$3:$BB$56,DataTab!$G51,FALSE),\"\")","v":""},{"$f":"IFERROR(HLOOKUP(K$3,Pivot!$B$3:$BB$56,DataTab!$G51,FALSE),\"\")","v":""},{"$f":"IFERROR(HLOOKUP(L$3,Pivot!$B$3:$BB$56,DataTab!$G51,FALSE),\"\")","v":""},{"$f":"IFERROR(HLOOKUP(M$3,Pivot!$B$3:$BB$56,DataTab!$G51,FALSE),\"\")","v":""},{"$f":"IFERROR(HLOOKUP(N$3,Pivot!$B$3:$BB$56,DataTab!$G51,FALSE),\"\")","v":""},{"$f":"IFERROR(HLOOKUP(O$3,Pivot!$B$3:$BB$56,DataTab!$G51,FALSE),\"\")","v":""},{"$f":"IFERROR(HLOOKUP(P$3,Pivot!$B$3:$BB$56,DataTab!$G51,FALSE),\"\")","v":""},{"$f":"IFERROR(HLOOKUP(Q$3,Pivot!$B$3:$BB$56,DataTab!$G51,FALSE),\"\")","v":""},{"$f":"IFERROR(HLOOKUP(R$3,Pivot!$B$3:$BB$56,DataTab!$G51,FALSE),\"\")","v":""},{"$f":"IFERROR(HLOOKUP(S$3,Pivot!$B$3:$BB$56,DataTab!$G51,FALSE),\"\")","v":""},{"$f":"IFERROR(HLOOKUP(T$3,Pivot!$B$3:$BB$56,DataTab!$G51,FALSE),\"\")","v":""},{"$f":"IFERROR(HLOOKUP(U$3,Pivot!$B$3:$BB$56,DataTab!$G51,FALSE),\"\")","v":""},{"$f":"IFERROR(HLOOKUP(V$3,Pivot!$B$3:$BB$56,DataTab!$G51,FALSE),\"\")","v":""},{"$f":"IFERROR(HLOOKUP(W$3,Pivot!$B$3:$BB$56,DataTab!$G51,FALSE),\"\")","v":""},{"$f":"IFERROR(HLOOKUP(X$3,Pivot!$B$3:$BB$56,DataTab!$G51,FALSE),\"\")","v":""},{"$f":"IFERROR(HLOOKUP(Y$3,Pivot!$B$3:$BB$56,DataTab!$G51,FALSE),\"\")","v":""},{"$f":"IFERROR(HLOOKUP(Z$3,Pivot!$B$3:$BB$56,DataTab!$G51,FALSE),\"\")","v":""},{"$f":"IFERROR(HLOOKUP(AA$3,Pivot!$B$3:$BB$56,DataTab!$G51,FALSE),\"\")","v":""},{"$f":"IFERROR(HLOOKUP(AB$3,Pivot!$B$3:$BB$56,DataTab!$G51,FALSE),\"\")","v":""},{"$f":"IFERROR(HLOOKUP(AC$3,Pivot!$B$3:$BB$56,DataTab!$G51,FALSE),\"\")","v":""},{"$f":"IFERROR(HLOOKUP(AD$3,Pivot!$B$3:$BB$56,DataTab!$G51,FALSE),\"\")","v":""},{"$f":"IFERROR(HLOOKUP(AE$3,Pivot!$B$3:$BB$56,DataTab!$G51,FALSE),\"\")","v":""},{"$f":"IFERROR(HLOOKUP(AF$3,Pivot!$B$3:$BB$56,DataTab!$G51,FALSE),\"\")","v":""},{"$f":"IFERROR(HLOOKUP(AG$3,Pivot!$B$3:$BB$56,DataTab!$G51,FALSE),\"\")","v":""},{"$f":"IFERROR(HLOOKUP(AH$3,Pivot!$B$3:$BB$56,DataTab!$G51,FALSE),\"\")","v":""},{"$f":"IFERROR(HLOOKUP(AI$3,Pivot!$B$3:$BB$56,DataTab!$G51,FALSE),\"\")","v":""},{"$f":"IFERROR(HLOOKUP(AJ$3,Pivot!$B$3:$BB$56,DataTab!$G51,FALSE),\"\")","v":""},{"$f":"IFERROR(HLOOKUP(AK$3,Pivot!$B$3:$BB$56,DataTab!$G51,FALSE),\"\")","v":""},{"$f":"IFERROR(HLOOKUP(AL$3,Pivot!$B$3:$BB$56,DataTab!$G51,FALSE),\"\")","v":""},{"$f":"IFERROR(HLOOKUP(AM$3,Pivot!$B$3:$BB$56,DataTab!$G51,FALSE),\"\")","v":""},{"$f":"IFERROR(HLOOKUP(AN$3,Pivot!$B$3:$BB$56,DataTab!$G51,FALSE),\"\")","v":""},{"$f":"IFERROR(HLOOKUP(AO$3,Pivot!$B$3:$BB$56,DataTab!$G51,FALSE),\"\")","v":""},{"$f":"IFERROR(HLOOKUP(AP$3,Pivot!$B$3:$BB$56,DataTab!$G51,FALSE),\"\")","v":""},{"$f":"IFERROR(HLOOKUP(AQ$3,Pivot!$B$3:$BB$56,DataTab!$G51,FALSE),\"\")","v":""},{"$f":"IFERROR(HLOOKUP(AR$3,Pivot!$B$3:$BB$56,DataTab!$G51,FALSE),\"\")","v":""},{"$f":"IFERROR(HLOOKUP(AS$3,Pivot!$B$3:$BB$56,DataTab!$G51,FALSE),\"\")","v":""},{"$f":"IFERROR(HLOOKUP(AT$3,Pivot!$B$3:$BB$56,DataTab!$G51,FALSE),\"\")","v":""},{"$f":"IFERROR(HLOOKUP(AU$3,Pivot!$B$3:$BB$56,DataTab!$G51,FALSE),\"\")","v":""},{"$f":"IFERROR(HLOOKUP(AV$3,Pivot!$B$3:$BB$56,DataTab!$G51,FALSE),\"\")","v":""},{"$f":"IFERROR(HLOOKUP(AW$3,Pivot!$B$3:$BB$56,DataTab!$G51,FALSE),\"\")","v":""},{"$f":"IFERROR(HLOOKUP(AX$3,Pivot!$B$3:$BB$56,DataTab!$G51,FALSE),\"\")","v":""},{"$f":"IFERROR(HLOOKUP(AY$3,Pivot!$B$3:$BB$56,DataTab!$G51,FALSE),\"\")","v":""},{"$f":"IFERROR(HLOOKUP(AZ$3,Pivot!$B$3:$BB$56,DataTab!$G51,FALSE),\"\")","v":""},{"$f":"IFERROR(HLOOKUP(BA$3,Pivot!$B$3:$BB$56,DataTab!$G51,FALSE),\"\")","v":""},{"$f":"IFERROR(HLOOKUP(BB$3,Pivot!$B$3:$BB$56,DataTab!$G51,FALSE),\"\")","v":""},{"$f":"IFERROR(HLOOKUP(BC$3,Pivot!$B$3:$BB$56,DataTab!$G51,FALSE),\"\")","v":""},{"$f":"IFERROR(HLOOKUP(BD$3,Pivot!$B$3:$BB$56,DataTab!$G51,FALSE),\"\")","v":""},{"$f":"IFERROR(HLOOKUP(BE$3,Pivot!$B$3:$BB$56,DataTab!$G51,FALSE),\"\")","v":""},{"$f":"IFERROR(HLOOKUP(BF$3,Pivot!$B$3:$BB$56,DataTab!$G51,FALSE),\"\")","v":""},{"$f":"IFERROR(HLOOKUP(BG$3,Pivot!$B$3:$BB$56,DataTab!$G51,FALSE),\"\")","v":""},{"$f":"IFERROR(HLOOKUP(BH$3,Pivot!$B$3:$BB$56,DataTab!$G51,FALSE),\"\")","v":""},null,""]
["West Virginia",1221,36,7,null,{"$f":"IF(ISBLANK(E52),\"\",VLOOKUP(E52,StateListAbbrev!$A$2:$B$53,2,FALSE))","v":""},{"$f":"IF(ISBLANK(E52),\"\",VLOOKUP(F52,'2012'!$A$10:$B$62,2,FALSE))","v":""},null,{"$f":"IFERROR(HLOOKUP(I$3,Pivot!$B$3:$BB$56,DataTab!$G52,FALSE),\"\")","v":""},{"$f":"IFERROR(HLOOKUP(J$3,Pivot!$B$3:$BB$56,DataTab!$G52,FALSE),\"\")","v":""},{"$f":"IFERROR(HLOOKUP(K$3,Pivot!$B$3:$BB$56,DataTab!$G52,FALSE),\"\")","v":""},{"$f":"IFERROR(HLOOKUP(L$3,Pivot!$B$3:$BB$56,DataTab!$G52,FALSE),\"\")","v":""},{"$f":"IFERROR(HLOOKUP(M$3,Pivot!$B$3:$BB$56,DataTab!$G52,FALSE),\"\")","v":""},{"$f":"IFERROR(HLOOKUP(N$3,Pivot!$B$3:$BB$56,DataTab!$G52,FALSE),\"\")","v":""},{"$f":"IFERROR(HLOOKUP(O$3,Pivot!$B$3:$BB$56,DataTab!$G52,FALSE),\"\")","v":""},{"$f":"IFERROR(HLOOKUP(P$3,Pivot!$B$3:$BB$56,DataTab!$G52,FALSE),\"\")","v":""},{"$f":"IFERROR(HLOOKUP(Q$3,Pivot!$B$3:$BB$56,DataTab!$G52,FALSE),\"\")","v":""},{"$f":"IFERROR(HLOOKUP(R$3,Pivot!$B$3:$BB$56,DataTab!$G52,FALSE),\"\")","v":""},{"$f":"IFERROR(HLOOKUP(S$3,Pivot!$B$3:$BB$56,DataTab!$G52,FALSE),\"\")","v":""},{"$f":"IFERROR(HLOOKUP(T$3,Pivot!$B$3:$BB$56,DataTab!$G52,FALSE),\"\")","v":""},{"$f":"IFERROR(HLOOKUP(U$3,Pivot!$B$3:$BB$56,DataTab!$G52,FALSE),\"\")","v":""},{"$f":"IFERROR(HLOOKUP(V$3,Pivot!$B$3:$BB$56,DataTab!$G52,FALSE),\"\")","v":""},{"$f":"IFERROR(HLOOKUP(W$3,Pivot!$B$3:$BB$56,DataTab!$G52,FALSE),\"\")","v":""},{"$f":"IFERROR(HLOOKUP(X$3,Pivot!$B$3:$BB$56,DataTab!$G52,FALSE),\"\")","v":""},{"$f":"IFERROR(HLOOKUP(Y$3,Pivot!$B$3:$BB$56,DataTab!$G52,FALSE),\"\")","v":""},{"$f":"IFERROR(HLOOKUP(Z$3,Pivot!$B$3:$BB$56,DataTab!$G52,FALSE),\"\")","v":""},{"$f":"IFERROR(HLOOKUP(AA$3,Pivot!$B$3:$BB$56,DataTab!$G52,FALSE),\"\")","v":""},{"$f":"IFERROR(HLOOKUP(AB$3,Pivot!$B$3:$BB$56,DataTab!$G52,FALSE),\"\")","v":""},{"$f":"IFERROR(HLOOKUP(AC$3,Pivot!$B$3:$BB$56,DataTab!$G52,FALSE),\"\")","v":""},{"$f":"IFERROR(HLOOKUP(AD$3,Pivot!$B$3:$BB$56,DataTab!$G52,FALSE),\"\")","v":""},{"$f":"IFERROR(HLOOKUP(AE$3,Pivot!$B$3:$BB$56,DataTab!$G52,FALSE),\"\")","v":""},{"$f":"IFERROR(HLOOKUP(AF$3,Pivot!$B$3:$BB$56,DataTab!$G52,FALSE),\"\")","v":""},{"$f":"IFERROR(HLOOKUP(AG$3,Pivot!$B$3:$BB$56,DataTab!$G52,FALSE),\"\")","v":""},{"$f":"IFERROR(HLOOKUP(AH$3,Pivot!$B$3:$BB$56,DataTab!$G52,FALSE),\"\")","v":""},{"$f":"IFERROR(HLOOKUP(AI$3,Pivot!$B$3:$BB$56,DataTab!$G52,FALSE),\"\")","v":""},{"$f":"IFERROR(HLOOKUP(AJ$3,Pivot!$B$3:$BB$56,DataTab!$G52,FALSE),\"\")","v":""},{"$f":"IFERROR(HLOOKUP(AK$3,Pivot!$B$3:$BB$56,DataTab!$G52,FALSE),\"\")","v":""},{"$f":"IFERROR(HLOOKUP(AL$3,Pivot!$B$3:$BB$56,DataTab!$G52,FALSE),\"\")","v":""},{"$f":"IFERROR(HLOOKUP(AM$3,Pivot!$B$3:$BB$56,DataTab!$G52,FALSE),\"\")","v":""},{"$f":"IFERROR(HLOOKUP(AN$3,Pivot!$B$3:$BB$56,DataTab!$G52,FALSE),\"\")","v":""},{"$f":"IFERROR(HLOOKUP(AO$3,Pivot!$B$3:$BB$56,DataTab!$G52,FALSE),\"\")","v":""},{"$f":"IFERROR(HLOOKUP(AP$3,Pivot!$B$3:$BB$56,DataTab!$G52,FALSE),\"\")","v":""},{"$f":"IFERROR(HLOOKUP(AQ$3,Pivot!$B$3:$BB$56,DataTab!$G52,FALSE),\"\")","v":""},{"$f":"IFERROR(HLOOKUP(AR$3,Pivot!$B$3:$BB$56,DataTab!$G52,FALSE),\"\")","v":""},{"$f":"IFERROR(HLOOKUP(AS$3,Pivot!$B$3:$BB$56,DataTab!$G52,FALSE),\"\")","v":""},{"$f":"IFERROR(HLOOKUP(AT$3,Pivot!$B$3:$BB$56,DataTab!$G52,FALSE),\"\")","v":""},{"$f":"IFERROR(HLOOKUP(AU$3,Pivot!$B$3:$BB$56,DataTab!$G52,FALSE),\"\")","v":""},{"$f":"IFERROR(HLOOKUP(AV$3,Pivot!$B$3:$BB$56,DataTab!$G52,FALSE),\"\")","v":""},{"$f":"IFERROR(HLOOKUP(AW$3,Pivot!$B$3:$BB$56,DataTab!$G52,FALSE),\"\")","v":""},{"$f":"IFERROR(HLOOKUP(AX$3,Pivot!$B$3:$BB$56,DataTab!$G52,FALSE),\"\")","v":""},{"$f":"IFERROR(HLOOKUP(AY$3,Pivot!$B$3:$BB$56,DataTab!$G52,FALSE),\"\")","v":""},{"$f":"IFERROR(HLOOKUP(AZ$3,Pivot!$B$3:$BB$56,DataTab!$G52,FALSE),\"\")","v":""},{"$f":"IFERROR(HLOOKUP(BA$3,Pivot!$B$3:$BB$56,DataTab!$G52,FALSE),\"\")","v":""},{"$f":"IFERROR(HLOOKUP(BB$3,Pivot!$B$3:$BB$56,DataTab!$G52,FALSE),\"\")","v":""},{"$f":"IFERROR(HLOOKUP(BC$3,Pivot!$B$3:$BB$56,DataTab!$G52,FALSE),\"\")","v":""},{"$f":"IFERROR(HLOOKUP(BD$3,Pivot!$B$3:$BB$56,DataTab!$G52,FALSE),\"\")","v":""},{"$f":"IFERROR(HLOOKUP(BE$3,Pivot!$B$3:$BB$56,DataTab!$G52,FALSE),\"\")","v":""},{"$f":"IFERROR(HLOOKUP(BF$3,Pivot!$B$3:$BB$56,DataTab!$G52,FALSE),\"\")","v":""},{"$f":"IFERROR(HLOOKUP(BG$3,Pivot!$B$3:$BB$56,DataTab!$G52,FALSE),\"\")","v":""},{"$f":"IFERROR(HLOOKUP(BH$3,Pivot!$B$3:$BB$56,DataTab!$G52,FALSE),\"\")","v":""},null,""]
["Wisconsin",14414,4,1,null,{"$f":"IF(ISBLANK(E53),\"\",VLOOKUP(E53,StateListAbbrev!$A$2:$B$53,2,FALSE))","v":""},{"$f":"IF(ISBLANK(E53),\"\",VLOOKUP(F53,'2012'!$A$10:$B$62,2,FALSE))","v":""},null,{"$f":"IFERROR(HLOOKUP(I$3,Pivot!$B$3:$BB$56,DataTab!$G53,FALSE),\"\")","v":""},{"$f":"IFERROR(HLOOKUP(J$3,Pivot!$B$3:$BB$56,DataTab!$G53,FALSE),\"\")","v":""},{"$f":"IFERROR(HLOOKUP(K$3,Pivot!$B$3:$BB$56,DataTab!$G53,FALSE),\"\")","v":""},{"$f":"IFERROR(HLOOKUP(L$3,Pivot!$B$3:$BB$56,DataTab!$G53,FALSE),\"\")","v":""},{"$f":"IFERROR(HLOOKUP(M$3,Pivot!$B$3:$BB$56,DataTab!$G53,FALSE),\"\")","v":""},{"$f":"IFERROR(HLOOKUP(N$3,Pivot!$B$3:$BB$56,DataTab!$G53,FALSE),\"\")","v":""},{"$f":"IFERROR(HLOOKUP(O$3,Pivot!$B$3:$BB$56,DataTab!$G53,FALSE),\"\")","v":""},{"$f":"IFERROR(HLOOKUP(P$3,Pivot!$B$3:$BB$56,DataTab!$G53,FALSE),\"\")","v":""},{"$f":"IFERROR(HLOOKUP(Q$3,Pivot!$B$3:$BB$56,DataTab!$G53,FALSE),\"\")","v":""},{"$f":"IFERROR(HLOOKUP(R$3,Pivot!$B$3:$BB$56,DataTab!$G53,FALSE),\"\")","v":""},{"$f":"IFERROR(HLOOKUP(S$3,Pivot!$B$3:$BB$56,DataTab!$G53,FALSE),\"\")","v":""},{"$f":"IFERROR(HLOOKUP(T$3,Pivot!$B$3:$BB$56,DataTab!$G53,FALSE),\"\")","v":""},{"$f":"IFERROR(HLOOKUP(U$3,Pivot!$B$3:$BB$56,DataTab!$G53,FALSE),\"\")","v":""},{"$f":"IFERROR(HLOOKUP(V$3,Pivot!$B$3:$BB$56,DataTab!$G53,FALSE),\"\")","v":""},{"$f":"IFERROR(HLOOKUP(W$3,Pivot!$B$3:$BB$56,DataTab!$G53,FALSE),\"\")","v":""},{"$f":"IFERROR(HLOOKUP(X$3,Pivot!$B$3:$BB$56,DataTab!$G53,FALSE),\"\")","v":""},{"$f":"IFERROR(HLOOKUP(Y$3,Pivot!$B$3:$BB$56,DataTab!$G53,FALSE),\"\")","v":""},{"$f":"IFERROR(HLOOKUP(Z$3,Pivot!$B$3:$BB$56,DataTab!$G53,FALSE),\"\")","v":""},{"$f":"IFERROR(HLOOKUP(AA$3,Pivot!$B$3:$BB$56,DataTab!$G53,FALSE),\"\")","v":""},{"$f":"IFERROR(HLOOKUP(AB$3,Pivot!$B$3:$BB$56,DataTab!$G53,FALSE),\"\")","v":""},{"$f":"IFERROR(HLOOKUP(AC$3,Pivot!$B$3:$BB$56,DataTab!$G53,FALSE),\"\")","v":""},{"$f":"IFERROR(HLOOKUP(AD$3,Pivot!$B$3:$BB$56,DataTab!$G53,FALSE),\"\")","v":""},{"$f":"IFERROR(HLOOKUP(AE$3,Pivot!$B$3:$BB$56,DataTab!$G53,FALSE),\"\")","v":""},{"$f":"IFERROR(HLOOKUP(AF$3,Pivot!$B$3:$BB$56,DataTab!$G53,FALSE),\"\")","v":""},{"$f":"IFERROR(HLOOKUP(AG$3,Pivot!$B$3:$BB$56,DataTab!$G53,FALSE),\"\")","v":""},{"$f":"IFERROR(HLOOKUP(AH$3,Pivot!$B$3:$BB$56,DataTab!$G53,FALSE),\"\")","v":""},{"$f":"IFERROR(HLOOKUP(AI$3,Pivot!$B$3:$BB$56,DataTab!$G53,FALSE),\"\")","v":""},{"$f":"IFERROR(HLOOKUP(AJ$3,Pivot!$B$3:$BB$56,DataTab!$G53,FALSE),\"\")","v":""},{"$f":"IFERROR(HLOOKUP(AK$3,Pivot!$B$3:$BB$56,DataTab!$G53,FALSE),\"\")","v":""},{"$f":"IFERROR(HLOOKUP(AL$3,Pivot!$B$3:$BB$56,DataTab!$G53,FALSE),\"\")","v":""},{"$f":"IFERROR(HLOOKUP(AM$3,Pivot!$B$3:$BB$56,DataTab!$G53,FALSE),\"\")","v":""},{"$f":"IFERROR(HLOOKUP(AN$3,Pivot!$B$3:$BB$56,DataTab!$G53,FALSE),\"\")","v":""},{"$f":"IFERROR(HLOOKUP(AO$3,Pivot!$B$3:$BB$56,DataTab!$G53,FALSE),\"\")","v":""},{"$f":"IFERROR(HLOOKUP(AP$3,Pivot!$B$3:$BB$56,DataTab!$G53,FALSE),\"\")","v":""},{"$f":"IFERROR(HLOOKUP(AQ$3,Pivot!$B$3:$BB$56,DataTab!$G53,FALSE),\"\")","v":""},{"$f":"IFERROR(HLOOKUP(AR$3,Pivot!$B$3:$BB$56,DataTab!$G53,FALSE),\"\")","v":""},{"$f":"IFERROR(HLOOKUP(AS$3,Pivot!$B$3:$BB$56,DataTab!$G53,FALSE),\"\")","v":""},{"$f":"IFERROR(HLOOKUP(AT$3,Pivot!$B$3:$BB$56,DataTab!$G53,FALSE),\"\")","v":""},{"$f":"IFERROR(HLOOKUP(AU$3,Pivot!$B$3:$BB$56,DataTab!$G53,FALSE),\"\")","v":""},{"$f":"IFERROR(HLOOKUP(AV$3,Pivot!$B$3:$BB$56,DataTab!$G53,FALSE),\"\")","v":""},{"$f":"IFERROR(HLOOKUP(AW$3,Pivot!$B$3:$BB$56,DataTab!$G53,FALSE),\"\")","v":""},{"$f":"IFERROR(HLOOKUP(AX$3,Pivot!$B$3:$BB$56,DataTab!$G53,FALSE),\"\")","v":""},{"$f":"IFERROR(HLOOKUP(AY$3,Pivot!$B$3:$BB$56,DataTab!$G53,FALSE),\"\")","v":""},{"$f":"IFERROR(HLOOKUP(AZ$3,Pivot!$B$3:$BB$56,DataTab!$G53,FALSE),\"\")","v":""},{"$f":"IFERROR(HLOOKUP(BA$3,Pivot!$B$3:$BB$56,DataTab!$G53,FALSE),\"\")","v":""},{"$f":"IFERROR(HLOOKUP(BB$3,Pivot!$B$3:$BB$56,DataTab!$G53,FALSE),\"\")","v":""},{"$f":"IFERROR(HLOOKUP(BC$3,Pivot!$B$3:$BB$56,DataTab!$G53,FALSE),\"\")","v":""},{"$f":"IFERROR(HLOOKUP(BD$3,Pivot!$B$3:$BB$56,DataTab!$G53,FALSE),\"\")","v":""},{"$f":"IFERROR(HLOOKUP(BE$3,Pivot!$B$3:$BB$56,DataTab!$G53,FALSE),\"\")","v":""},{"$f":"IFERROR(HLOOKUP(BF$3,Pivot!$B$3:$BB$56,DataTab!$G53,FALSE),\"\")","v":""},{"$f":"IFERROR(HLOOKUP(BG$3,Pivot!$B$3:$BB$56,DataTab!$G53,FALSE),\"\")","v":""},{"$f":"IFERROR(HLOOKUP(BH$3,Pivot!$B$3:$BB$56,DataTab!$G53,FALSE),\"\")","v":""},null,""]
["Wyoming",302,46,9,null,{"$f":"IF(ISBLANK(E54),\"\",VLOOKUP(E54,StateListAbbrev!$A$2:$B$53,2,FALSE))","v":""},{"$f":"IF(ISBLANK(E54),\"\",VLOOKUP(F54,'2012'!$A$10:$B$62,2,FALSE))","v":""},null,{"$f":"IFERROR(HLOOKUP(I$3,Pivot!$B$3:$BB$56,DataTab!$G54,FALSE),\"\")","v":""},{"$f":"IFERROR(HLOOKUP(J$3,Pivot!$B$3:$BB$56,DataTab!$G54,FALSE),\"\")","v":""},{"$f":"IFERROR(HLOOKUP(K$3,Pivot!$B$3:$BB$56,DataTab!$G54,FALSE),\"\")","v":""},{"$f":"IFERROR(HLOOKUP(L$3,Pivot!$B$3:$BB$56,DataTab!$G54,FALSE),\"\")","v":""},{"$f":"IFERROR(HLOOKUP(M$3,Pivot!$B$3:$BB$56,DataTab!$G54,FALSE),\"\")","v":""},{"$f":"IFERROR(HLOOKUP(N$3,Pivot!$B$3:$BB$56,DataTab!$G54,FALSE),\"\")","v":""},{"$f":"IFERROR(HLOOKUP(O$3,Pivot!$B$3:$BB$56,DataTab!$G54,FALSE),\"\")","v":""},{"$f":"IFERROR(HLOOKUP(P$3,Pivot!$B$3:$BB$56,DataTab!$G54,FALSE),\"\")","v":""},{"$f":"IFERROR(HLOOKUP(Q$3,Pivot!$B$3:$BB$56,DataTab!$G54,FALSE),\"\")","v":""},{"$f":"IFERROR(HLOOKUP(R$3,Pivot!$B$3:$BB$56,DataTab!$G54,FALSE),\"\")","v":""},{"$f":"IFERROR(HLOOKUP(S$3,Pivot!$B$3:$BB$56,DataTab!$G54,FALSE),\"\")","v":""},{"$f":"IFERROR(HLOOKUP(T$3,Pivot!$B$3:$BB$56,DataTab!$G54,FALSE),\"\")","v":""},{"$f":"IFERROR(HLOOKUP(U$3,Pivot!$B$3:$BB$56,DataTab!$G54,FALSE),\"\")","v":""},{"$f":"IFERROR(HLOOKUP(V$3,Pivot!$B$3:$BB$56,DataTab!$G54,FALSE),\"\")","v":""},{"$f":"IFERROR(HLOOKUP(W$3,Pivot!$B$3:$BB$56,DataTab!$G54,FALSE),\"\")","v":""},{"$f":"IFERROR(HLOOKUP(X$3,Pivot!$B$3:$BB$56,DataTab!$G54,FALSE),\"\")","v":""},{"$f":"IFERROR(HLOOKUP(Y$3,Pivot!$B$3:$BB$56,DataTab!$G54,FALSE),\"\")","v":""},{"$f":"IFERROR(HLOOKUP(Z$3,Pivot!$B$3:$BB$56,DataTab!$G54,FALSE),\"\")","v":""},{"$f":"IFERROR(HLOOKUP(AA$3,Pivot!$B$3:$BB$56,DataTab!$G54,FALSE),\"\")","v":""},{"$f":"IFERROR(HLOOKUP(AB$3,Pivot!$B$3:$BB$56,DataTab!$G54,FALSE),\"\")","v":""},{"$f":"IFERROR(HLOOKUP(AC$3,Pivot!$B$3:$BB$56,DataTab!$G54,FALSE),\"\")","v":""},{"$f":"IFERROR(HLOOKUP(AD$3,Pivot!$B$3:$BB$56,DataTab!$G54,FALSE),\"\")","v":""},{"$f":"IFERROR(HLOOKUP(AE$3,Pivot!$B$3:$BB$56,DataTab!$G54,FALSE),\"\")","v":""},{"$f":"IFERROR(HLOOKUP(AF$3,Pivot!$B$3:$BB$56,DataTab!$G54,FALSE),\"\")","v":""},{"$f":"IFERROR(HLOOKUP(AG$3,Pivot!$B$3:$BB$56,DataTab!$G54,FALSE),\"\")","v":""},{"$f":"IFERROR(HLOOKUP(AH$3,Pivot!$B$3:$BB$56,DataTab!$G54,FALSE),\"\")","v":""},{"$f":"IFERROR(HLOOKUP(AI$3,Pivot!$B$3:$BB$56,DataTab!$G54,FALSE),\"\")","v":""},{"$f":"IFERROR(HLOOKUP(AJ$3,Pivot!$B$3:$BB$56,DataTab!$G54,FALSE),\"\")","v":""},{"$f":"IFERROR(HLOOKUP(AK$3,Pivot!$B$3:$BB$56,DataTab!$G54,FALSE),\"\")","v":""},{"$f":"IFERROR(HLOOKUP(AL$3,Pivot!$B$3:$BB$56,DataTab!$G54,FALSE),\"\")","v":""},{"$f":"IFERROR(HLOOKUP(AM$3,Pivot!$B$3:$BB$56,DataTab!$G54,FALSE),\"\")","v":""},{"$f":"IFERROR(HLOOKUP(AN$3,Pivot!$B$3:$BB$56,DataTab!$G54,FALSE),\"\")","v":""},{"$f":"IFERROR(HLOOKUP(AO$3,Pivot!$B$3:$BB$56,DataTab!$G54,FALSE),\"\")","v":""},{"$f":"IFERROR(HLOOKUP(AP$3,Pivot!$B$3:$BB$56,DataTab!$G54,FALSE),\"\")","v":""},{"$f":"IFERROR(HLOOKUP(AQ$3,Pivot!$B$3:$BB$56,DataTab!$G54,FALSE),\"\")","v":""},{"$f":"IFERROR(HLOOKUP(AR$3,Pivot!$B$3:$BB$56,DataTab!$G54,FALSE),\"\")","v":""},{"$f":"IFERROR(HLOOKUP(AS$3,Pivot!$B$3:$BB$56,DataTab!$G54,FALSE),\"\")","v":""},{"$f":"IFERROR(HLOOKUP(AT$3,Pivot!$B$3:$BB$56,DataTab!$G54,FALSE),\"\")","v":""},{"$f":"IFERROR(HLOOKUP(AU$3,Pivot!$B$3:$BB$56,DataTab!$G54,FALSE),\"\")","v":""},{"$f":"IFERROR(HLOOKUP(AV$3,Pivot!$B$3:$BB$56,DataTab!$G54,FALSE),\"\")","v":""},{"$f":"IFERROR(HLOOKUP(AW$3,Pivot!$B$3:$BB$56,DataTab!$G54,FALSE),\"\")","v":""},{"$f":"IFERROR(HLOOKUP(AX$3,Pivot!$B$3:$BB$56,DataTab!$G54,FALSE),\"\")","v":""},{"$f":"IFERROR(HLOOKUP(AY$3,Pivot!$B$3:$BB$56,DataTab!$G54,FALSE),\"\")","v":""},{"$f":"IFERROR(HLOOKUP(AZ$3,Pivot!$B$3:$BB$56,DataTab!$G54,FALSE),\"\")","v":""},{"$f":"IFERROR(HLOOKUP(BA$3,Pivot!$B$3:$BB$56,DataTab!$G54,FALSE),\"\")","v":""},{"$f":"IFERROR(HLOOKUP(BB$3,Pivot!$B$3:$BB$56,DataTab!$G54,FALSE),\"\")","v":""},{"$f":"IFERROR(HLOOKUP(BC$3,Pivot!$B$3:$BB$56,DataTab!$G54,FALSE),\"\")","v":""},{"$f":"IFERROR(HLOOKUP(BD$3,Pivot!$B$3:$BB$56,DataTab!$G54,FALSE),\"\")","v":""},{"$f":"IFERROR(HLOOKUP(BE$3,Pivot!$B$3:$BB$56,DataTab!$G54,FALSE),\"\")","v":""},{"$f":"IFERROR(HLOOKUP(BF$3,Pivot!$B$3:$BB$56,DataTab!$G54,FALSE),\"\")","v":""},{"$f":"IFERROR(HLOOKUP(BG$3,Pivot!$B$3:$BB$56,DataTab!$G54,FALSE),\"\")","v":""},{"$f":"IFERROR(HLOOKUP(BH$3,Pivot!$B$3:$BB$56,DataTab!$G54,FALSE),\"\")","v":""},null,""]
["Puerto Rico",2049,25,5,null,{"$f":"IF(ISBLANK(E55),\"\",VLOOKUP(E55,StateListAbbrev!$A$2:$B$53,2,FALSE))","v":""},{"$f":"IF(ISBLANK(E55),\"\",VLOOKUP(F55,'2012'!$A$10:$B$62,2,FALSE))","v":""},null,{"$f":"IFERROR(HLOOKUP(I$3,Pivot!$B$3:$BB$56,DataTab!$G55,FALSE),\"\")","v":""},{"$f":"IFERROR(HLOOKUP(J$3,Pivot!$B$3:$BB$56,DataTab!$G55,FALSE),\"\")","v":""},{"$f":"IFERROR(HLOOKUP(K$3,Pivot!$B$3:$BB$56,DataTab!$G55,FALSE),\"\")","v":""},{"$f":"IFERROR(HLOOKUP(L$3,Pivot!$B$3:$BB$56,DataTab!$G55,FALSE),\"\")","v":""},{"$f":"IFERROR(HLOOKUP(M$3,Pivot!$B$3:$BB$56,DataTab!$G55,FALSE),\"\")","v":""},{"$f":"IFERROR(HLOOKUP(N$3,Pivot!$B$3:$BB$56,DataTab!$G55,FALSE),\"\")","v":""},{"$f":"IFERROR(HLOOKUP(O$3,Pivot!$B$3:$BB$56,DataTab!$G55,FALSE),\"\")","v":""},{"$f":"IFERROR(HLOOKUP(P$3,Pivot!$B$3:$BB$56,DataTab!$G55,FALSE),\"\")","v":""},{"$f":"IFERROR(HLOOKUP(Q$3,Pivot!$B$3:$BB$56,DataTab!$G55,FALSE),\"\")","v":""},{"$f":"IFERROR(HLOOKUP(R$3,Pivot!$B$3:$BB$56,DataTab!$G55,FALSE),\"\")","v":""},{"$f":"IFERROR(HLOOKUP(S$3,Pivot!$B$3:$BB$56,DataTab!$G55,FALSE),\"\")","v":""},{"$f":"IFERROR(HLOOKUP(T$3,Pivot!$B$3:$BB$56,DataTab!$G55,FALSE),\"\")","v":""},{"$f":"IFERROR(HLOOKUP(U$3,Pivot!$B$3:$BB$56,DataTab!$G55,FALSE),\"\")","v":""},{"$f":"IFERROR(HLOOKUP(V$3,Pivot!$B$3:$BB$56,DataTab!$G55,FALSE),\"\")","v":""},{"$f":"IFERROR(HLOOKUP(W$3,Pivot!$B$3:$BB$56,DataTab!$G55,FALSE),\"\")","v":""},{"$f":"IFERROR(HLOOKUP(X$3,Pivot!$B$3:$BB$56,DataTab!$G55,FALSE),\"\")","v":""},{"$f":"IFERROR(HLOOKUP(Y$3,Pivot!$B$3:$BB$56,DataTab!$G55,FALSE),\"\")","v":""},{"$f":"IFERROR(HLOOKUP(Z$3,Pivot!$B$3:$BB$56,DataTab!$G55,FALSE),\"\")","v":""},{"$f":"IFERROR(HLOOKUP(AA$3,Pivot!$B$3:$BB$56,DataTab!$G55,FALSE),\"\")","v":""},{"$f":"IFERROR(HLOOKUP(AB$3,Pivot!$B$3:$BB$56,DataTab!$G55,FALSE),\"\")","v":""},{"$f":"IFERROR(HLOOKUP(AC$3,Pivot!$B$3:$BB$56,DataTab!$G55,FALSE),\"\")","v":""},{"$f":"IFERROR(HLOOKUP(AD$3,Pivot!$B$3:$BB$56,DataTab!$G55,FALSE),\"\")","v":""},{"$f":"IFERROR(HLOOKUP(AE$3,Pivot!$B$3:$BB$56,DataTab!$G55,FALSE),\"\")","v":""},{"$f":"IFERROR(HLOOKUP(AF$3,Pivot!$B$3:$BB$56,DataTab!$G55,FALSE),\"\")","v":""},{"$f":"IFERROR(HLOOKUP(AG$3,Pivot!$B$3:$BB$56,DataTab!$G55,FALSE),\"\")","v":""},{"$f":"IFERROR(HLOOKUP(AH$3,Pivot!$B$3:$BB$56,DataTab!$G55,FALSE),\"\")","v":""},{"$f":"IFERROR(HLOOKUP(AI$3,Pivot!$B$3:$BB$56,DataTab!$G55,FALSE),\"\")","v":""},{"$f":"IFERROR(HLOOKUP(AJ$3,Pivot!$B$3:$BB$56,DataTab!$G55,FALSE),\"\")","v":""},{"$f":"IFERROR(HLOOKUP(AK$3,Pivot!$B$3:$BB$56,DataTab!$G55,FALSE),\"\")","v":""},{"$f":"IFERROR(HLOOKUP(AL$3,Pivot!$B$3:$BB$56,DataTab!$G55,FALSE),\"\")","v":""},{"$f":"IFERROR(HLOOKUP(AM$3,Pivot!$B$3:$BB$56,DataTab!$G55,FALSE),\"\")","v":""},{"$f":"IFERROR(HLOOKUP(AN$3,Pivot!$B$3:$BB$56,DataTab!$G55,FALSE),\"\")","v":""},{"$f":"IFERROR(HLOOKUP(AO$3,Pivot!$B$3:$BB$56,DataTab!$G55,FALSE),\"\")","v":""},{"$f":"IFERROR(HLOOKUP(AP$3,Pivot!$B$3:$BB$56,DataTab!$G55,FALSE),\"\")","v":""},{"$f":"IFERROR(HLOOKUP(AQ$3,Pivot!$B$3:$BB$56,DataTab!$G55,FALSE),\"\")","v":""},{"$f":"IFERROR(HLOOKUP(AR$3,Pivot!$B$3:$BB$56,DataTab!$G55,FALSE),\"\")","v":""},{"$f":"IFERROR(HLOOKUP(AS$3,Pivot!$B$3:$BB$56,DataTab!$G55,FALSE),\"\")","v":""},{"$f":"IFERROR(HLOOKUP(AT$3,Pivot!$B$3:$BB$56,DataTab!$G55,FALSE),\"\")","v":""},{"$f":"IFERROR(HLOOKUP(AU$3,Pivot!$B$3:$BB$56,DataTab!$G55,FALSE),\"\")","v":""},{"$f":"IFERROR(HLOOKUP(AV$3,Pivot!$B$3:$BB$56,DataTab!$G55,FALSE),\"\")","v":""},{"$f":"IFERROR(HLOOKUP(AW$3,Pivot!$B$3:$BB$56,DataTab!$G55,FALSE),\"\")","v":""},{"$f":"IFERROR(HLOOKUP(AX$3,Pivot!$B$3:$BB$56,DataTab!$G55,FALSE),\"\")","v":""},{"$f":"IFERROR(HLOOKUP(AY$3,Pivot!$B$3:$BB$56,DataTab!$G55,FALSE),\"\")","v":""},{"$f":"IFERROR(HLOOKUP(AZ$3,Pivot!$B$3:$BB$56,DataTab!$G55,FALSE),\"\")","v":""},{"$f":"IFERROR(HLOOKUP(BA$3,Pivot!$B$3:$BB$56,DataTab!$G55,FALSE),\"\")","v":""},{"$f":"IFERROR(HLOOKUP(BB$3,Pivot!$B$3:$BB$56,DataTab!$G55,FALSE),\"\")","v":""},{"$f":"IFERROR(HLOOKUP(BC$3,Pivot!$B$3:$BB$56,DataTab!$G55,FALSE),\"\")","v":""},{"$f":"IFERROR(HLOOKUP(BD$3,Pivot!$B$3:$BB$56,DataTab!$G55,FALSE),\"\")","v":""},{"$f":"IFERROR(HLOOKUP(BE$3,Pivot!$B$3:$BB$56,DataTab!$G55,FALSE),\"\")","v":""},{"$f":"IFERROR(HLOOKUP(BF$3,Pivot!$B$3:$BB$56,DataTab!$G55,FALSE),\"\")","v":""},{"$f":"IFERROR(HLOOKUP(BG$3,Pivot!$B$3:$BB$56,DataTab!$G55,FALSE),\"\")","v":""},{"$f":"IFERROR(HLOOKUP(BH$3,Pivot!$B$3:$BB$56,DataTab!$G55,FALSE),\"\")","v":""},null,""]
[null,null,null,null,null,null,null,null,{"$f":"IFERROR(HLOOKUP(I$3,Pivot!$B$3:$BB$56,DataTab!$G56,FALSE),\"\")","v":""},{"$f":"IFERROR(HLOOKUP(J$3,Pivot!$B$3:$BB$56,DataTab!$G56,FALSE),\"\")","v":""},{"$f":"IFERROR(HLOOKUP(K$3,Pivot!$B$3:$BB$56,DataTab!$G56,FALSE),\"\")","v":""},{"$f":"IFERROR(HLOOKUP(L$3,Pivot!$B$3:$BB$56,DataTab!$G56,FALSE),\"\")","v":""},{"$f":"IFERROR(HLOOKUP(M$3,Pivot!$B$3:$BB$56,DataTab!$G56,FALSE),\"\")","v":""},{"$f":"IFERROR(HLOOKUP(N$3,Pivot!$B$3:$BB$56,DataTab!$G56,FALSE),\"\")","v":""},{"$f":"IFERROR(HLOOKUP(O$3,Pivot!$B$3:$BB$56,DataTab!$G56,FALSE),\"\")","v":""},{"$f":"IFERROR(HLOOKUP(P$3,Pivot!$B$3:$BB$56,DataTab!$G56,FALSE),\"\")","v":""},{"$f":"IFERROR(HLOOKUP(Q$3,Pivot!$B$3:$BB$56,DataTab!$G56,FALSE),\"\")","v":""},{"$f":"IFERROR(HLOOKUP(R$3,Pivot!$B$3:$BB$56,DataTab!$G56,FALSE),\"\")","v":""},{"$f":"IFERROR(HLOOKUP(S$3,Pivot!$B$3:$BB$56,DataTab!$G56,FALSE),\"\")","v":""},{"$f":"IFERROR(HLOOKUP(T$3,Pivot!$B$3:$BB$56,DataTab!$G56,FALSE),\"\")","v":""},{"$f":"IFERROR(HLOOKUP(U$3,Pivot!$B$3:$BB$56,DataTab!$G56,FALSE),\"\")","v":""},{"$f":"IFERROR(HLOOKUP(V$3,Pivot!$B$3:$BB$56,DataTab!$G56,FALSE),\"\")","v":""},{"$f":"IFERROR(HLOOKUP(W$3,Pivot!$B$3:$BB$56,DataTab!$G56,FALSE),\"\")","v":""},{"$f":"IFERROR(HLOOKUP(X$3,Pivot!$B$3:$BB$56,DataTab!$G56,FALSE),\"\")","v":""},{"$f":"IFERROR(HLOOKUP(Y$3,Pivot!$B$3:$BB$56,DataTab!$G56,FALSE),\"\")","v":""},{"$f":"IFERROR(HLOOKUP(Z$3,Pivot!$B$3:$BB$56,DataTab!$G56,FALSE),\"\")","v":""},{"$f":"IFERROR(HLOOKUP(AA$3,Pivot!$B$3:$BB$56,DataTab!$G56,FALSE),\"\")","v":""},{"$f":"IFERROR(HLOOKUP(AB$3,Pivot!$B$3:$BB$56,DataTab!$G56,FALSE),\"\")","v":""},{"$f":"IFERROR(HLOOKUP(AC$3,Pivot!$B$3:$BB$56,DataTab!$G56,FALSE),\"\")","v":""},{"$f":"IFERROR(HLOOKUP(AD$3,Pivot!$B$3:$BB$56,DataTab!$G56,FALSE),\"\")","v":""},{"$f":"IFERROR(HLOOKUP(AE$3,Pivot!$B$3:$BB$56,DataTab!$G56,FALSE),\"\")","v":""},{"$f":"IFERROR(HLOOKUP(AF$3,Pivot!$B$3:$BB$56,DataTab!$G56,FALSE),\"\")","v":""},{"$f":"IFERROR(HLOOKUP(AG$3,Pivot!$B$3:$BB$56,DataTab!$G56,FALSE),\"\")","v":""},{"$f":"IFERROR(HLOOKUP(AH$3,Pivot!$B$3:$BB$56,DataTab!$G56,FALSE),\"\")","v":""},{"$f":"IFERROR(HLOOKUP(AI$3,Pivot!$B$3:$BB$56,DataTab!$G56,FALSE),\"\")","v":""},{"$f":"IFERROR(HLOOKUP(AJ$3,Pivot!$B$3:$BB$56,DataTab!$G56,FALSE),\"\")","v":""},{"$f":"IFERROR(HLOOKUP(AK$3,Pivot!$B$3:$BB$56,DataTab!$G56,FALSE),\"\")","v":""},{"$f":"IFERROR(HLOOKUP(AL$3,Pivot!$B$3:$BB$56,DataTab!$G56,FALSE),\"\")","v":""},{"$f":"IFERROR(HLOOKUP(AM$3,Pivot!$B$3:$BB$56,DataTab!$G56,FALSE),\"\")","v":""},{"$f":"IFERROR(HLOOKUP(AN$3,Pivot!$B$3:$BB$56,DataTab!$G56,FALSE),\"\")","v":""},{"$f":"IFERROR(HLOOKUP(AO$3,Pivot!$B$3:$BB$56,DataTab!$G56,FALSE),\"\")","v":""},{"$f":"IFERROR(HLOOKUP(AP$3,Pivot!$B$3:$BB$56,DataTab!$G56,FALSE),\"\")","v":""},{"$f":"IFERROR(HLOOKUP(AQ$3,Pivot!$B$3:$BB$56,DataTab!$G56,FALSE),\"\")","v":""},{"$f":"IFERROR(HLOOKUP(AR$3,Pivot!$B$3:$BB$56,DataTab!$G56,FALSE),\"\")","v":""},{"$f":"IFERROR(HLOOKUP(AS$3,Pivot!$B$3:$BB$56,DataTab!$G56,FALSE),\"\")","v":""},{"$f":"IFERROR(HLOOKUP(AT$3,Pivot!$B$3:$BB$56,DataTab!$G56,FALSE),\"\")","v":""},{"$f":"IFERROR(HLOOKUP(AU$3,Pivot!$B$3:$BB$56,DataTab!$G56,FALSE),\"\")","v":""},{"$f":"IFERROR(HLOOKUP(AV$3,Pivot!$B$3:$BB$56,DataTab!$G56,FALSE),\"\")","v":""},{"$f":"IFERROR(HLOOKUP(AW$3,Pivot!$B$3:$BB$56,DataTab!$G56,FALSE),\"\")","v":""},{"$f":"IFERROR(HLOOKUP(AX$3,Pivot!$B$3:$BB$56,DataTab!$G56,FALSE),\"\")","v":""},{"$f":"IFERROR(HLOOKUP(AY$3,Pivot!$B$3:$BB$56,DataTab!$G56,FALSE),\"\")","v":""},{"$f":"IFERROR(HLOOKUP(AZ$3,Pivot!$B$3:$BB$56,DataTab!$G56,FALSE),\"\")","v":""},{"$f":"IFERROR(HLOOKUP(BA$3,Pivot!$B$3:$BB$56,DataTab!$G56,FALSE),\"\")","v":""},{"$f":"IFERROR(HLOOKUP(BB$3,Pivot!$B$3:$BB$56,DataTab!$G56,FALSE),\"\")","v":""},{"$f":"IFERROR(HLOOKUP(BC$3,Pivot!$B$3:$BB$56,DataTab!$G56,FALSE),\"\")","v":""},{"$f":"IFERROR(HLOOKUP(BD$3,Pivot!$B$3:$BB$56,DataTab!$G56,FALSE),\"\")","v":""},{"$f":"IFERROR(HLOOKUP(BE$3,Pivot!$B$3:$BB$56,DataTab!$G56,FALSE),\"\")","v":""},{"$f":"IFERROR(HLOOKUP(BF$3,Pivot!$B$3:$BB$56,DataTab!$G56,FALSE),\"\")","v":""},{"$f":"IFERROR(HLOOKUP(BG$3,Pivot!$B$3:$BB$56,DataTab!$G56,FALSE),\"\")","v":""},{"$f":"IFERROR(HLOOKUP(BH$3,Pivot!$B$3:$BB$56,DataTab!$G56,FALSE),\"\")","v":""}]
[]
["Alabama",{"$f":"\"Rank: \" & VLOOKUP(A58,A1:C55,3,FALSE) & \" most migration of 52 states/territories\"","v":"Rank: 41 most migration of 52 states/territories"},null,null,null,null,null,null,"Alabama","Alaska","Arizona","Arkansas","California","Colorado","Connecticut","Delaware","District of Columbia ","Florida","Georgia","Hawaii","Idaho","Illinois","Indiana","Iowa","Kansas","Kentucky","Louisiana","Maine","Maryland","Massachusetts","Michigan","Minnesota","Mississippi","Missouri","Montana","Nebraska","Nevada","New Hampshire","New Jersey","New Mexico","New York","North Carolina","North Dakota","Ohio","Oklahoma","Oregon","Pennsylvania","Rhode Island","South Carolina","South Dakota","Tennessee","Texas","Utah","Vermont","Virginia","Washington","West Virginia","Wisconsin","Wyoming","Puerto Rico"]
[null,{"$f":"\"Total migration out: \" & IF(VLOOKUP(A58,A1:C55,2,FALSE) = 0,\"no migration\", TEXT(VLOOKUP(A58,A1:C55,2,FALSE),\"#,###\") & \" people\")","v":"Total migration out: 883 people"},null,null,null,null,2010,null,{"$f":"HLOOKUP(DataTab!I58,'2010'!$J$9:$BI$64,56,FALSE)","v":26},{"$f":"HLOOKUP(DataTab!J58,'2010'!$J$9:$BI$64,56,FALSE)","v":27},{"$f":"HLOOKUP(DataTab!K58,'2010'!$J$9:$BI$64,56,FALSE)","v":13},{"$f":"HLOOKUP(DataTab!L58,'2010'!$J$9:$BI$64,56,FALSE)","v":36},{"$f":"HLOOKUP(DataTab!M58,'2010'!$J$9:$BI$64,56,FALSE)","v":1},{"$f":"HLOOKUP(DataTab!N58,'2010'!$J$9:$BI$64,56,FALSE)","v":19},{"$f":"HLOOKUP(DataTab!O58,'2010'!$J$9:$BI$64,56,FALSE)","v":31},{"$f":"HLOOKUP(DataTab!P58,'2010'!$J$9:$BI$64,56,FALSE)","v":47},{"$f":"HLOOKUP(DataTab!Q58,'2010'!$J$9:$BI$64,56,FALSE)","v":38},{"$f":"HLOOKUP(DataTab!R58,'2010'!$J$9:$BI$64,56,FALSE)","v":2},{"$f":"HLOOKUP(DataTab!S58,'2010'!$J$9:$BI$64,56,FALSE)","v":6},{"$f":"HLOOKUP(DataTab!T58,'2010'!$J$9:$BI$64,56,FALSE)","v":42},{"$f":"HLOOKUP(DataTab!U58,'2010'!$J$9:$BI$64,56,FALSE)","v":39},{"$f":"HLOOKUP(DataTab!V58,'2010'!$J$9:$BI$64,56,FALSE)","v":5},{"$f":"HLOOKUP(DataTab!W58,'2010'!$J$9:$BI$64,56,FALSE)","v":20},{"$f":"HLOOKUP(DataTab!X58,'2010'!$J$9:$BI$64,56,FALSE)","v":35},{"$f":"HLOOKUP(DataTab!Y58,'2010'!$J$9:$BI$64,56,FALSE)","v":29},{"$f":"HLOOKUP(DataTab!Z58,'2010'!$J$9:$BI$64,56,FALSE)","v":28},{"$f":"HLOOKUP(DataTab!AA58,'2010'!$J$9:$BI$64,56,FALSE)","v":32},{"$f":"HLOOKUP(DataTab!AB58,'2010'!$J$9:$BI$64,56,FALSE)","v":46},{"$f":"HLOOKUP(DataTab!AC58,'2010'!$J$9:$BI$64,56,FALSE)","v":15},{"$f":"HLOOKUP(DataTab!AD58,'2010'!$J$9:$BI$64,56,FALSE)","v":17},{"$f":"HLOOKUP(DataTab!AE58,'2010'!$J$9:$BI$64,56,FALSE)","v":12},{"$f":"HLOOKUP(DataTab!AF58,'2010'!$J$9:$BI$64,56,FALSE)","v":24},{"$f":"HLOOKUP(DataTab!AG58,'2010'!$J$9:$BI$64,56,FALSE)","v":34},{"$f":"HLOOKUP(DataTab!AH58,'2010'!$J$9:$BI$64,56,FALSE)","v":16},{"$f":"HLOOKUP(DataTab!AI58,'2010'!$J$9:$BI$64,56,FALSE)","v":45},{"$f":"HLOOKUP(DataTab!AJ58,'2010'!$J$9:$BI$64,56,FALSE)","v":43},{"$f":"HLOOKUP(DataTab!AK58,'2010'!$J$9:$BI$64,56,FALSE)","v":23},{"$f":"HLOOKUP(DataTab!AL58,'2010'!$J$9:$BI$64,56,FALSE)","v":44},{"$f":"HLOOKUP(DataTab!AM58,'2010'!$J$9:$BI$64,56,FALSE)","v":10},{"$f":"HLOOKUP(DataTab!AN58,'2010'!$J$9:$BI$64,56,FALSE)","v":40},{"$f":"HLOOKUP(DataTab!AO58,'2010'!$J$9:$BI$64,56,FALSE)","v":4},{"$f":"HLOOKUP(DataTab!AP58,'2010'!$J$9:$BI$64,56,FALSE)","v":9},{"$f":"HLOOKUP(DataTab!AQ58,'2010'!$J$9:$BI$64,56,FALSE)","v":51},{"$f":"HLOOKUP(DataTab!AR58,'2010'!$J$9:$BI$64,56,FALSE)","v":11},{"$f":"HLOOKUP(DataTab!AS58,'2010'!$J$9:$BI$64,56,FALSE)","v":30},{"$f":"HLOOKUP(DataTab!AT58,'2010'!$J$9:$BI$64,56,FALSE)","v":25},{"$f":"HLOOKUP(DataTab!AU58,'2010'!$J$9:$BI$64,56,FALSE)","v":8},{"$f":"HLOOKUP(DataTab!AV58,'2010'!$J$9:$BI$64,56,FALSE)","v":50},{"$f":"HLOOKUP(DataTab!AW58,'2010'!$J$9:$BI$64,56,FALSE)","v":21},{"$f":"HLOOKUP(DataTab!AX58,'2010'!$J$9:$BI$64,56,FALSE)","v":49},{"$f":"HLOOKUP(DataTab!AY58,'2010'!$J$9:$BI$64,56,FALSE)","v":18},{"$f":"HLOOKUP(DataTab!AZ58,'2010'!$J$9:$BI$64,56,FALSE)","v":3},{"$f":"HLOOKUP(DataTab!BA58,'2010'!$J$9:$BI$64,56,FALSE)","v":33},{"$f":"HLOOKUP(DataTab!BB58,'2010'!$J$9:$BI$64,56,FALSE)","v":52},{"$f":"HLOOKUP(DataTab!BC58,'2010'!$J$9:$BI$64,56,FALSE)","v":7},{"$f":"HLOOKUP(DataTab!BD58,'2010'!$J$9:$BI$64,56,FALSE)","v":14},{"$f":"HLOOKUP(DataTab!BE58,'2010'!$J$9:$BI$64,56,FALSE)","v":41},{"$f":"HLOOKUP(DataTab!BF58,'2010'!$J$9:$BI$64,56,FALSE)","v":22},{"$f":"HLOOKUP(DataTab!BG58,'2010'!$J$9:$BI$64,56,FALSE)","v":48},{"$f":"HLOOKUP(DataTab!BH58,'2010'!$J$9:$BI$64,56,FALSE)","v":37}]
["People Count",2010,2011,2012,"2010           2011            2012",null,2011,null,{"$f":"HLOOKUP(DataTab!I58,'2011'!J9:BI64,56,FALSE)","v":24},{"$f":"HLOOKUP(DataTab!J58,'2011'!K9:BJ64,56,FALSE)","v":30},{"$f":"HLOOKUP(DataTab!K58,'2011'!L9:BK64,56,FALSE)","v":11},{"$f":"HLOOKUP(DataTab!L58,'2011'!M9:BL64,56,FALSE)","v":33},{"$f":"HLOOKUP(DataTab!M58,'2011'!N9:BM64,56,FALSE)","v":1},{"$f":"HLOOKUP(DataTab!N58,'2011'!O9:BN64,56,FALSE)","v":16},{"$f":"HLOOKUP(DataTab!O58,'2011'!P9:BO64,56,FALSE)","v":29},{"$f":"HLOOKUP(DataTab!P58,'2011'!Q9:BP64,56,FALSE)","v":50},{"$f":"HLOOKUP(DataTab!Q58,'2011'!R9:BQ64,56,FALSE)","v":42},{"$f":"HLOOKUP(DataTab!R58,'2011'!S9:BR64,56,FALSE)","v":2},{"$f":"HLOOKUP(DataTab!S58,'2011'!T9:BS64,56,FALSE)","v":6},{"$f":"HLOOKUP(DataTab!T58,'2011'!U9:BT64,56,FALSE)","v":38},{"$f":"HLOOKUP(DataTab!U58,'2011'!V9:BU64,56,FALSE)","v":40},{"$f":"HLOOKUP(DataTab!V58,'2011'!W9:BV64,56,FALSE)","v":5},{"$f":"HLOOKUP(DataTab!W58,'2011'!X9:BW64,56,FALSE)","v":19},{"$f":"HLOOKUP(DataTab!X58,'2011'!Y9:BX64,56,FALSE)","v":35},{"$f":"HLOOKUP(DataTab!Y58,'2011'!Z9:BY64,56,FALSE)","v":28},{"$f":"HLOOKUP(DataTab!Z58,'2011'!AA9:BZ64,56,FALSE)","v":27},{"$f":"HLOOKUP(DataTab!AA58,'2011'!AB9:CA64,56,FALSE)","v":31},{"$f":"HLOOKUP(DataTab!AB58,'2011'!AC9:CB64,56,FALSE)","v":45},{"$f":"HLOOKUP(DataTab!AC58,'2011'!AD9:CC64,56,FALSE)","v":15},{"$f":"HLOOKUP(DataTab!AD58,'2011'!AE9:CD64,56,FALSE)","v":18},{"$f":"HLOOKUP(DataTab!AE58,'2011'!AF9:CE64,56,FALSE)","v":14},{"$f":"HLOOKUP(DataTab!AF58,'2011'!AG9:CF64,56,FALSE)","v":26},{"$f":"HLOOKUP(DataTab!AG58,'2011'!AH9:CG64,56,FALSE)","v":37},{"$f":"HLOOKUP(DataTab!AH58,'2011'!AI9:CH64,56,FALSE)","v":20},{"$f":"HLOOKUP(DataTab!AI58,'2011'!AJ9:CI64,56,FALSE)","v":48},{"$f":"HLOOKUP(DataTab!AJ58,'2011'!AK9:CJ64,56,FALSE)","v":41},{"$f":"HLOOKUP(DataTab!AK58,'2011'!AL9:CK64,56,FALSE)","v":22},{"$f":"HLOOKUP(DataTab!AL58,'2011'!AM9:CL64,56,FALSE)","v":44},{"$f":"HLOOKUP(DataTab!AM58,'2011'!AN9:CM64,56,FALSE)","v":9},{"$f":"HLOOKUP(DataTab!AN58,'2011'!AO9:CN64,56,FALSE)","v":39},{"$f":"HLOOKUP(DataTab!AO58,'2011'!AP9:CO64,56,FALSE)","v":4},{"$f":"HLOOKUP(DataTab!AP58,'2011'!AQ9:CP64,56,FALSE)","v":8},{"$f":"HLOOKUP(DataTab!AQ58,'2011'!AR9:CQ64,56,FALSE)","v":51},{"$f":"HLOOKUP(DataTab!AR58,'2011'!AS9:CR64,56,FALSE)","v":12},{"$f":"HLOOKUP(DataTab!AS58,'2011'!AT9:CS64,56,FALSE)","v":32},{"$f":"HLOOKUP(DataTab!AT58,'2011'!AU9:CT64,56,FALSE)","v":23},{"$f":"HLOOKUP(DataTab!AU58,'2011'!AV9:CU64,56,FALSE)","v":10},{"$f":"HLOOKUP(DataTab!AV58,'2011'!AW9:CV64,56,FALSE)","v":47},{"$f":"HLOOKUP(DataTab!AW58,'2011'!AX9:CW64,56,FALSE)","v":21},{"$f":"HLOOKUP(DataTab!AX58,'2011'!AY9:CX64,56,FALSE)","v":49},{"$f":"HLOOKUP(DataTab!AY58,'2011'!AZ9:CY64,56,FALSE)","v":17},{"$f":"HLOOKUP(DataTab!AZ58,'2011'!BA9:CZ64,56,FALSE)","v":3},{"$f":"HLOOKUP(DataTab!BA58,'2011'!BB9:DA64,56,FALSE)","v":36},{"$f":"HLOOKUP(DataTab!BB58,'2011'!BC9:DB64,56,FALSE)","v":52},{"$f":"HLOOKUP(DataTab!BC58,'2011'!BD9:DC64,56,FALSE)","v":7},{"$f":"HLOOKUP(DataTab!BD58,'2011'!BE9:DD64,56,FALSE)","v":13},{"$f":"HLOOKUP(DataTab!BE58,'2011'!BF9:DE64,56,FALSE)","v":43},{"$f":"HLOOKUP(DataTab!BF58,'2011'!BG9:DF64,56,FALSE)","v":25},{"$f":"HLOOKUP(DataTab!BG58,'2011'!BH9:DG64,56,FALSE)","v":46},{"$f":"HLOOKUP(DataTab!BH58,'2011'!BI9:DH64,56,FALSE)","v":34}]
["Population 1 year and over",{"$f":"VLOOKUP(A58,'2010'!$B$7:$H$62,2,FALSE)","v":4729509},{"$f":"VLOOKUP(A58,'2011'!$B$7:$H$62,2,FALSE)","v":4745278},{"$f":"VLOOKUP(A58,'2012'!$A$7:$H$62,3,FALSE)","v":4764428},null,null,2012,null,{"$f":"HLOOKUP(DataTab!I58,'2012'!$J$9:$BI$64,56,FALSE)","v":23},{"$f":"HLOOKUP(DataTab!J58,'2012'!$J$9:$BI$64,56,FALSE)","v":32},{"$f":"HLOOKUP(DataTab!K58,'2012'!$J$9:$BI$64,56,FALSE)","v":11},{"$f":"HLOOKUP(DataTab!L58,'2012'!$J$9:$BI$64,56,FALSE)","v":37},{"$f":"HLOOKUP(DataTab!M58,'2012'!$J$9:$BI$64,56,FALSE)","v":1},{"$f":"HLOOKUP(DataTab!N58,'2012'!$J$9:$BI$64,56,FALSE)","v":16},{"$f":"HLOOKUP(DataTab!O58,'2012'!$J$9:$BI$64,56,FALSE)","v":31},{"$f":"HLOOKUP(DataTab!P58,'2012'!$J$9:$BI$64,56,FALSE)","v":49},{"$f":"HLOOKUP(DataTab!Q58,'2012'!$J$9:$BI$64,56,FALSE)","v":40},{"$f":"HLOOKUP(DataTab!R58,'2012'!$J$9:$BI$64,56,FALSE)","v":2},{"$f":"HLOOKUP(DataTab!S58,'2012'!$J$9:$BI$64,56,FALSE)","v":6},{"$f":"HLOOKUP(DataTab!T58,'2012'!$J$9:$BI$64,56,FALSE)","v":39},{"$f":"HLOOKUP(DataTab!U58,'2012'!$J$9:$BI$64,56,FALSE)","v":41},{"$f":"HLOOKUP(DataTab!V58,'2012'!$J$9:$BI$64,56,FALSE)","v":5},{"$f":"HLOOKUP(DataTab!W58,'2012'!$J$9:$BI$64,56,FALSE)","v":19},{"$f":"HLOOKUP(DataTab!X58,'2012'!$J$9:$BI$64,56,FALSE)","v":35},{"$f":"HLOOKUP(DataTab!Y58,'2012'!$J$9:$BI$64,56,FALSE)","v":30},{"$f":"HLOOKUP(DataTab!Z58,'2012'!$J$9:$BI$64,56,FALSE)","v":25},{"$f":"HLOOKUP(DataTab!AA58,'2012'!$J$9:$BI$64,56,FALSE)","v":29},{"$f":"HLOOKUP(DataTab!AB58,'2012'!$J$9:$BI$64,56,FALSE)","v":45},{"$f":"HLOOKUP(DataTab!AC58,'2012'!$J$9:$BI$64,56,FALSE)","v":18},{"$f":"HLOOKUP(DataTab!AD58,'2012'!$J$9:$BI$64,56,FALSE)","v":17},{"$f":"HLOOKUP(DataTab!AE58,'2012'!$J$9:$BI$64,56,FALSE)","v":14},{"$f":"HLOOKUP(DataTab!AF58,'2012'!$J$9:$BI$64,56,FALSE)","v":22},{"$f":"HLOOKUP(DataTab!AG58,'2012'!$J$9:$BI$64,56,FALSE)","v":36},{"$f":"HLOOKUP(DataTab!AH58,'2012'!$J$9:$BI$64,56,FALSE)","v":20},{"$f":"HLOOKUP(DataTab!AI58,'2012'!$J$9:$BI$64,56,FALSE)","v":46},{"$f":"HLOOKUP(DataTab!AJ58,'2012'!$J$9:$BI$64,56,FALSE)","v":42},{"$f":"HLOOKUP(DataTab!AK58,'2012'!$J$9:$BI$64,56,FALSE)","v":27},{"$f":"HLOOKUP(DataTab!AL58,'2012'!$J$9:$BI$64,56,FALSE)","v":44},{"$f":"HLOOKUP(DataTab!AM58,'2012'!$J$9:$BI$64,56,FALSE)","v":10},{"$f":"HLOOKUP(DataTab!AN58,'2012'!$J$9:$BI$64,56,FALSE)","v":38},{"$f":"HLOOKUP(DataTab!AO58,'2012'!$J$9:$BI$64,56,FALSE)","v":3},{"$f":"HLOOKUP(DataTab!AP58,'2012'!$J$9:$BI$64,56,FALSE)","v":7},{"$f":"HLOOKUP(DataTab!AQ58,'2012'!$J$9:$BI$64,56,FALSE)","v":50},{"$f":"HLOOKUP(DataTab!AR58,'2012'!$J$9:$BI$64,56,FALSE)","v":12},{"$f":"HLOOKUP(DataTab!AS58,'2012'!$J$9:$BI$64,56,FALSE)","v":26},{"$f":"HLOOKUP(DataTab!AT58,'2012'!$J$9:$BI$64,56,FALSE)","v":24},{"$f":"HLOOKUP(DataTab!AU58,'2012'!$J$9:$BI$64,56,FALSE)","v":9},{"$f":"HLOOKUP(DataTab!AV58,'2012'!$J$9:$BI$64,56,FALSE)","v":48},{"$f":"HLOOKUP(DataTab!AW58,'2012'!$J$9:$BI$64,56,FALSE)","v":21},{"$f":"HLOOKUP(DataTab!AX58,'2012'!$J$9:$BI$64,56,FALSE)","v":51},{"$f":"HLOOKUP(DataTab!AY58,'2012'!$J$9:$BI$64,56,FALSE)","v":15},{"$f":"HLOOKUP(DataTab!AZ58,'2012'!$J$9:$BI$64,56,FALSE)","v":4},{"$f":"HLOOKUP(DataTab!BA58,'2012'!$J$9:$BI$64,56,FALSE)","v":33},{"$f":"HLOOKUP(DataTab!BB58,'2012'!$J$9:$BI$64,56,FALSE)","v":52},{"$f":"HLOOKUP(DataTab!BC58,'2012'!$J$9:$BI$64,56,FALSE)","v":8},{"$f":"HLOOKUP(DataTab!BD58,'2012'!$J$9:$BI$64,56,FALSE)","v":13},{"$f":"HLOOKUP(DataTab!BE58,'2012'!$J$9:$BI$64,56,FALSE)","v":43},{"$f":"HLOOKUP(DataTab!BF58,'2012'!$J$9:$BI$64,56,FALSE)","v":28},{"$f":"HLOOKUP(DataTab!BG58,'2012'!$J$9:$BI$64,56,FALSE)","v":47},{"$f":"HLOOKUP(DataTab!BH58,'2012'!$J$9:$BI$64,56,FALSE)","v":34}]
["Same residence 1 year ago",{"$f":"VLOOKUP(A58,'2010'!$B$7:$H$62,4,FALSE)","v":3987155},{"$f":"VLOOKUP(A58,'2011'!$B$7:$H$62,4,FALSE)","v":4024442},{"$f":"VLOOKUP(A58,'2012'!$A$7:$H$62,5,FALSE)","v":4054260}]
["Different residence, same state 1 year ago",{"$f":"VLOOKUP(A58,'2010'!$B$7:$H$62,6,FALSE)","v":620465},{"$f":"VLOOKUP(A58,'2011'!$B$7:$H$62,6,FALSE)","v":588293},{"$f":"VLOOKUP(A58,'2012'!$A$7:$H$62,7,FALSE)","v":590326}]
[]
[]
[]
[null,"AxisMin","AxisMax"]
["Chart 1(e61)",{"$f":"MIN(B61:D61)*0.999","v":4724779.4910000004},{"$f":"MAX(B61:D61)*1.01","v":4812072.28},null,null,null,null,null,null,null,null,null,null,null,null,"Color Scale"]
["Chart 2(e62)",{"$f":"MIN(B62:D62)*0.999","v":3983167.8450000002},{"$f":"MAX(B62:D62)*1.01","v":4094802.6},null,null,null,null,null,null,null,null,null,null,null,null,"Case","R","G","b"]
["Chart 3(e63)",{"$f":"MIN(B63:D63)*0.999","v":587704.70700000005},{"$f":"MAX(B63:D63)*1.01","v":626669.65},null,null,null,null,null,null,null,null,null,null,null,null,1,192,0,0]
[null,null,null,null,null,null,null,null,null,null,null,null,null,null,null,2,192,20,0]
[null,null,null,null,null,null,null,null,null,null,null,null,null,null,null,3,192,40,0]
[null,null,null,null,null,null,null,null,null,null,null,null,null,null,null,4,192,60,0]
[null,null,null,null,null,null,null,null,null,null,null,null,null,null,null,5,192,80,0]
[null,null,null,null,null,null,null,null,null,null,null,null,null,null,null,6,192,100,0]
[null,null,null,null,null,null,null,null,null,null,null,null,null,null,null,7,192,120,0]
[null,null,null,null,null,null,null,null,null,null,null,null,null,null,null,8,192,140,0]
[null,null,null,null,null,null,null,null,null,null,null,null,null,null,null,9,192,160,0]
[null,null,null,null,null,null,null,null,null,null,null,null,null,null,null,10,192,192,0]

{"sheet":"Pivot","index":6,"n_rows":57,"n_cols":54,"rows_kept":57,"cut":false,"hidden":true,"merged":[]}
[null,null,"Alabama","Alaska","Arizona","Arkansas","California","Colorado","Connecticut","Delaware","District of Columbia ","Florida","Georgia","Hawaii","Idaho","Illinois","Indiana","Iowa","Kansas","Kentucky","Louisiana","Maine","Maryland","Massachusetts","Michigan","Minnesota","Mississippi","Missouri","Montana","Nebraska","Nevada","New Hampshire","New Jersey","New Mexico","New York","North Carolina","North Dakota","Ohio","Oklahoma","Oregon","Pennsylvania","Rhode Island","South Carolina","South Dakota","Tennessee","Texas","Utah","Vermont","Virginia","Washington","West Virginia","Wisconsin","Wyoming","Puerto Rico"]
[null,1,2,3,4,5,6,7,8,9,10,11,12,13,14,15,16,17,18,19,20,21,22,23,24,25,26,27,28,29,30,31,32,33,34,35,36,37,38,39,40,41,42,43,44,45,46,47,48,49,50,51,52,53]
[null,"Row Labels","Sum of Alabama","Sum of Alaska","Sum of Arizona","Sum of Arkansas","Sum of California","Sum of Colorado","Sum of Connecticut","Sum of Delaware","Sum of District of Columbia ","Sum of Florida","Sum of Georgia","Sum of Hawaii","Sum of Idaho","Sum of Illinois","Sum of Indiana","Sum of Iowa","Sum of Kansas","Sum of Kentucky","Sum of Louisiana","Sum of Maine","Sum of Maryland","Sum of Massachusetts","Sum of Michigan","Sum of Minnesota","Sum of Mississippi","Sum of Missouri","Sum of Montana","Sum of Nebraska","Sum of Nevada","Sum of New Hampshire","Sum of New Jersey","Sum of New Mexico","Sum of New York","Sum of North Carolina","Sum of North Dakota","Sum of Ohio","Sum of Oklahoma","Sum of Oregon","Sum of Pennsylvania","Sum of Rhode Island","Sum of South Carolina","Sum of South Dakota","Sum of Tennessee","Sum of Texas","Sum of Utah","Sum of Vermont","Sum of Virginia","Sum of Washington","Sum of West Virginia","Sum of Wisconsin","Sum of Wyoming","Sum of Puerto Rico"]
[2,"United States",109210,84068,206842,64967,566986,161530,87023,25149,59513,428325,252262,61509,55191,277953,144597,73325,93134,103004,95956,38574,157664,158156,175733,115946,66947,142754,33832,48816,98882,38696,219202,63921,405864,238663,23959,199202,102572,108182,237156,30498,127418,22534,163843,402187,82165,20056,238540,180462,47425,97724,32228,74500]
[3,"Alabama",0,1004,962,660,3077,1386,284,42,162,11244,19920,627,493,2722,1347,345,865,2495,3104,67,1513,334,2298,752,4952,1555,101,151,1009,161,1702,459,2709,5133,228,1411,194,200,1837,0,2811,518,10539,7468,579,0,3170,1034,128,760,88,619]
[4,"Alaska",1097,0,1520,196,3494,556,0,0,356,1991,928,1376,538,58,260,13,221,161,120,66,508,297,563,192,56,819,371,1195,803,118,116,263,736,920,264,1316,335,3174,255,0,384,99,451,1488,330,79,1265,3725,0,206,136,25]
[5,"Arizona",1331,3717,0,1214,44889,13790,417,246,36,5553,2263,2491,2934,10744,2930,2702,2498,1328,724,616,3007,1961,9598,8570,293,2595,1118,2293,6712,510,2564,6946,7402,2721,877,7906,1626,8587,4280,614,1070,1472,5075,14788,5916,207,2763,13247,765,3765,2786,1791]
[6,"Arkansas",374,855,1677,0,3525,603,185,0,205,2682,1525,0,0,3576,1172,409,1033,1310,3953,17,169,254,1283,295,3689,9105,258,166,121,0,157,547,2262,3057,0,1135,9938,193,516,59,52,673,4195,11767,269,0,1159,251,84,695,1498,0]
[7,"California",2509,6995,38916,3472,0,15150,6764,474,3199,21004,10790,11906,5331,21251,5891,2284,2790,3763,5180,1256,7902,14356,8921,8539,2556,6729,3060,3302,27968,1327,12057,5921,31261,11195,1827,10653,6671,22724,10466,1648,4110,826,5802,43005,12172,544,15625,34569,1413,5681,1886,2323]
[8,"Colorado",3108,3457,10589,1043,22152,0,1317,70,488,8615,5834,2536,2660,6374,4336,2776,5283,2500,5048,20,2844,5939,3343,2992,835,3771,2021,4472,3789,679,2464,6520,7250,4378,1918,4533,4582,2419,3950,137,2383,756,2535,17355,6398,503,3796,4853,837,3000,5602,1144]
[9,"Connecticut",46,439,3167,200,3161,367,0,22,288,6578,1702,408,97,912,53,0,0,124,909,1224,1752,8743,753,605,276,358,50,45,172,1009,5665,444,23310,3379,0,287,415,35,2214,1558,940,0,260,3279,45,709,1729,1593,174,711,104,3228]
[10,"Delaware",119,692,188,0,2221,0,1489,0,11,715,179,0,32,567,62,30,113,0,178,0,5649,157,227,351,58,80,0,91,572,99,5846,85,3566,1349,0,191,0,0,6828,135,298,0,344,133,166,0,1746,29,161,0,0,56]
[11,"District of Columbia ",79,1247,902,35,4999,677,618,78,0,1705,1079,38,46,795,469,133,164,112,283,194,14120,1524,944,393,44,337,0,172,42,197,1451,116,3085,985,0,651,0,157,1494,635,150,0,577,1473,116,267,9537,481,293,721,215,0]
[12,"Florida",18599,10704,6473,3321,20386,8766,8975,1099,780,0,42754,3177,1268,22565,13803,3864,5661,6912,5550,7348,10442,15159,23400,5460,5490,10666,1758,945,1241,2362,27606,2853,53009,23133,239,22927,3142,2919,25659,3050,11366,1070,16275,28564,2499,2747,25697,4943,3533,6216,773,21638]
[13,"Georgia",13864,2654,6657,1041,14174,4710,1829,226,1352,42870,0,1409,936,7143,5972,1687,1497,6172,4100,222,3619,4153,9949,2237,3280,3377,251,1283,3783,15,4920,915,13957,16009,207,7501,3299,453,9076,440,18611,257,17606,16198,20,84,10702,1965,1237,3441,106,1730]
[14,"Hawaii",608,1417,1865,24,9756,1216,191,278,230,2780,1448,0,404,318,292,84,1135,485,207,91,2491,1266,321,192,44,944,131,75,760,85,410,284,2382,2241,0,884,1095,1763,1087,106,644,459,1314,3300,2183,0,1393,5920,197,295,50,336]
[15,"Idaho",575,1198,2424,291,10280,1186,44,120,116,2014,583,206,0,532,283,90,63,83,54,0,107,338,683,637,87,214,3800,35,2535,0,214,675,938,817,0,1018,93,4963,169,0,205,118,1957,1352,6617,0,269,10398,0,225,677,136]
[16,"Illinois",883,2250,7139,1587,14940,3036,955,234,1066,12687,8745,869,1384,0,16907,8529,2009,2923,1229,526,1865,3296,12583,6537,2744,13264,228,1302,1478,283,2366,1359,7561,3761,196,6872,1491,954,4588,462,1583,394,4648,16780,1154,156,4311,2704,1221,14414,302,2049]
[17,"Indiana",1625,479,2763,564,6033,1225,823,639,1045,11472,2258,856,186,28436,0,1678,1624,11177,736,0,1050,837,11017,1543,1948,4526,134,591,1011,0,1537,219,2316,2665,113,11235,1198,387,2419,0,1414,111,3547,4490,105,0,1932,258,507,1727,1681,136]
[18,"Iowa",503,951,1590,451,3268,3252,112,0,151,4335,596,521,290,11969,1716,0,918,819,763,78,419,585,946,7505,751,4168,452,7698,681,56,1018,114,1230,734,833,1127,1465,348,451,0,943,1158,1148,3553,886,0,268,919,22,3607,392,786]
[19,"Kansas",853,333,3094,2158,5411,3746,210,0,456,3118,1896,149,456,1702,1679,1527,0,617,438,211,282,187,1125,682,452,21022,300,4126,851,0,267,1029,571,813,261,1310,8408,848,918,18,556,154,1542,8468,97,70,1705,3265,139,486,278,82]
[20,"Kentucky",4137,304,1103,518,3415,712,246,706,254,9232,4173,647,50,4445,12203,238,602,0,666,46,1120,419,7302,605,646,2381,0,723,301,84,496,554,5239,3643,122,17041,577,298,2226,0,1347,0,10064,3345,464,45,3319,1988,3346,1395,0,170]
[21,"Louisiana",2329,403,2021,3645,5139,1433,164,0,596,6534,4478,378,265,1229,1359,544,420,1649,0,251,642,549,1080,330,6791,1591,428,745,931,11,975,150,2786,2284,64,1115,2159,195,1239,737,1914,0,2348,24488,277,45,1857,1581,238,682,146,655]
[22,"Maine",129,38,230,0,1610,314,1468,234,32,2926,511,0,143,195,0,7,277,482,15,0,325,3887,116,430,79,69,0,82,35,3655,405,272,2519,1112,0,628,79,215,976,1024,173,0,985,496,200,349,573,118,51,0,59,38]
[23,"Maryland",1261,1947,760,136,8614,1071,881,4100,21213,9610,4610,610,429,3621,1210,569,1726,715,606,332,0,3977,2167,1422,581,256,0,132,330,1124,6260,638,11736,7507,116,2522,463,378,15485,82,2297,0,1800,5612,1061,589,20579,1431,1957,460,0,294]
[24,"Massachusetts",636,890,1972,394,12770,980,10525,506,379,12890,2789,1108,188,2886,677,151,565,52,1556,3907,2381,0,1337,966,155,453,49,182,787,13331,8046,521,19467,2514,81,1829,297,1528,8236,6863,2477,194,823,3694,1027,2534,4098,1653,385,584,264,4056]
[25,"Michigan",2341,1152,7168,906,8085,2363,798,114,274,13146,4270,291,242,10047,10976,993,805,3409,1284,261,2201,1720,0,1127,922,2206,218,113,1354,446,1617,1318,5731,3912,265,11318,705,811,2739,68,1822,66,3259,8638,819,60,3057,2146,353,4768,1277,782]
[26,"Minnesota",1299,523,3065,375,8086,3565,696,0,310,2372,2235,1277,575,5896,2026,7220,924,57,791,187,1841,814,2212,0,202,1709,1257,992,932,0,1038,322,1849,1745,6672,2635,1212,781,1106,299,1705,3442,1738,4001,429,77,1037,1685,0,17618,213,134]
[27,"Mississippi",5141,0,710,2680,4371,799,106,0,97,4676,2669,184,586,2703,1200,160,400,446,8588,163,379,67,1768,568,0,2634,166,138,526,60,2127,86,1492,1709,98,896,562,465,613,185,596,79,11643,7230,454,0,1929,433,0,611,307,81]
[28,"Missouri",1333,2186,2297,9434,10717,3798,410,234,144,8374,3451,2114,596,22001,4184,5956,20218,2291,1178,996,1246,810,2964,2798,1110,0,511,1999,836,35,960,451,2834,3988,636,3557,5298,1186,1535,361,2856,527,3122,9278,3287,318,2609,2312,148,2636,810,826]
[29,"Montana",31,726,1548,63,5428,2135,0,0,0,1875,292,556,3385,542,163,415,224,367,0,225,33,97,822,481,32,447,0,108,968,115,156,259,482,1082,977,402,1018,2950,457,0,230,191,45,1393,260,87,156,4783,0,750,934,0]
[30,"Nebraska",245,626,2406,363,3438,2023,0,0,0,1368,786,165,315,1193,290,6815,3103,131,411,68,129,195,258,1489,176,2223,108,0,233,0,524,158,318,874,497,563,587,106,702,0,456,2507,232,3130,229,79,1076,1327,111,316,917,0]
[31,"Nevada",761,2161,8748,353,49978,6402,143,373,468,3381,745,2053,1503,2822,362,714,1202,952,421,209,934,318,1235,1157,783,694,1086,714,0,175,912,1138,3521,767,702,1407,1520,3101,1601,336,480,0,1699,5484,4605,121,1135,2997,100,1046,766,237]
[32,"New Hampshire",0,437,440,0,1514,572,1345,0,101,2746,470,43,20,673,297,53,102,284,7,6118,33,18990,426,0,0,289,0,110,0,0,591,223,2905,1609,0,324,186,208,890,1248,323,0,77,2150,557,2960,660,113,80,239,71,75]
[33,"New Jersey",779,359,1328,57,4330,380,3466,1921,840,10649,3002,22,113,2052,1039,357,426,631,339,430,3474,4907,324,570,106,384,67,35,908,126,0,45,40495,3236,55,1452,1540,760,23597,429,2372,581,1400,2509,425,35,5024,1847,297,680,23,2574]
[34,"New Mexico",787,320,6391,410,4536,4780,280,100,25,4707,192,168,355,790,660,384,672,159,790,57,505,303,602,284,451,1216,139,194,604,268,252,0,1111,335,41,1178,1076,932,822,0,325,509,338,11955,1382,81,1560,1251,0,321,95,429]
[35,"New York",1364,4002,4146,247,24623,3596,14595,477,3936,27392,7592,1598,607,8017,3040,955,1437,1753,1083,1345,7321,15073,5191,1059,773,3310,421,78,600,2760,42574,646,0,10544,77,4625,1327,1055,22895,3222,5952,0,1279,11231,622,2764,7939,2614,921,979,396,7321]
[36,"North Carolina",4329,1458,3493,861,13883,4790,4914,2180,1801,26365,16823,1566,334,6378,4532,775,1595,1531,919,1259,9005,3710,6161,1523,2377,2623,244,628,1627,754,11468,1138,19891,0,206,9337,1263,1333,12179,290,25532,351,9230,12638,1189,445,26759,5915,2677,2266,604,2025]
[37,"North Dakota",83,70,1571,0,999,546,65,0,70,950,98,160,540,799,55,458,161,22,18,98,232,187,757,15257,72,1490,1776,950,854,0,140,161,331,231,0,6,280,724,114,244,14,1754,746,1414,43,758,403,1604,0,543,365,0]
[38,"Ohio",3705,2207,4929,884,8995,3180,1355,1079,985,16366,8052,1198,412,9510,13534,1039,1166,13227,2214,1189,5026,2189,16336,1122,1017,3026,276,1052,907,189,4703,1361,8732,5498,453,0,858,432,14147,435,2445,47,3542,11760,197,364,3193,2862,7820,974,202,1403]
[39,"Oklahoma",1030,1279,2974,5777,8950,4717,0,380,151,5011,2581,189,905,1100,1490,1088,7065,1354,2562,167,750,1233,1347,906,1850,5210,798,300,1101,549,1523,1244,1981,1961,308,1148,0,1261,494,0,569,108,2471,25508,2588,197,1749,1574,368,1061,45,0]
[40,"Oregon",373,2513,7954,165,31862,4472,381,0,696,1660,1032,2501,5093,1676,1380,834,556,202,227,446,457,760,570,1792,186,403,2192,570,5935,39,385,920,2379,1482,42,1411,725,0,904,177,461,119,802,3347,4793,367,676,21224,593,426,765,152]
[41,"Pennsylvania",1926,1658,3529,573,7772,2574,3311,4814,2921,14631,4337,245,359,3749,1599,125,967,1233,694,988,17529,5900,2642,1169,55,1171,135,214,1600,1138,33791,1001,32898,6380,166,14319,378,234,0,771,3023,159,1273,6768,1276,1012,11960,1787,6762,1550,434,7847]
[42,"Rhode Island",20,0,93,0,2146,332,4170,0,313,2752,168,120,0,385,0,0,27,286,24,279,482,11253,230,131,0,210,0,188,25,611,1219,36,3603,478,0,63,0,139,735,0,481,0,120,823,0,53,1008,287,0,135,21,116]
[43,"South Carolina",1665,1244,2222,839,5979,1915,1590,697,435,11552,18570,638,198,2125,3802,643,1064,1924,2709,2077,3565,2313,2966,757,1407,1884,93,158,1025,917,6517,1052,10746,24764,656,4388,555,255,6497,538,0,816,3550,5351,566,298,9377,1629,1345,832,0,1070]
[44,"South Dakota",0,855,435,227,1494,1744,2,0,0,970,122,8,78,74,210,2441,403,0,0,0,60,61,892,3568,34,474,248,2175,135,0,0,175,371,240,1725,64,21,667,515,0,158,0,507,1715,388,5,340,1026,131,314,979,134]
[45,"Tennessee",12116,1281,2250,3306,8396,2473,936,176,180,15641,16012,1058,787,7094,5591,617,2630,13202,2452,1040,1743,1525,4507,1178,10568,2694,308,432,735,271,783,751,6279,5904,7,6200,2495,1080,3329,26,4300,0,0,8716,784,133,8008,1876,3248,1622,358,717]
[46,"Texas",9993,6759,18908,13781,62702,16616,2769,181,1189,31259,20362,5040,2387,19672,8264,4934,12699,6040,29348,1293,4969,4813,9501,2803,6402,12319,1813,4794,8266,761,6797,16762,20274,22660,989,8728,26284,3827,10449,1763,4470,1264,10368,0,4610,113,17734,11630,1729,4192,2472,4435]
[47,"Utah",126,2819,7966,361,15286,5350,142,0,0,2428,1142,1436,5129,1588,475,2791,398,217,345,380,613,1503,1670,385,284,1553,1057,489,5391,507,437,686,2129,842,175,1875,1338,4089,944,351,60,47,863,3605,0,39,1369,3529,0,1445,2216,239]
[48,"Vermont",16,93,127,0,1112,382,1626,0,116,966,56,6,0,230,68,30,0,1243,73,883,862,3318,284,315,0,23,147,0,17,2893,833,74,4780,328,0,214,11,26,935,341,124,39,193,493,81,0,728,98,0,151,96,0]
[49,"Virginia",2515,1906,2420,445,14780,5352,2725,2279,10964,19574,9535,3823,652,7089,2663,221,1144,3908,1638,1144,23925,3767,2982,2294,1344,1914,658,357,973,535,9073,947,15893,25575,852,5622,2810,1541,14190,1605,7936,35,6189,12944,2092,423,0,4160,3839,1258,143,516]
[50,"Washington",1507,4328,8362,1413,45597,5195,2901,100,773,9370,6363,5239,10604,4298,1089,1159,2544,1368,1646,532,1191,2911,3470,2703,615,2802,2919,682,5671,309,2300,872,5562,4088,217,3192,1223,25525,3397,97,2727,94,3206,14196,5298,223,3839,0,215,1168,394,1025]
[51,"West Virginia",477,306,79,0,1231,104,143,674,294,1919,1108,166,181,220,328,68,39,2249,90,35,5352,164,778,20,0,59,0,0,229,129,1213,81,1721,4683,175,6757,520,118,5208,0,1098,36,1061,622,0,54,6317,297,0,470,252,79]
[52,"Wisconsin",323,236,3257,253,5347,1600,657,296,15,4937,970,333,360,22285,2480,4161,1160,635,598,233,1306,489,3917,18965,238,1263,784,324,1163,3,606,526,2033,2939,284,2610,289,945,1563,144,1053,329,1051,2765,900,62,1267,1208,0,0,30,975]
[53,"Wyoming",260,590,2014,244,2035,5599,0,0,0,733,166,0,745,905,179,259,539,4,88,0,294,548,965,290,136,244,1901,1216,355,0,121,604,231,459,338,819,964,893,230,0,122,1175,4,1427,1710,0,138,1323,0,282,0,16]
[54,"Puerto Rico",8,57,54,93,519,0,370,0,0,4192,232,110,0,1021,121,0,143,37,59,0,108,2258,435,0,0,0,0,0,0,0,1922,28,2314,638,0,328,0,0,2313,624,4,0,15,360,0,0,684,0,8,989,0,0]
[55,"Grand Total",218428,168193,413738,130027,1134491,323060,174416,50298,119026,860842,504756,123128,110382,556927,289315,146650,186411,206045,191971,77148,315436,318570,351901,231892,133894,285508,67664,97632,197764,77392,440326,127870,814042,477964,47918,398732,205144,216364,476625,61620,254840,45068,327701,804734,164330,40112,477764,360924,94858,196437,64456,149000]

{"sheet":"Data_Dump_Agg","index":7,"n_rows":164,"n_cols":115,"rows_kept":164,"cut":false,"hidden":true,"merged":[]}
["Current residence in --",null,null,"Population 1 year and over",null,"Same residence 1 year ago",null,"Different residence, same state 1 year ago",null,1,2,3,4,5,6,7,8,9,10,11,12,13,14,15,16,17,18,19,20,21,22,23,24,25,26,27,28,29,30,31,32,33,34,35,36,37,38,39,40,41,42,43,44,45,46,47,48,49,50,51,52,53,1,2,3,4,5,6,7,8,9,10,11,12,13,14,15,16,17,18,19,20,21,22,23,24,25,26,27,28,29,30,31,32,33,34,35,36,37,38,39,40,41,42,43,44,45,46,47,48,49,50,51,52,53]
[null,null,null,null,null,null,null,null,null,"State of Residence Last year (Estimate)",null,null,null,null,null,null,null,null,null,null,null,null,null,null,null,null,null,null,null,null,null,null,null,null,null,null,null,null,null,null,null,null,null,null,null,null,null,null,null,null,null,null,null,null,null,null,null,null,null,null,null,null,"State of Residence Last year (Margin of Error)"]
["State","Year","Number","Estimate","MOE","Estimate","MOE","Estimate","MOE","TOTAL","Alabama","Alaska","Arizona","Arkansas","California","Colorado","Connecticut","Delaware","District of Columbia ","Florida","Georgia","Hawaii","Idaho","Illinois","Indiana","Iowa","Kansas","Kentucky","Louisiana","Maine","Maryland","Massachusetts","Michigan","Minnesota","Mississippi","Missouri","Montana","Nebraska","Nevada","New Hampshire","New Jersey","New Mexico","New York","North Carolina","North Dakota","Ohio","Oklahoma","Oregon","Pennsylvania","Rhode Island","South Carolina","South Dakota","Tennessee","Texas","Utah","Vermont","Virginia","Washington","West Virginia","Wisconsin","Wyoming","Puerto Rico","TOTAL","Alabama","Alaska","Arizona","Arkansas","California","Colorado","Connecticut","Delaware","District of Columbia ","Florida","Georgia","Hawaii","Idaho","Illinois","Indiana","Iowa","Kansas","Kentucky","Louisiana","Maine","Maryland","Massachusetts","Michigan","Minnesota","Mississippi","Missouri","Montana","Nebraska","Nevada","New Hampshire","New Jersey","New Mexico","New York","North Carolina","North Dakota","Ohio","Oklahoma","Oregon","Pennsylvania","Rhode Island","South Carolina","South Dakota","Tennessee","Texas","Utah","Vermont","Virginia","Washington","West Virginia","Wisconsin","Wyoming","Puerto Rico"]
["United States",2012,2,310212755,25814,263612596,229733,37696597,211307,7070345,109210,84068,206842,64967,566986,161530,87023,25149,59513,428325,252262,61509,55191,277953,144597,73325,93134,103004,95956,38574,157664,158156,175733,115946,66947,142754,33832,48816,98882,38696,219202,63921,405864,238663,23959,199202,102572,108182,237156,30498,127418,22534,163843,402187,82165,20056,238540,180462,47425,97724,32228,74500,58599,9027,7600,12859,6563,19755,10348,5968,3775,6154,18406,12868,6100,6257,12722,8929,6129,7286,7490,7745,5351,9686,10755,9302,8402,7206,9402,4879,4967,9332,3364,11087,5867,15692,13414,3373,10288,9213,7867,10246,3414,8502,2998,8717,15471,8304,2967,11611,9674,5262,5859,5150,8156]
["Alabama",2012,3,4764428,3589,4054260,21464,590326,19701,104600,"N/A",1004,962,660,3077,1386,284,42,162,11244,19920,627,493,2722,1347,345,865,2495,3104,67,1513,334,2298,752,4952,1555,101,151,1009,161,1702,459,2709,5133,228,1411,194,200,1837,0,2811,518,10539,7468,579,0,3170,1034,128,760,88,619,8482,"N/A",829,583,382,1037,1393,256,68,195,2476,3636,477,456,1030,536,337,760,981,1216,82,847,272,881,716,1703,836,132,167,824,166,1200,576,1188,1788,194,576,157,169,736,184,1951,758,2731,2136,713,184,1577,684,156,605,107,551]
["Alaska",2012,4,721186,1290,592551,8741,90613,7239,33415,1097,"N/A",1520,196,3494,556,0,0,356,1991,928,1376,538,58,260,13,221,161,120,66,508,297,563,192,56,819,371,1195,803,118,116,263,736,920,264,1316,335,3174,255,0,384,99,451,1488,330,79,1265,3725,0,206,136,25,4385,825,"N/A",1441,202,1643,279,143,143,459,942,894,805,387,118,235,24,272,196,145,62,591,289,426,191,76,628,334,1128,382,206,156,219,576,784,359,757,252,1510,240,143,394,123,413,760,347,108,674,1488,143,261,217,43]
["Arizona",2012,5,6468907,3874,5242674,32185,953789,28803,232457,1331,3717,"N/A",1214,44889,13790,417,246,36,5553,2263,2491,2934,10744,2930,2702,2498,1328,724,616,3007,1961,9598,8570,293,2595,1118,2293,6712,510,2564,6946,7402,2721,877,7906,1626,8587,4280,614,1070,1472,5075,14788,5916,207,2763,13247,765,3765,2786,1791,14183,1286,1505,"N/A",659,5435,6133,309,215,60,2160,961,1285,1362,2614,1447,1000,852,997,442,593,1288,1083,3471,3050,215,1099,536,1037,2202,443,1085,1907,2615,939,444,2239,838,3200,1395,687,573,776,1919,3541,1789,291,1031,2448,734,1168,1401,1662]
["Arkansas",2012,6,2912680,2753,2453347,16841,373046,14543,76948,374,855,1677,"N/A",3525,603,185,0,205,2682,1525,0,0,3576,1172,409,1033,1310,3953,17,169,254,1283,295,3689,9105,258,166,121,0,157,547,2262,3057,0,1135,9938,193,516,59,52,673,4195,11767,269,0,1159,251,84,695,1498,0,7223,293,906,954,"N/A",1202,369,264,184,232,1052,1006,184,184,1286,587,330,539,884,1340,39,209,262,607,285,2537,2916,293,201,161,184,171,482,1559,2173,184,626,2371,179,475,103,71,588,1127,2841,216,184,824,226,148,467,2098,184]
["California",2012,7,37572738,10274,31777868,67939,5046618,65422,493641,2509,6995,38916,3472,"N/A",15150,6764,474,3199,21004,10790,11906,5331,21251,5891,2284,2790,3763,5180,1256,7902,14356,8921,8539,2556,6729,3060,3302,27968,1327,12057,5921,31261,11195,1827,10653,6671,22724,10466,1648,4110,826,5802,43005,12172,544,15625,34569,1413,5681,1886,2323,19652,983,1948,5726,1354,"N/A",2598,2194,413,1061,3394,2458,2720,1519,3521,1629,987,984,1292,1525,951,2347,2682,2069,1942,993,1595,1275,2007,3857,615,2447,2240,5136,2366,1272,2869,1795,3271,2392,697,1492,674,1880,5519,2457,345,3457,4540,1135,1716,1117,1076]
["Colorado",2012,8,5123944,2939,4131357,21752,751921,19587,205060,3108,3457,10589,1043,22152,"N/A",1317,70,488,8615,5834,2536,2660,6374,4336,2776,5283,2500,5048,20,2844,5939,3343,2992,835,3771,2021,4472,3789,679,2464,6520,7250,4378,1918,4533,4582,2419,3950,137,2383,756,2535,17355,6398,503,3796,4853,837,3000,5602,1144,11855,1610,1695,2218,580,4260,"N/A",677,133,387,1907,2086,1020,1468,1617,2128,1486,1843,2135,2468,40,1196,2238,1293,909,522,1262,923,1729,1433,308,1179,1851,2604,1678,1071,2214,2102,836,1530,153,1479,553,1135,3352,2035,371,1568,1401,429,1006,2808,903]
["Connecticut",2012,9,3555319,2447,3114940,16188,334918,14546,80311,46,439,3167,200,3161,367,"N/A",22,288,6578,1702,408,97,912,53,0,0,124,909,1224,1752,8743,753,605,276,358,50,45,172,1009,5665,444,23310,3379,0,287,415,35,2214,1558,940,0,260,3279,45,709,1729,1593,174,711,104,3228,6574,103,511,3028,228,1015,341,"N/A",36,230,1844,971,476,155,583,90,193,193,159,733,696,748,1587,539,564,293,330,91,74,166,551,1490,450,3774,1609,193,254,411,58,1037,689,665,193,216,1568,69,556,707,1274,293,684,120,1540]
["Delaware",2012,10,906576,1624,782216,9177,86003,7626,34757,119,692,188,0,2221,0,1489,"N/A",11,715,179,0,32,567,62,30,113,0,178,0,5649,157,227,351,58,80,0,91,572,99,5846,85,3566,1349,0,191,0,0,6828,135,298,0,344,133,166,0,1746,29,161,0,0,56,4691,164,920,227,182,2189,182,679,"N/A",21,481,224,182,51,468,80,49,190,182,266,182,1598,131,233,390,110,138,182,116,474,127,2122,136,1751,809,182,201,182,182,1815,185,235,182,440,158,279,182,910,49,205,182,182,90]
["District of Columbia ",2012,11,624847,948,500267,6225,61992,5668,53830,79,1247,902,35,4999,677,618,78,"N/A",1705,1079,38,46,795,469,133,164,112,283,194,14120,1524,944,393,44,337,0,172,42,197,1451,116,3085,985,0,651,0,157,1494,635,150,0,577,1473,116,267,9537,481,293,721,215,0,5001,138,715,646,59,2108,546,439,127,"N/A",661,470,87,75,446,379,221,267,136,295,244,2487,717,670,240,74,354,197,182,69,183,792,139,851,503,197,429,197,182,608,596,140,197,478,826,145,250,1762,358,219,420,303,197]
["Florida",2012,12,19114620,6877,16032617,49245,2380288,44658,537148,18599,10704,6473,3321,20386,8766,8975,1099,780,"N/A",42754,3177,1268,22565,13803,3864,5661,6912,5550,7348,10442,15159,23400,5460,5490,10666,1758,945,1241,2362,27606,2853,53009,23133,239,22927,3142,2919,25659,3050,11366,1070,16275,28564,2499,2747,25697,4943,3533,6216,773,21638,19784,4762,4327,1865,1136,4221,2537,1882,608,481,"N/A",6205,2730,923,3828,2852,1332,3133,1607,2266,3032,2378,2747,3519,2185,3345,3498,2104,713,515,922,4242,1004,5886,3843,203,4305,1301,1736,4174,1458,2719,762,3583,4750,1348,1190,3965,1710,1587,1993,567,4641]
["Georgia",2012,13,9796547,5863,8231384,34188,1236302,31155,277466,13864,2654,6657,1041,14174,4710,1829,226,1352,42870,"N/A",1409,936,7143,5972,1687,1497,6172,4100,222,3619,4153,9949,2237,3280,3377,251,1283,3783,15,4920,915,13957,16009,207,7501,3299,453,9076,440,18611,257,17606,16198,20,84,10702,1965,1237,3441,106,1730,14075,2903,1444,2675,519,3182,2093,824,246,994,5472,"N/A",831,797,1833,2678,1036,707,1972,1490,178,1621,1720,3100,2164,1372,1479,224,1001,2622,27,1544,512,3960,2963,250,2501,1818,472,2622,620,3871,291,4620,3367,35,142,2094,826,625,1725,154,1190]
["Hawaii",2012,14,1374852,1662,1164145,10466,134827,9196,55145,608,1417,1865,24,9756,1216,191,278,230,2780,1448,"N/A",404,318,292,84,1135,485,207,91,2491,1266,321,192,44,944,131,75,760,85,410,284,2382,2241,0,884,1095,1763,1087,106,644,459,1314,3300,2183,0,1393,5920,197,295,50,336,5749,479,869,695,54,1508,574,222,253,253,1227,639,"N/A",431,194,261,98,709,630,183,147,1610,962,189,240,52,630,172,125,424,119,435,243,1279,1274,177,995,933,764,770,176,460,726,675,1887,1283,177,755,1901,330,234,66,436]
["Idaho",2012,15,1573036,2184,1296975,12998,210151,11483,59283,575,1198,2424,291,10280,1186,44,120,116,2014,583,206,"N/A",532,283,90,63,83,54,0,107,338,683,637,87,214,3800,35,2535,0,214,675,938,817,0,1018,93,4963,169,0,205,118,1957,1352,6617,0,269,10398,0,225,677,136,6040,838,790,1307,268,2708,614,81,199,124,1608,848,194,"N/A",469,282,170,69,128,92,187,161,391,777,528,170,259,2162,60,1031,187,206,554,554,843,187,753,108,1377,181,187,238,192,1539,714,3016,187,388,1919,187,272,406,228]
["Illinois",2012,16,12725119,5939,11009321,31714,1441191,27618,208755,883,2250,7139,1587,14940,3036,955,234,1066,12687,8745,869,1384,"N/A",16907,8529,2009,2923,1229,526,1865,3296,12583,6537,2744,13264,228,1302,1478,283,2366,1359,7561,3761,196,6872,1491,954,4588,462,1583,394,4648,16780,1154,156,4311,2704,1221,14414,302,2049,10844,478,1511,2314,643,2770,1235,634,228,615,2735,3894,593,868,"N/A",2654,1959,988,1049,561,347,755,1088,3412,1781,1178,3449,183,637,817,255,1097,1078,2307,1150,184,1834,860,517,1506,478,875,444,1468,3035,495,133,1212,971,1224,2249,309,1480]
["Indiana",2012,17,6457067,4184,5493090,26865,805228,22224,134137,1625,479,2763,564,6033,1225,823,639,1045,11472,2258,856,186,28436,"N/A",1678,1624,11177,736,0,1050,837,11017,1543,1948,4526,134,591,1011,0,1537,219,2316,2665,113,11235,1198,387,2419,0,1414,111,3547,4490,105,0,1932,258,507,1727,1681,136,9664,788,429,1095,753,1477,531,595,831,733,2864,1176,998,176,4261,"N/A",860,785,2929,416,184,648,590,2594,732,1655,1802,191,541,549,184,1034,245,724,884,164,2192,725,239,1101,184,901,147,1422,1562,124,184,1101,221,345,769,2023,194]
["Iowa",2012,18,3035469,2721,2585979,14093,362938,11238,75760,503,951,1590,451,3268,3252,112,0,151,4335,596,521,290,11969,1716,"N/A",918,819,763,78,419,585,946,7505,751,4168,452,7698,681,56,1018,114,1230,734,833,1127,1465,348,451,0,943,1158,1148,3553,886,0,268,919,22,3607,392,786,5982,400,814,803,237,1296,1250,135,151,155,2060,481,476,218,2313,1097,"N/A",500,609,568,125,287,520,497,1826,621,1021,305,1806,602,93,767,188,819,428,617,692,974,302,353,151,556,441,871,1275,880,151,200,485,41,849,316,1190]
["Kansas",2012,19,2848708,2507,2361899,16878,381695,15902,88284,853,333,3094,2158,5411,3746,210,0,456,3118,1896,149,456,1702,1679,1527,"N/A",617,438,211,282,187,1125,682,452,21022,300,4126,851,0,267,1029,571,813,261,1310,8408,848,918,18,556,154,1542,8468,97,70,1705,3265,139,486,278,82,7145,609,407,1630,890,2012,1360,208,165,737,1380,1395,156,356,582,839,860,"N/A",476,408,225,282,203,682,367,501,3073,326,1245,606,165,228,627,367,476,263,638,2299,557,672,31,375,195,825,2434,106,138,853,1675,132,530,239,147]
["Kentucky",2012,20,4328626,2851,3676472,15304,521511,14825,112787,4137,304,1103,518,3415,712,246,706,254,9232,4173,647,50,4445,12203,238,602,"N/A",666,46,1120,419,7302,605,646,2381,0,723,301,84,496,554,5239,3643,122,17041,577,298,2226,0,1347,0,10064,3345,464,45,3319,1988,3346,1395,0,170,7854,1628,370,715,299,1157,572,290,774,262,2697,1184,665,91,1359,2150,257,464,"N/A",294,80,615,285,1809,346,467,1021,181,588,294,103,551,348,1774,1903,192,3384,437,212,964,181,671,181,2378,1420,360,81,1111,998,1472,845,181,197]
["Louisiana",2012,21,4545914,4612,3912023,21791,528406,20131,91215,2329,403,2021,3645,5139,1433,164,0,596,6534,4478,378,265,1229,1359,544,420,1649,"N/A",251,642,549,1080,330,6791,1591,428,745,931,11,975,150,2786,2284,64,1115,2159,195,1239,737,1914,0,2348,24488,277,45,1857,1581,238,682,146,655,6941,1114,467,1191,2324,1438,1002,149,193,517,2276,1559,283,242,466,954,447,392,1224,"N/A",334,701,354,782,324,1938,684,524,538,682,21,575,188,1105,1152,113,773,1365,232,616,695,1377,193,1546,4076,288,72,1033,631,271,474,216,507]
["Maine",2012,22,1315586,1384,1132344,9895,151438,9223,27523,129,38,230,0,1610,314,1468,234,32,2926,511,0,143,195,0,7,277,482,15,"N/A",325,3887,116,430,79,69,0,82,35,3655,405,272,2519,1112,0,628,79,215,976,1024,173,0,985,496,200,349,573,118,51,0,59,38,3132,172,48,170,155,860,287,620,299,55,1292,538,155,128,277,155,16,401,521,30,"N/A",263,1167,123,359,134,112,155,136,56,1077,281,320,1180,574,155,368,115,255,600,656,143,155,1062,381,183,340,408,137,85,155,81,69]
["Maryland",2012,23,5816472,3717,5068457,21604,549973,20595,154983,1261,1947,760,136,8614,1071,881,4100,21213,9610,4610,610,429,3621,1210,569,1726,715,606,332,"N/A",3977,2167,1422,581,256,0,132,330,1124,6260,638,11736,7507,116,2522,463,378,15485,82,2297,0,1800,5612,1061,589,20579,1431,1957,460,0,294,8958,713,1123,359,159,2155,609,516,1303,3437,2515,2430,474,444,1647,709,389,1123,602,441,261,"N/A",1805,973,707,706,199,190,152,258,820,2244,453,2585,2284,94,1035,447,426,2922,95,1139,190,986,1271,831,598,2668,884,799,371,190,249]
["Massachusetts",2012,24,6580641,3587,5752166,19793,626380,17354,142577,636,890,1972,394,12770,980,10525,506,379,12890,2789,1108,188,2886,677,151,565,52,1556,3907,2381,"N/A",1337,966,155,453,49,182,787,13331,8046,521,19467,2514,81,1829,297,1528,8236,6863,2477,194,823,3694,1027,2534,4098,1653,385,584,264,4056,7863,622,600,979,340,2994,438,2062,505,219,2568,1129,564,164,1041,497,251,429,87,742,1349,895,"N/A",680,367,186,218,81,189,544,2144,1874,364,2432,1003,133,772,206,1359,1924,1317,1120,326,342,1078,666,913,1470,696,569,445,404,1883]
["Michigan",2012,25,9778980,4263,8330990,24803,1268105,23226,133981,2341,1152,7168,906,8085,2363,798,114,274,13146,4270,291,242,10047,10976,993,805,3409,1284,261,2201,1720,"N/A",1127,922,2206,218,113,1354,446,1617,1318,5731,3912,265,11318,705,811,2739,68,1822,66,3259,8638,819,60,3057,2146,353,4768,1277,782,8566,1013,685,3100,559,1721,967,506,164,282,3306,1652,238,371,1702,2324,495,608,1388,662,218,1094,764,"N/A",512,671,695,171,137,715,342,721,685,1680,1056,202,2251,307,440,686,114,797,77,997,2574,534,120,855,839,279,1111,862,797]
["Minnesota",2012,26,5315228,2787,4536303,18312,653012,17074,101042,1299,523,3065,375,8086,3565,696,0,310,2372,2235,1277,575,5896,2026,7220,924,57,791,187,1841,814,2212,"N/A",202,1709,1257,992,932,0,1038,322,1849,1745,6672,2635,1212,781,1106,299,1705,3442,1738,4001,429,77,1037,1685,0,17618,213,134,6534,919,312,861,222,2263,1095,360,139,353,752,1482,1179,531,1405,1057,1774,513,103,858,136,2080,434,822,"N/A",323,750,900,477,542,139,546,224,732,956,1485,1248,894,513,570,226,1448,990,1141,1244,312,126,434,678,139,2358,213,136]
["Mississippi",2012,27,2947696,2744,2529377,17940,339807,16126,73500,5141,0,710,2680,4371,799,106,0,97,4676,2669,184,586,2703,1200,160,400,446,8588,163,379,67,1768,568,"N/A",2634,166,138,526,60,2127,86,1492,1709,98,896,562,465,613,185,596,79,11643,7230,454,0,1929,433,0,611,307,81,7080,1870,198,509,1447,1070,426,147,198,164,1396,865,191,597,933,621,275,339,276,2293,167,262,113,1071,385,"N/A",1581,168,159,342,117,1495,102,660,609,118,703,352,768,434,229,469,129,2856,2491,724,198,1285,309,198,521,287,108]
["Missouri",2012,28,5951913,3866,4965459,21306,801093,19635,162930,1333,2186,2297,9434,10717,3798,410,234,144,8374,3451,2114,596,22001,4184,5956,20218,2291,1178,996,1246,810,2964,2798,1110,"N/A",511,1999,836,35,960,451,2834,3988,636,3557,5298,1186,1535,361,2856,527,3122,9278,3287,318,2609,2312,148,2636,810,826,8034,768,1289,741,2224,2409,1371,331,314,172,1990,1391,1271,478,2893,1267,1324,3673,1067,651,1247,717,486,1169,1265,532,"N/A",506,833,366,58,536,309,918,1420,462,1317,2199,899,639,582,1625,542,1350,2841,1733,413,1081,1093,181,999,452,958]
["Montana",2012,29,995544,947,829489,8669,126463,7466,37690,31,726,1548,63,5428,2135,0,0,0,1875,292,556,3385,542,163,415,224,367,0,225,33,97,822,481,32,447,"N/A",108,968,115,156,259,482,1082,977,402,1018,2950,457,0,230,191,45,1393,260,87,156,4783,0,750,934,0,4305,55,442,938,102,2229,896,157,157,157,1029,270,572,1349,371,164,384,268,352,157,269,65,109,760,297,58,385,"N/A",149,499,177,198,178,371,808,604,332,948,1687,362,157,304,142,40,612,261,135,153,1555,157,425,387,157]
["Nebraska",2012,30,1829420,2101,1540361,9074,237937,9736,43266,245,626,2406,363,3438,2023,0,0,0,1368,786,165,315,1193,290,6815,3103,131,411,68,129,195,258,1489,176,2223,108,"N/A",233,0,524,158,318,874,497,563,587,106,702,0,456,2507,232,3130,229,79,1076,1327,111,316,917,0,4512,275,531,1120,317,1425,791,149,149,149,978,482,149,374,546,214,2803,822,133,371,90,126,112,197,1049,132,836,156,"N/A",178,149,363,187,246,414,492,373,408,113,528,149,381,677,184,1218,230,131,758,673,152,218,371,149]
["Nevada",2012,31,2725280,3005,2105070,21984,481496,19389,124285,761,2161,8748,353,49978,6402,143,373,468,3381,745,2053,1503,2822,362,714,1202,952,421,209,934,318,1235,1157,783,694,1086,714,"N/A",175,912,1138,3521,767,702,1407,1520,3101,1601,336,480,0,1699,5484,4605,121,1135,2997,100,1046,766,237,9956,724,1047,2540,404,7637,2736,181,521,759,1488,477,949,743,1412,341,592,1085,651,296,286,689,267,574,718,658,516,605,551,"N/A",230,600,665,1460,589,661,791,1384,1186,1078,548,403,200,822,1772,1899,222,832,1103,161,666,706,356]
["New Hampshire",2012,32,1309203,1504,1127376,9730,125118,9101,50484,0,437,440,0,1514,572,1345,0,101,2746,470,43,20,673,297,53,102,284,7,6118,33,18990,426,0,0,289,0,110,0,"N/A",591,223,2905,1609,0,324,186,208,890,1248,323,0,77,2150,557,2960,660,113,80,239,71,75,5282,181,378,413,181,935,637,478,181,131,1312,324,78,38,608,365,89,161,250,13,1749,57,3350,441,181,181,262,181,136,181,"N/A",330,279,1027,1456,181,240,266,299,561,819,257,181,133,1715,762,1339,433,119,131,277,120,123]
["New Jersey",2012,33,8772744,4541,7929570,23298,655465,21808,130223,779,359,1328,57,4330,380,3466,1921,840,10649,3002,22,113,2052,1039,357,426,631,339,430,3474,4907,324,570,106,384,67,35,908,126,"N/A",45,40495,3236,55,1452,1540,760,23597,429,2372,581,1400,2509,425,35,5024,1847,297,680,23,2574,7649,509,437,704,70,1070,264,1711,1383,637,2430,1032,41,134,874,559,405,405,614,343,388,1241,1730,191,429,165,363,112,58,526,219,"N/A",75,4293,1238,93,596,1537,587,2976,410,1386,644,612,1335,341,57,1899,1244,201,457,30,1462]
["New Mexico",2012,34,2060595,2119,1769341,11461,226243,12069,54693,787,320,6391,410,4536,4780,280,100,25,4707,192,168,355,790,660,384,672,159,790,57,505,303,602,284,451,1216,139,194,604,268,252,"N/A",1111,335,41,1178,1076,932,822,0,325,509,338,11955,1382,81,1560,1251,0,321,95,429,5877,509,264,1673,286,1440,1546,250,136,51,2184,184,127,352,530,524,331,537,160,883,80,355,298,490,428,630,793,162,220,853,259,271,"N/A",618,373,82,1049,568,481,666,185,260,547,274,2917,889,103,1330,575,185,514,100,466]
["New York",2012,35,19352153,6112,17202134,34343,1723117,30910,270053,1364,4002,4146,247,24623,3596,14595,477,3936,27392,7592,1598,607,8017,3040,955,1437,1753,1083,1345,7321,15073,5191,1059,773,3310,421,78,600,2760,42574,646,"N/A",10544,77,4625,1327,1055,22895,3222,5952,0,1279,11231,622,2764,7939,2614,921,979,396,7321,11861,864,2016,2468,203,2557,976,2921,284,1392,3450,1925,734,472,2204,1128,658,906,808,465,536,1575,2292,1445,631,800,1260,424,108,382,1059,4802,445,"N/A",2568,129,1103,652,716,3206,1538,1542,185,624,2384,489,1025,2109,840,689,507,370,1791]
["North Carolina",2012,36,9640490,5097,8167830,27074,1149080,24801,273149,4329,1458,3493,861,13883,4790,4914,2180,1801,26365,16823,1566,334,6378,4532,775,1595,1531,919,1259,9005,3710,6161,1523,2377,2623,244,628,1627,754,11468,1138,19891,"N/A",206,9337,1263,1333,12179,290,25532,351,9230,12638,1189,445,26759,5915,2677,2266,604,2025,13136,1544,925,1189,649,2813,2047,1990,1732,687,3750,2851,921,256,2177,2259,524,748,794,758,972,2221,1158,2547,838,1092,1742,306,628,807,525,4262,705,3951,"N/A",232,2484,753,772,2356,198,4732,186,2122,2381,1040,291,4229,2630,985,980,687,1218]
["North Dakota",2012,37,689838,1379,563978,6361,84294,5380,38213,83,70,1571,0,999,546,65,0,70,950,98,160,540,799,55,458,161,22,18,98,232,187,757,15257,72,1490,1776,950,854,0,140,161,331,231,"N/A",6,280,724,114,244,14,1754,746,1414,43,758,403,1604,0,543,365,0,3616,142,105,788,141,460,293,100,141,112,860,154,148,521,523,77,316,122,44,27,176,311,281,571,2266,109,1346,709,764,572,141,231,228,331,243,"N/A",14,260,529,157,255,28,822,694,756,60,1014,309,796,141,327,269,141]
["Ohio",2012,38,11414635,5725,9735390,29715,1440815,28423,196391,3705,2207,4929,884,8995,3180,1355,1079,985,16366,8052,1198,412,9510,13534,1039,1166,13227,2214,1189,5026,2189,16336,1122,1017,3026,276,1052,907,189,4703,1361,8732,5498,453,"N/A",858,432,14147,435,2445,47,3542,11760,197,364,3193,2862,7820,974,202,1403,9611,2297,1757,1912,604,1803,1230,887,696,722,2560,2973,591,295,2157,2157,765,617,2976,1011,889,2570,808,2656,597,865,1068,292,656,525,156,2119,817,1741,1525,346,"N/A",417,307,2612,384,1029,76,1429,2739,211,350,1055,2150,2219,725,210,910]
["Oklahoma",2012,39,3762311,2764,3107367,14635,531347,12812,108972,1030,1279,2974,5777,8950,4717,0,380,151,5011,2581,189,905,1100,1490,1088,7065,1354,2562,167,750,1233,1347,906,1850,5210,798,300,1101,549,1523,1244,1981,1961,308,1148,"N/A",1261,494,0,569,108,2471,25508,2588,197,1749,1574,368,1061,45,0,6570,467,600,1435,1187,2184,1556,149,288,148,1525,935,295,600,487,936,689,1535,898,1354,260,685,906,671,469,752,1349,710,208,799,383,748,712,936,912,340,533,"N/A",771,285,149,346,154,1035,2960,1465,316,829,575,298,758,68,149]
["Oregon",2012,40,3857465,2984,3158450,19251,560673,17729,118925,373,2513,7954,165,31862,4472,381,0,696,1660,1032,2501,5093,1676,1380,834,556,202,227,446,457,760,570,1792,186,403,2192,570,5935,39,385,920,2379,1482,42,1411,725,"N/A",904,177,461,119,802,3347,4793,367,676,21224,593,426,765,152,7769,425,953,2060,158,3767,2133,457,193,919,620,523,813,1880,1192,1000,781,534,261,229,353,422,604,338,799,237,269,968,448,2774,65,327,676,1032,1046,85,789,546,"N/A",535,214,364,143,583,1277,2328,435,510,3153,502,284,664,177]
["Pennsylvania",2012,41,12630082,4558,11107110,28998,1252378,26347,215500,1926,1658,3529,573,7772,2574,3311,4814,2921,14631,4337,245,359,3749,1599,125,967,1233,694,988,17529,5900,2642,1169,55,1171,135,214,1600,1138,33791,1001,32898,6380,166,14319,378,234,"N/A",771,3023,159,1273,6768,1276,1012,11960,1787,6762,1550,434,7847,8872,1318,857,1256,315,1558,1488,905,1468,830,2565,1703,180,350,1137,680,177,860,604,431,675,3084,1368,1235,588,49,575,169,187,999,609,4576,740,4482,1734,195,2479,253,220,"N/A",472,869,206,533,1688,804,873,2213,1202,2075,722,439,2646]
["Rhode Island",2012,42,1040527,1533,899551,9890,101165,8498,33446,20,0,93,0,2146,332,4170,0,313,2752,168,120,0,385,0,0,27,286,24,279,482,11253,230,131,0,210,0,188,25,611,1219,36,3603,478,0,63,0,139,735,"N/A",481,0,120,823,0,53,1008,287,0,135,21,116,3551,44,200,151,200,811,315,1101,200,381,1143,211,145,200,382,200,200,47,405,45,249,325,1937,169,131,200,158,200,250,48,385,641,58,1335,508,200,80,200,235,552,"N/A",609,200,199,433,200,76,569,320,200,124,32,186]
["South Carolina",2012,43,4668886,3434,3929626,20572,564350,20053,156705,1665,1244,2222,839,5979,1915,1590,697,435,11552,18570,638,198,2125,3802,643,1064,1924,2709,2077,3565,2313,2966,757,1407,1884,93,158,1025,917,6517,1052,10746,24764,656,4388,555,255,6497,538,"N/A",816,3550,5351,566,298,9377,1629,1345,832,0,1070,9611,635,1016,1160,526,1473,1059,729,492,352,2367,3616,493,321,1128,1911,437,855,991,2265,942,1205,826,1289,582,802,724,127,165,834,696,2181,1085,3642,3907,650,1326,354,202,2067,332,"N/A",1252,1136,1482,425,244,3040,1165,720,570,197,890]
["South Dakota",2012,44,821669,1036,676014,7752,115606,7423,26051,0,855,435,227,1494,1744,2,0,0,970,122,8,78,74,210,2441,403,0,0,0,60,61,892,3568,34,474,248,2175,135,0,0,175,371,240,1725,64,21,667,515,0,158,"N/A",507,1715,388,5,340,1026,131,314,979,134,2891,147,1127,333,354,663,839,4,147,147,638,130,13,104,102,289,932,295,147,147,147,65,101,747,1023,48,274,208,801,171,147,147,187,317,220,823,77,36,583,633,147,159,"N/A",346,1067,372,9,300,681,216,413,735,235]
["Tennessee",2012,45,6378278,4412,5396833,24470,783077,21860,177098,12116,1281,2250,3306,8396,2473,936,176,180,15641,16012,1058,787,7094,5591,617,2630,13202,2452,1040,1743,1525,4507,1178,10568,2694,308,432,735,271,783,751,6279,5904,7,6200,2495,1080,3329,26,4300,0,"N/A",8716,784,133,8008,1876,3248,1622,358,717,10625,3309,847,907,1731,2447,1156,900,222,203,3639,3114,1052,817,1891,2209,556,1972,2695,1206,589,867,706,1434,896,2321,1254,278,389,443,287,507,640,2008,1834,16,1742,1410,589,999,55,1280,193,"N/A",2938,1131,133,2159,852,1760,727,382,499]
["Texas",2012,46,25711791,10124,21354247,60947,3656070,53747,507752,9993,6759,18908,13781,62702,16616,2769,181,1189,31259,20362,5040,2387,19672,8264,4934,12699,6040,29348,1293,4969,4813,9501,2803,6402,12319,1813,4794,8266,761,6797,16762,20274,22660,989,8728,26284,3827,10449,1763,4470,1264,10368,"N/A",4610,113,17734,11630,1729,4192,2472,4435,20202,3132,2614,3870,3771,8792,3638,1124,168,610,6252,3365,2386,1190,3645,2734,2063,3202,2224,5712,1284,2026,1584,2273,948,2032,2205,986,2045,4162,749,2141,3127,4211,6953,542,1739,4418,1684,2158,1605,1665,757,2623,"N/A",2045,135,4904,2741,938,1322,1676,1611]
["Utah",2012,47,2805440,2571,2324019,16852,373980,16586,87870,126,2819,7966,361,15286,5350,142,0,0,2428,1142,1436,5129,1588,475,2791,398,217,345,380,613,1503,1670,385,284,1553,1057,489,5391,507,437,686,2129,842,175,1875,1338,4089,944,351,60,47,863,3605,"N/A",39,1369,3529,0,1445,2216,239,7490,171,1292,2419,402,2837,1845,168,181,181,1105,622,876,1135,802,296,2779,333,221,313,339,361,1343,1210,300,229,769,729,384,1743,442,322,505,924,611,218,881,691,2693,450,571,100,74,529,1278,"N/A",63,668,1319,181,1512,715,190]
["Vermont",2012,48,620224,821,532237,5326,61242,5294,24431,16,93,127,0,1112,382,1626,0,116,966,56,6,0,230,68,30,0,1243,73,883,862,3318,284,315,0,23,147,0,17,2893,833,74,4780,328,0,214,11,26,935,341,124,39,193,493,81,"N/A",728,98,0,151,96,0,2713,23,153,165,143,537,296,540,143,134,519,81,10,143,221,81,43,143,1690,105,546,396,657,246,349,143,26,189,143,37,812,364,89,921,248,143,247,13,38,525,220,208,66,185,334,96,"N/A",427,109,143,115,102,143]
["Virginia",2012,49,8085389,4754,6857430,25550,915242,24032,250653,2515,1906,2420,445,14780,5352,2725,2279,10964,19574,9535,3823,652,7089,2663,221,1144,3908,1638,1144,23925,3767,2982,2294,1344,1914,658,357,973,535,9073,947,15893,25575,852,5622,2810,1541,14190,1605,7936,35,6189,12944,2092,423,"N/A",4160,3839,1258,143,516,11997,990,1287,1030,319,2760,1834,1001,1465,4084,3694,1889,1460,411,3237,1228,209,669,1422,936,689,4264,1503,1136,1414,730,837,433,313,522,398,2029,637,3260,4182,1019,1519,1873,1069,2998,731,2435,57,1858,2828,994,437,"N/A",1420,1234,880,166,466]
["Washington",2012,50,6815763,3864,5648199,25225,904695,24285,215494,1507,4328,8362,1413,45597,5195,2901,100,773,9370,6363,5239,10604,4298,1089,1159,2544,1368,1646,532,1191,2911,3470,2703,615,2802,2919,682,5671,309,2300,872,5562,4088,217,3192,1223,25525,3397,97,2727,94,3206,14196,5298,223,3839,"N/A",215,1168,394,1025,12552,730,1682,2641,1121,5884,2150,1138,164,528,2417,2288,2393,2191,1727,521,845,1029,911,915,655,923,1011,1605,1971,444,1017,1013,456,2919,248,1441,527,1947,1854,200,1400,768,4052,1799,162,1542,155,1819,3417,1995,216,1320,"N/A",271,638,495,878]
["West Virginia",2012,51,1837518,2090,1613322,11785,174112,11396,47125,477,306,79,0,1231,104,143,674,294,1919,1108,166,181,220,328,68,39,2249,90,35,5352,164,778,20,0,59,0,0,229,129,1213,81,1721,4683,175,6757,520,118,5208,0,1098,36,1061,622,0,54,6317,297,"N/A",470,252,79,4317,339,455,129,182,516,114,177,525,194,666,483,277,250,190,406,111,64,1019,88,74,1897,191,581,37,182,76,182,182,268,147,679,90,965,1933,215,1474,447,207,1699,182,671,65,513,415,182,89,1774,285,"N/A",555,395,123]
["Wisconsin",2012,52,5660677,3351,4849945,15530,693737,15440,99192,323,236,3257,253,5347,1600,657,296,15,4937,970,333,360,22285,2480,4161,1160,635,598,233,1306,489,3917,18965,238,1263,784,324,1163,3,606,526,2033,2939,284,2610,289,945,1563,144,1053,329,1051,2765,900,62,1267,1208,0,"N/A",30,975,6959,262,193,1696,216,2126,604,432,475,25,1590,396,416,231,3020,1136,1283,1199,502,403,195,586,356,1160,2405,211,681,512,240,682,7,477,553,980,1454,318,1053,204,601,750,157,675,220,638,1112,1091,88,916,416,145,"N/A",46,943]
["Wyoming",2012,53,569734,1083,459226,7512,77324,6960,31149,260,590,2014,244,2035,5599,0,0,0,733,166,0,745,905,179,259,539,4,88,0,294,548,965,290,136,244,1901,1216,355,0,121,604,231,459,338,819,964,893,230,0,122,1175,4,1427,1710,0,138,1323,0,282,"N/A",16,3430,284,661,1234,405,720,1618,185,185,185,572,173,185,481,823,179,273,412,10,100,185,304,638,730,240,229,257,789,559,304,185,147,658,252,399,300,447,670,605,254,185,201,730,7,920,948,185,169,785,185,210,"N/A",27]
["Puerto Rico",2012,54,3628402,2934,3366593,12125,238042,11523,20044,8,57,54,93,519,0,370,0,0,4192,232,110,0,1021,121,0,143,37,59,0,108,2258,435,0,0,0,0,0,0,0,1922,28,2314,638,0,328,0,0,2313,624,4,0,15,360,0,0,684,0,8,989,0,"N/A",2902,15,94,90,158,484,214,365,214,214,1203,300,172,214,602,153,214,240,72,101,214,177,1289,451,214,214,214,214,214,214,214,1129,48,761,565,214,499,214,214,1063,688,7,214,31,291,214,214,777,214,15,654,214,"N/A"]
["United States",2011,null,307900319,29996,261087925,263315,37998701,233440,6987416,106806,88850,211816,77226,562343,160623,91295,26631,49732,437202,248892,61940,57831,269008,143228,74516,94180,99256,86593,33729,165041,145869,186505,103253,68597,138404,31204,52809,115943,43277,216369,61431,377800,225147,26563,206049,81009,109795,215127,31065,121426,29383,154243,404839,73211,18172,229227,190644,45956,105370,31991,76218]
["Alabama",2011,null,4745278,4078,4024442,22751,588293,20366,117726,"N/A",1771,1677,1642,3389,348,2921,232,399,20063,19346,1259,137,6991,1434,30,842,2686,2413,626,1606,112,2797,327,3945,1086,317,770,257,64,1996,119,1108,2697,284,2596,973,169,1075,0,2036,90,8710,7973,300,66,4935,2621,65,417,9,569]
["Alaska",2011,null,711962,1401,571857,8892,100280,8388,35084,93,"N/A",2467,190,3098,1583,138,11,140,1188,556,1366,475,985,181,319,750,237,1077,0,216,141,771,593,554,921,248,5,532,520,128,226,940,470,0,319,616,2161,378,0,186,301,388,2492,662,68,1488,4548,89,23,246,1044]
["Arizona",2011,null,6402301,5660,5107496,39045,1028366,36556,222877,833,5001,"N/A",1066,49635,10189,1875,0,389,3732,2206,2199,2190,10035,5855,4526,1708,2134,844,0,1918,743,9396,3297,1226,3872,2431,1393,8756,228,3379,4610,3880,2548,1159,4682,3219,4613,3436,72,1774,1657,1680,12688,10577,0,2233,13940,70,6473,2510,871]
["Arkansas",2011,null,2906632,2928,2421746,18606,405831,18050,69845,691,560,439,"N/A",4077,746,519,79,0,3067,1446,13,179,3684,1362,851,2008,213,2120,30,133,781,1881,232,1731,7314,713,332,641,52,341,775,674,1664,214,174,3761,632,567,0,235,0,6462,14767,0,0,1245,1477,24,687,252,529]
["California",2011,null,37222678,9999,31213310,71183,5271168,68394,468428,2087,7358,35650,2648,"N/A",21245,3073,1302,3240,22094,13303,9864,4796,20834,4673,3324,2810,1201,3600,1658,7793,10244,12069,5687,2092,7677,2599,1955,36159,1222,8053,5904,25629,8708,1392,10474,5113,18165,8550,1103,5758,1004,8761,37087,8944,745,15753,36481,832,5668,2047,1344]
["Colorado",2011,null,5048443,4037,4048042,22888,763233,18937,202124,2340,3191,12338,1615,23234,"N/A",1567,501,298,8075,3250,1852,1578,6027,2116,3510,3718,1361,908,1358,3303,2157,3225,3055,879,4552,4079,4582,4061,489,2863,8797,3998,4756,2249,5527,3824,5543,3348,435,718,1340,3193,22390,3856,914,6281,5524,412,3995,2942,476]
["Connecticut",2011,null,3548667,2644,3139496,16755,316883,15392,71502,101,180,1387,84,3699,1502,"N/A",62,607,4771,2000,587,133,1843,168,67,16,0,315,259,1267,8691,692,76,69,365,206,62,160,1221,3809,265,20015,1029,0,1383,217,117,3668,1488,997,0,123,1214,398,608,2555,2255,46,660,65,2105]
["Delaware",2011,null,897187,1369,775414,8584,83156,6851,33912,81,329,541,0,699,169,66,"N/A",154,810,639,201,441,34,210,0,7,305,0,0,4238,806,43,201,0,713,0,12,0,0,6297,0,3141,388,0,664,27,0,8571,131,153,0,221,883,475,0,1064,482,198,55,463,1008]
["District of Columbia ",2011,null,611608,1403,489659,6701,66519,6073,48066,13,135,43,81,3797,452,981,128,"N/A",1254,937,372,68,1397,128,241,6,297,0,0,14129,2048,1108,409,83,112,38,79,238,145,1035,0,2313,1716,285,306,0,51,1589,50,357,104,421,1083,75,445,7975,476,120,946,0,0]
["Florida",2011,null,18863948,8536,15742168,59355,2454255,53419,498597,12635,7405,8451,3025,22420,9383,11704,1264,891,"N/A",38658,3639,312,19152,11472,1846,2661,5441,6094,4689,15410,13701,19640,4663,5175,7114,559,3857,3527,4324,25206,1376,59288,23983,514,18191,2600,3315,20821,5002,11953,716,10451,25532,2343,2019,16614,6339,4964,7412,846,21611]
["Georgia",2011,null,9699859,5580,8095407,40769,1289450,37444,271077,18799,1079,4292,2112,14949,2325,709,619,364,42666,"N/A",1006,126,6080,2442,950,4513,3686,6541,408,3708,4436,6992,1808,5380,2514,246,4144,774,132,8371,791,14454,19138,201,6863,1632,727,5791,337,16914,536,16898,15760,793,361,9438,3701,1340,2727,504,1635]
["Hawaii",2011,null,1357806,1803,1160948,10743,122727,8676,57542,1268,844,2900,242,10173,950,731,784,222,3160,2519,"N/A",112,1884,402,478,125,18,179,106,341,92,1303,933,371,308,85,91,1548,107,564,354,4246,2307,32,970,685,2030,870,58,1681,0,636,3007,1040,0,2523,3790,312,147,14,238]
["Idaho",2011,null,1559637,2674,1284530,13188,208434,13285,60336,263,4510,3543,224,9021,1813,0,0,0,1733,275,254,"N/A",390,296,318,479,120,51,0,0,396,615,566,62,384,1602,439,3581,129,84,141,419,263,1201,260,288,7170,343,0,55,842,296,1303,6059,0,905,8991,0,165,487,249]
["Illinois",2011,null,12718402,5792,11076528,31383,1353853,28856,216204,2823,4119,7657,3185,13930,3271,1819,277,1440,17548,6042,1269,393,"N/A",23491,8420,2533,5569,1315,693,2565,3507,10274,4496,1521,13889,304,827,2454,590,3009,1573,6412,4057,105,8384,1002,792,3012,278,1582,1318,3223,11011,951,49,5233,3075,352,14507,58,2387]
["Indiana",2011,null,6437155,3841,5478683,24180,809158,21392,127874,1562,371,3975,2016,7649,1930,1227,79,0,8595,2543,1057,1368,23071,"N/A",916,1321,10177,2241,275,480,952,7896,1168,469,1824,34,622,511,90,651,504,2518,3038,70,11109,844,505,3998,49,3306,235,3879,6326,123,530,1486,1028,216,2923,117,132]
["Iowa",2011,null,3027718,2514,2573313,16682,370554,15638,70405,207,967,1411,433,3297,2891,424,0,0,707,1938,299,161,13725,349,"N/A",1776,387,228,26,487,466,1687,5634,408,3649,370,6490,2009,0,185,421,2361,1760,604,993,532,811,388,65,172,2842,623,2334,1482,38,720,856,115,2537,140,57]
["Kansas",2011,null,2833584,2851,2372033,15236,362782,14847,83640,434,108,2028,998,4743,5030,412,74,128,1581,1146,287,264,2760,863,1715,"N/A",1167,519,481,3180,28,1947,679,1517,22033,270,1648,657,27,1189,769,780,1223,379,1616,5022,285,1494,180,1102,104,1066,6575,196,0,1986,772,0,893,1285,775]
["Kentucky",2011,null,4316297,3382,3686232,19523,505741,18525,110031,925,0,1818,1058,2130,221,176,0,201,7400,2725,63,36,4273,11071,536,253,"N/A",1399,71,2076,1019,3178,475,1248,2793,216,471,1358,52,1289,553,2174,3916,117,19617,1256,459,1490,640,1387,0,16852,4661,140,151,5154,1121,1174,581,57,192]
["Louisiana",2011,null,4518629,3250,3865118,18789,538691,17818,99138,3065,288,2010,2774,3957,1202,358,0,195,5193,4425,688,230,1189,1549,468,312,1520,"N/A",120,1221,439,1163,698,10255,1375,278,176,994,15,453,1028,1360,2134,277,2641,4235,1531,455,268,1573,37,2495,30292,179,87,2055,1075,110,339,357,393]
["Maine",2011,null,1315833,1456,1120364,10400,157102,9401,33818,634,37,325,38,829,290,2481,238,239,4304,507,177,0,675,164,275,523,158,138,"N/A",52,4439,702,296,0,325,10,0,150,4302,694,144,2589,1439,19,483,25,471,915,234,587,42,394,1637,182,612,570,88,43,321,21,65]
["Maryland",2011,null,5759087,4326,5008452,20478,553895,18323,153979,228,671,945,423,8595,1796,1608,6652,18492,7825,7113,1170,389,2392,1318,110,689,848,860,1526,"N/A",3470,2077,810,1109,1469,73,0,1105,232,9627,797,9222,6686,0,3396,845,276,14158,197,2882,0,1942,3619,223,40,22089,1525,2027,353,80,779]
["Massachusetts",2011,null,6515057,3680,5658768,20357,656441,18778,139830,1201,225,1017,167,11556,1388,9445,399,676,11396,3264,733,412,2991,640,138,969,180,977,4006,2762,"N/A",2629,862,356,1261,596,637,163,12010,8332,199,19431,3964,61,1757,90,178,6538,10182,1621,44,371,5203,548,2246,2984,1673,911,441,0,4413]
["Michigan",2011,null,9766574,4376,8340767,29076,1242917,25401,139158,3527,3456,3840,2054,7793,3425,1656,0,256,17712,4254,630,882,9897,7668,1709,1148,2578,955,599,1035,2861,"N/A",2671,715,2509,84,439,1215,73,1849,508,6087,3405,159,11224,917,647,2864,385,2185,571,3106,9935,642,0,2327,1430,417,4018,841,908]
["Minnesota",2011,null,5277329,3380,4505462,20788,646176,19647,101029,123,893,2314,951,6638,2662,74,86,367,2820,840,901,402,8209,786,6175,606,755,573,321,424,970,5164,"N/A",549,1345,1457,1936,2682,21,631,540,2416,845,7574,1961,546,1800,870,0,447,5305,874,3062,919,177,1034,1413,92,19255,224,54]
["Mississippi",2011,null,2943021,3088,2534036,16620,332934,15960,68511,8922,117,556,2315,4723,484,54,0,415,6152,3136,369,55,2068,611,650,66,1626,7139,0,265,1445,1610,614,"N/A",1581,0,118,84,65,269,1075,364,483,0,991,566,74,2568,41,398,6,7683,5243,332,0,1453,286,303,1136,0,318]
["Missouri",2011,null,5937896,4110,4963040,26160,801046,25054,149439,1395,2043,2356,6168,8386,3144,1516,0,215,4513,2964,871,560,20161,4404,4811,20884,1993,1728,291,716,463,2830,2026,1641,"N/A",845,4860,1544,769,1114,1016,2904,3669,977,3240,6073,777,1810,359,267,361,2676,10293,1697,88,2684,2518,196,1503,1120,709]
["Montana",2011,null,987076,1359,828254,8593,122210,8386,33553,449,1118,1971,49,3033,2856,58,365,0,291,231,32,1543,765,646,417,845,0,0,71,57,10,353,969,0,158,"N/A",384,688,0,889,264,422,1173,360,321,96,1959,840,0,77,227,266,1329,1232,53,278,3835,14,146,2413,353]
["Nebraska",2011,null,1817126,2304,1505191,11978,253269,10841,52070,169,721,1646,161,5124,3245,381,0,29,1105,434,275,506,1415,615,9575,3040,352,222,122,318,0,683,1455,424,1848,64,"N/A",240,0,119,242,544,829,292,268,1255,1556,252,0,243,2999,226,5343,734,0,615,835,24,560,965,0]
["Nevada",2011,null,2688336,3578,2084668,23272,480317,23514,110345,280,597,10142,310,40114,2714,189,184,983,2923,1731,4093,3929,1668,855,114,602,628,78,49,931,256,1663,1055,203,335,1137,32,"N/A",0,2118,2136,1516,1333,0,1354,258,1691,570,86,165,588,96,7249,3365,0,1740,4680,0,2672,933,153]
["New Hampshire",2011,null,1305678,2046,1141236,9064,122129,8186,37000,193,0,246,22,547,403,1617,20,68,1970,535,0,0,478,470,47,0,0,0,3080,222,15526,155,104,160,153,230,33,186,"N/A",294,186,1471,1297,47,248,0,198,1015,608,588,86,126,605,158,2138,880,428,0,0,162,0]
["New Jersey",2011,null,8719952,4595,7825661,21158,693380,21063,140194,189,1198,3784,57,5986,2203,1924,2100,781,12907,4268,264,256,3690,718,332,317,102,871,624,5335,4675,1889,1261,510,583,49,312,899,499,"N/A",355,40815,2482,61,1121,773,360,19733,463,1586,0,1412,3801,256,0,4458,2454,1252,214,15,4312]
["New Mexico",2011,null,2055293,2718,1753413,15690,228218,13801,62130,410,416,7444,682,7066,5525,0,0,212,2806,676,81,355,466,2030,0,1333,87,184,510,2277,252,908,438,556,1183,544,353,2099,114,245,"N/A",1445,522,264,1742,234,916,492,0,145,240,899,13633,303,71,425,924,0,340,283,99]
["New York",2011,null,19248685,7023,17055260,37016,1756105,32216,282209,1812,6124,2821,1041,25761,3724,15123,1124,3702,29344,10584,1002,434,6914,2198,928,838,2414,1495,2915,5037,14646,3936,1824,401,1417,391,579,1785,2972,41450,461,"N/A",9336,374,5191,1425,2189,26596,1393,6947,112,2660,9151,773,3882,10800,2986,631,1878,688,10582]
["North Carolina",2011,null,9539412,5364,8070238,36924,1160510,33476,265291,5420,3991,4286,327,15373,3919,1975,954,1135,28044,16192,1806,675,5971,3228,654,4995,1637,2936,824,10485,9053,7530,1294,1273,2638,563,1056,1048,2078,10374,1737,18321,"N/A",189,10187,1390,1175,9450,444,20427,565,6057,6621,961,212,27302,3295,2780,2291,153,844]
["North Dakota",2011,null,675161,1047,559906,6503,79837,6140,32510,97,393,1313,249,1356,1229,0,84,0,459,364,138,1209,571,130,208,75,0,422,50,10,369,328,12244,80,330,1227,218,845,0,183,99,264,900,"N/A",286,59,264,652,0,1,1293,113,1862,429,0,166,404,0,1398,139,76]
["Ohio",2011,null,11418944,4418,9764366,32087,1425709,29701,191778,1567,1637,6763,1952,9032,2690,1189,263,587,16492,4290,1044,312,7027,11588,1146,657,12744,1872,0,4982,2101,14330,1788,691,2003,101,1176,1851,1992,3936,255,8784,4572,204,"N/A",2333,1326,14292,369,3826,34,6468,11987,691,68,5425,1979,7548,2534,1280,1607]
["Oklahoma",2011,null,3742698,2585,3089041,15209,528498,15584,108878,591,1137,3770,6894,8233,3273,97,66,191,6056,3514,140,21,2179,2113,580,4626,1398,1934,271,432,160,1038,497,199,5781,803,1979,705,0,391,403,1858,1322,928,1608,"N/A",917,1116,152,2015,600,1700,31595,587,0,1013,1246,44,942,1763,105]
["Oregon",2011,null,3828714,3857,3128121,20096,549332,19087,127906,758,1935,7911,988,34214,2110,949,251,349,3384,1946,2491,6236,1350,1371,659,1263,71,0,269,453,1423,1652,1413,7,1172,1079,324,7222,427,1322,537,2056,1099,313,949,2034,"N/A",1407,0,370,417,673,4498,3443,176,1179,21862,66,914,914,4]
["Pennsylvania",2011,null,12610486,5092,11099077,27780,1224564,25195,234291,1332,759,2278,582,10672,2491,4150,5177,1401,19299,4627,495,236,3902,4086,1176,2323,4013,615,608,17751,6284,4406,853,1238,1761,338,582,1057,1326,36133,325,29436,11254,195,13075,283,1594,"N/A",799,3438,142,3742,7006,1246,446,8419,3688,4631,2426,195,2723]
["Rhode Island",2011,null,1040022,1440,903786,8645,101689,7813,26769,0,0,214,0,1949,301,2613,0,0,2230,476,0,107,373,41,82,374,211,121,228,472,7715,178,27,0,109,0,0,0,941,1224,93,2776,259,0,60,0,57,1125,"N/A",223,0,210,207,181,621,485,262,199,2,23,293]
["South Carolina",2011,null,4624180,3871,3899705,25459,546666,21151,157644,2999,2421,1971,1333,6592,1000,1752,841,589,15476,16355,712,55,2371,3249,1379,1885,2454,878,652,3807,730,4483,471,2163,1522,915,204,1017,372,4241,598,11317,23102,271,6327,1008,833,3523,453,"N/A",62,3324,8623,181,91,7879,2510,1680,341,632,2166]
["South Dakota",2011,null,814175,1297,688436,7824,94655,6542,27506,0,554,1422,659,1286,1021,0,0,0,101,69,0,186,267,285,4772,144,211,0,0,254,113,239,5342,129,354,232,1695,110,0,441,513,6,166,2060,84,40,15,57,7,529,"N/A",0,1156,560,0,79,557,0,481,1310,0]
["Tennessee",2011,null,6333466,4450,5342978,29750,794556,26578,170969,9326,531,1346,7393,7130,1372,150,155,307,15491,17507,179,0,8593,5645,387,1805,13884,1901,9,1135,1690,5983,445,9172,3795,43,631,883,132,1396,381,4921,9353,50,5944,3166,726,3360,14,5531,181,"N/A",7009,200,38,6098,2852,1385,1213,131,1083]
["Texas",2011,null,25327104,10987,20984855,65490,3648260,63784,514726,8747,6670,20073,16461,58992,19126,2927,884,2276,35777,17401,6106,4379,15064,10265,3236,12766,6616,25513,1357,9443,5035,15654,7691,6048,13473,537,3837,7793,459,7578,15225,26155,14956,809,12315,19302,3743,9107,1297,4075,1486,10788,"N/A",5234,349,13231,15325,663,5982,2500,5225]
["Utah",2011,null,2769627,2949,2295961,19215,373984,17246,85217,486,2151,6585,422,18237,3986,562,0,132,1643,1052,1701,7538,1447,545,290,1146,611,494,0,342,959,1099,939,143,511,1241,195,4315,34,506,1707,1937,1653,2,2584,150,2037,1496,0,309,128,549,4507,"N/A",122,2413,4825,270,158,1058,0]
["Vermont",2011,null,621354,940,537304,5021,60719,4634,20463,0,580,310,0,819,529,2105,107,27,366,101,143,0,386,258,0,7,627,41,322,361,2378,335,206,0,69,0,0,15,2244,962,56,3723,250,0,383,0,124,389,401,21,0,327,185,182,"N/A",740,156,53,137,38,19]
["Virginia",2011,null,7996552,5256,6789620,30962,889751,30111,257130,4930,3202,4679,645,19371,4908,5376,961,6854,17773,8715,2917,434,4000,2703,1503,892,3630,2496,2855,22051,5386,7323,834,1682,2277,617,256,1717,1344,7327,1014,12455,22753,462,9570,853,3499,12009,1897,6612,908,7482,11655,1426,173,"N/A",4615,9041,858,190,1222]
["Washington",2011,null,6748474,4248,5565069,27197,919925,27221,208507,1821,5266,12397,756,38421,3938,1026,0,358,6094,8705,5940,10895,2062,2303,1000,2820,1271,1016,1313,1899,1580,3720,1543,1110,3307,2125,673,4925,824,2006,1569,4512,3870,189,2686,765,29168,2296,463,1519,227,2342,15491,4789,119,4233,"N/A",157,1491,1507,1083]
["West Virginia",2011,null,1836614,1681,1609110,9854,172262,8430,50068,221,598,50,225,1442,124,594,89,300,2949,1296,147,120,1331,210,0,0,515,326,45,7515,236,459,0,0,309,60,78,293,160,1431,0,2017,3865,0,8545,97,132,4205,284,1857,0,546,1574,114,23,5561,83,"N/A",42,0,680]
["Wisconsin",2011,null,5647213,2653,4846550,18735,675623,19411,109439,708,432,4045,335,6637,2592,993,219,123,4338,1745,1108,566,25521,4017,3306,418,1040,850,12,147,733,5623,17927,983,2090,143,483,663,480,378,714,2213,2120,1383,1358,118,1057,1294,368,377,590,744,1984,890,342,2573,1555,1090,"N/A",14,728]
["Wyoming",2011,null,561389,1021,462808,7194,66648,5771,30651,51,761,369,174,2539,6905,11,0,0,1525,46,0,2140,450,6,342,286,83,114,0,0,152,849,357,70,241,1105,1784,427,0,7,76,113,395,237,22,462,960,284,13,219,1043,69,1398,2140,4,451,1803,0,168,"N/A",0]
["Puerto Rico",2011,null,3669195,3034,3403602,12450,238263,11889,22649,35,378,229,0,207,0,1849,13,212,6614,247,0,13,624,784,0,38,0,0,0,70,1412,88,0,27,101,0,0,0,0,2150,51,2615,200,0,0,79,0,1978,490,3,113,224,444,0,0,1077,41,14,229,0,"N/A"]
["United States",2010,null,305628607,29823,258552348,236128,38582885,213239,6743229,99221,94692,176768,64264,573988,140620,89360,30055,56052,427853,244992,49218,53122,277579,130170,66922,90681,92999,88131,32209,159866,144152,178207,104765,68363,148055,35870,43531,109409,38399,193972,50438,363139,207025,24450,188013,90616,100185,209810,24948,117569,27915,143135,411641,75541,18380,232002,166162,49349,111240,28186,59885]
["Alabama",2010,null,4729509,3716,3987155,21708,620465,21448,108723,"N/A",3013,676,1481,3827,1278,454,811,211,15062,21644,267,304,2503,3945,669,649,1967,1901,97,716,435,2334,386,7233,1373,229,169,265,0,356,650,3686,2371,169,2222,880,485,1477,0,2368,31,7409,6500,1336,0,2490,1171,41,1155,27,228]
["Alaska",2010,null,702974,1600,565031,7596,95878,7984,36326,477,"N/A",1354,47,3906,1930,0,0,14,2315,1251,1705,895,388,9,262,106,1440,100,574,704,107,923,530,263,0,616,215,240,316,413,421,255,698,69,156,1455,1793,126,0,121,531,477,4123,1274,353,714,2421,0,158,81,19]
["Arizona",2010,null,6332786,4439,5069002,35057,1001991,32027,222725,416,3109,"N/A",689,47164,7687,479,738,0,7712,4261,1966,2147,12250,2690,3008,1935,1705,2014,241,1284,1449,6354,5421,272,4567,1343,1750,10342,64,1782,4419,6618,4463,826,5225,2910,5430,5535,403,2310,1351,3061,14705,7164,664,3413,12645,595,5556,593,599]
["Arkansas",2010,null,2888304,2453,2387806,18627,412997,17485,79127,1405,934,777,"N/A",4457,2535,451,0,154,3578,3921,129,618,3221,722,85,3611,2540,4012,0,306,190,1506,222,2764,7320,85,394,67,0,77,0,289,1561,0,1137,8607,239,731,0,1496,243,2653,13707,361,0,494,264,0,821,443,87]
["California",2010,null,36907897,10889,30790221,71574,5413287,66460,444749,3364,9579,33854,4172,"N/A",15662,4631,643,3683,20362,8820,9528,5719,16482,6550,3163,3857,3394,2989,1796,10626,11969,10435,5095,2757,6921,3009,3062,27724,1614,10108,4632,20981,9593,392,8170,5708,20913,9948,526,5016,1604,4349,36582,10653,525,14232,30544,1446,6031,1336,1223]
["Colorado",2010,null,4988190,3936,4042039,25546,725413,23003,186366,954,2225,12287,1034,26089,"N/A",459,486,479,8849,6445,2355,839,6950,3296,2140,4308,1961,968,532,1532,2242,4587,2878,1277,1978,2042,4065,4131,791,1259,3921,4594,2940,802,2838,3464,4330,3928,192,1231,1847,1628,22253,4748,350,2739,7583,623,2499,4418,874]
["Connecticut",2010,null,3541146,2779,3100742,16358,342904,15404,77333,896,0,664,334,4479,547,"N/A",149,331,9207,748,182,147,3391,1074,108,0,400,0,528,1531,8510,770,934,67,42,0,0,507,1049,3475,112,20727,1345,0,1296,145,640,1955,1728,1140,0,430,1887,0,458,1735,2084,442,1092,47,2027]
["Delaware",2010,null,889812,1573,764640,9145,90001,8498,30759,128,68,60,0,353,178,714,"N/A",432,2362,585,0,0,612,0,0,28,163,0,294,4969,689,61,55,0,539,73,0,106,139,3678,59,4251,424,0,325,0,0,7318,149,195,0,146,178,0,0,1051,377,0,0,0,954]
["District of Columbia ",2010,null,596747,1124,474676,8281,63766,6163,51244,360,591,662,155,4205,656,926,0,"N/A",1100,1597,0,0,615,711,392,83,94,0,76,13503,1376,126,87,0,272,0,62,0,137,1924,61,3852,1897,98,598,0,601,2378,249,380,0,591,1180,0,199,7915,284,860,391,0,0]
["Florida",2010,null,18647600,7733,15554008,45602,2459530,38387,482889,15830,5887,3907,3611,22130,6428,11183,3099,1110,"N/A",35615,2021,884,17432,9030,2921,4136,6321,7232,5497,13241,13900,21359,5439,7929,7984,338,1544,7050,3645,22344,900,55011,19108,794,21047,3466,1655,19935,1982,10759,430,12882,24039,2833,1442,20080,3573,5634,8081,191,12968]
["Georgia",2010,null,9587237,5924,8015409,37393,1278548,36794,249459,13840,3645,2554,599,8909,3224,2619,837,1708,49901,"N/A",1040,414,9736,2649,1096,1355,6525,3645,0,5382,3910,6857,1169,2380,3072,52,148,1155,162,4151,826,12472,15361,0,9323,2070,843,6294,43,15562,557,14445,11424,380,361,8393,4495,358,3416,102,1010]
["Hawaii",2010,null,1346274,1690,1140572,10422,134315,9295,53581,749,743,1398,0,12677,1073,307,0,0,4599,2013,"N/A",42,715,192,68,387,95,88,89,990,1283,627,476,234,170,150,0,1925,496,443,11,1339,1510,69,625,57,1834,553,644,322,267,142,6694,467,0,2644,2705,483,1168,18,0]
["Idaho",2010,null,1550967,1954,1279856,12606,209272,10887,55638,376,3264,3086,45,8932,1372,0,0,144,612,313,123,"N/A",169,132,773,422,315,59,202,44,115,427,465,37,425,1509,0,2110,109,97,694,155,134,96,325,711,3202,172,0,0,296,1153,1746,8014,0,611,10876,133,233,1410,233]
["Illinois",2010,null,12680126,5467,11009852,32636,1404525,28126,203959,1397,1764,5921,1194,16205,3850,2264,56,1047,8051,6781,1224,313,"N/A",21918,9141,1970,2921,1419,55,1985,2811,11865,4300,1093,16703,928,546,2541,206,2331,996,8479,5504,1112,5103,1459,1224,5190,838,1565,292,3999,12245,658,260,3831,1642,812,15364,586,2055]
["Indiana",2010,null,6414862,4257,5431015,24897,833086,22796,127353,1502,177,2210,1548,8959,1362,544,0,181,5496,1623,267,772,27950,"N/A",1885,1582,10643,749,30,1641,103,9361,916,270,3893,164,705,227,114,1876,188,2564,2828,0,13272,681,423,2668,174,584,216,3093,6335,444,45,3673,571,669,1762,413,572]
["Iowa",2010,null,3013053,2381,2553210,15158,375650,12448,72557,330,519,1483,247,2847,2554,114,0,53,1364,973,866,315,17016,1710,"N/A",1520,334,315,0,134,189,1439,7564,117,6031,836,4783,623,381,472,492,273,1123,601,632,679,1071,378,0,591,1992,1617,4131,146,45,303,538,0,2705,111,149]
["Kansas",2010,null,2820894,2731,2341401,17752,372161,15608,95059,44,1050,2238,1596,6125,6022,85,238,0,2863,1916,128,398,2943,1544,1875,"N/A",1048,890,0,1369,100,806,1562,167,23384,289,2678,1318,76,1743,873,2390,1083,225,1509,7568,514,563,39,137,352,1152,9217,238,75,1648,1175,0,1233,573,68]
["Kentucky",2010,null,4296639,3389,3638259,20337,519887,18955,118443,2161,3017,2598,558,3779,329,698,38,147,10119,6397,520,71,4659,11906,656,1109,"N/A",437,0,1395,1036,4672,930,1442,3153,0,858,76,0,1147,122,2057,3758,0,15598,1153,181,2618,289,1286,163,11153,5758,905,525,3671,716,2297,1993,292,179]
["Louisiana",2010,null,4483529,3720,3826390,25103,547291,22645,97889,5740,1504,1960,2382,5751,1215,89,0,264,9394,5766,342,202,2131,948,625,706,1656,"N/A",162,963,995,1301,569,7032,2852,40,119,1552,462,171,294,2161,1443,438,1100,1074,281,1350,0,1130,0,1853,26134,473,0,1278,1509,210,237,31,402]
["Maine",2010,null,1313902,1878,1136780,8034,146735,7677,27758,402,424,254,67,1066,478,1361,174,55,3025,844,62,0,311,259,337,56,484,115,"N/A",243,3521,122,91,0,201,275,204,345,4058,902,234,2339,1001,55,315,124,0,375,379,148,0,249,458,390,420,654,381,0,0,500,204]
["Maryland",2010,null,5716785,3648,4917637,22981,588879,20180,164484,1641,2672,1124,273,8206,2501,1603,8340,23202,6564,3454,422,357,3300,431,160,781,396,1376,53,"N/A",1983,3572,820,403,1147,86,54,979,1369,9058,238,10736,5787,0,3277,607,723,13467,782,1710,49,2669,5883,655,350,24765,1542,4363,324,230,612]
["Massachusetts",2010,null,6489250,3528,5583650,23686,706624,22760,140162,583,1891,1572,206,14971,1051,13270,131,1539,11118,1409,682,79,2842,1891,307,0,340,0,4666,3660,"N/A",1624,2185,453,1957,388,46,792,9911,4709,161,20002,2798,0,2163,158,228,5316,6965,1659,0,918,7073,207,1526,4542,1627,0,546,0,3085]
["Michigan",2010,null,9762127,4595,8310098,29394,1291901,28130,116149,2403,1040,3197,636,6726,2031,277,167,471,11646,3913,313,66,10651,7816,758,640,2353,1342,645,620,1206,"N/A",1275,656,2921,312,213,1874,437,1676,669,3135,2444,53,9783,2276,537,3134,653,1446,706,4453,7184,545,45,2073,1427,446,6291,568,1432]
["Minnesota",2010,null,5244256,3049,4480630,17843,647946,16565,89872,266,1169,4165,279,6233,2521,211,176,306,2575,1776,227,231,6641,1120,4948,1067,402,519,172,1259,1092,2631,"N/A",196,1549,1020,734,540,183,513,151,1309,1673,7316,1035,284,738,730,123,1597,3237,1155,2619,1013,0,2371,1328,200,17929,343,39]
["Mississippi",2010,null,2931228,3253,2510729,16977,340266,16300,72321,8306,1192,187,4941,3000,1167,71,0,0,4814,4014,276,121,3030,1403,114,330,407,7390,0,649,107,2495,863,"N/A",959,314,0,408,0,403,633,1026,2227,0,1312,663,0,750,145,1860,56,8158,5755,232,0,572,508,94,879,490,814]
["Missouri",2010,null,5920858,4730,4968921,23164,786726,21904,145226,819,1051,2988,4381,9840,1903,243,314,478,8317,2492,380,830,21277,3351,4708,23427,2552,2238,171,1359,1395,2610,1701,1183,"N/A",220,2636,1060,108,1320,150,2630,1825,848,2163,4647,314,1639,0,954,512,3311,12884,1319,498,3206,1107,177,1331,359,867]
["Montana",2010,null,978507,1744,821709,7063,117752,6986,35630,212,650,1909,672,5756,2185,128,71,0,1373,46,0,1458,1094,251,169,60,321,85,76,51,59,648,1323,242,564,"N/A",340,548,0,0,660,246,1072,1677,89,182,1620,419,0,110,295,111,2101,964,0,497,3250,0,357,1689,11]
["Nebraska",2010,null,1802697,2153,1497138,11336,247005,9960,51290,232,35,2322,674,4430,4182,361,177,0,1775,1202,257,127,1820,639,5536,2484,153,89,0,77,100,726,2254,823,2723,112,"N/A",232,0,143,831,111,442,777,1232,702,506,345,0,65,2936,77,4445,537,0,772,1230,73,1046,1478,0]
["Nevada",2010,null,2667364,3181,2030410,22983,517261,21311,102677,150,511,7818,530,35472,2935,648,0,0,3579,1187,4363,1686,1711,739,543,453,569,733,0,485,1275,2202,805,946,1747,770,1129,"N/A",59,1528,1220,1204,957,37,1554,886,2629,1567,167,312,1203,706,5224,4500,197,1832,3290,56,419,144,502]
["New Hampshire",2010,null,1303865,1720,1118359,9822,141213,9061,39367,152,0,544,0,1692,240,3134,0,298,1659,0,51,66,850,23,109,57,0,19,3242,49,13752,230,240,25,295,486,0,95,"N/A",540,276,2462,471,0,28,0,508,674,988,51,0,372,1570,279,2566,745,261,0,268,0,56]
["New Jersey",2010,null,8709933,4515,7841470,25935,684482,23318,127369,616,383,1625,258,8777,807,2503,1543,431,9841,4588,385,91,2656,402,332,442,91,249,95,4231,2626,1070,322,450,727,122,261,874,705,"N/A",421,41374,3052,0,1584,32,613,22225,332,1134,0,852,3434,178,57,2670,964,358,586,0,2732]
["New Mexico",2010,null,2039549,2727,1735950,14043,220663,12854,73605,751,969,6117,77,6547,2852,25,391,56,3259,1977,122,755,526,465,0,751,739,65,94,1968,2076,1460,179,719,138,1003,530,4192,79,160,"N/A",784,1793,79,1712,1182,1659,809,46,152,204,1269,18511,1601,309,290,3004,0,407,752,632]
["New York",2010,null,19171916,7371,16976205,41292,1779540,36331,269427,1310,5070,2649,362,25177,3135,15338,2603,1983,30553,7676,259,198,6533,2497,477,1189,804,1321,2270,5912,16855,4779,1649,872,1870,237,886,2077,2636,35333,829,"N/A",13322,0,6510,2298,2284,20514,1913,7161,521,1730,9692,910,2900,8881,2503,444,2354,151,6740]
["North Carolina",2010,null,9443000,5070,7982017,29580,1141001,25307,263256,3044,1618,2847,550,16699,1842,3752,479,1691,28983,15943,1567,724,5657,4132,1077,2192,4419,2180,2259,9881,4052,5789,1839,1187,1932,230,516,698,2130,7195,1186,19406,"N/A",243,8661,1453,1796,11155,97,23196,362,8685,14329,790,350,25662,2874,3025,2012,870,1950]
["North Dakota",2010,null,665654,1209,556222,6833,75720,5430,30100,109,1066,662,168,1411,873,30,0,175,492,799,53,69,39,45,289,114,97,374,0,121,52,298,12350,0,197,1236,328,382,0,144,380,188,637,"N/A",134,108,313,392,0,0,1038,273,2513,462,0,25,696,0,749,219,0]
["Ohio",2010,null,11405101,4931,9745227,23258,1453401,23324,172633,1289,1556,4715,434,8997,2859,1307,15,972,16495,9502,436,564,7092,9438,1270,1016,9159,743,291,3828,3686,15130,2298,89,1171,460,1531,2240,175,2465,515,5988,5985,26,"N/A",1228,342,12012,444,2479,207,4987,7465,485,182,6769,2567,7814,1771,144,2140]
["Oklahoma",2010,null,3716264,3181,3065497,21363,528824,18463,106511,1612,1397,2759,5873,9429,3184,68,109,0,5438,3159,773,611,2679,957,1108,5024,877,2208,298,382,465,1047,599,1733,4102,448,829,1079,69,890,2723,1118,1991,139,1385,"N/A",398,1316,119,596,83,1872,28238,428,93,2286,2035,221,551,1713,209]
["Oregon",2010,null,3794008,3282,3110896,20156,545841,17758,116700,400,2027,5264,246,34190,2050,270,0,217,2273,688,2323,4129,1565,317,161,678,0,0,0,595,1471,1159,668,735,1786,3386,777,2805,317,544,981,2538,1040,592,1541,821,"N/A",1689,0,989,741,787,3826,2879,456,1124,22793,358,1981,523,821]
["Pennsylvania",2010,null,12577555,4619,11053022,29699,1239199,26490,235580,369,2185,3668,807,12077,3657,4007,4608,1621,18212,4644,332,380,4490,2018,227,1426,1675,625,1621,18281,4455,4961,1491,563,1725,339,551,1810,729,42456,1250,30481,7611,521,14545,1254,918,"N/A",377,1315,966,1611,7778,1048,215,10558,2495,4258,1300,1069,6275]
["Rhode Island",2010,null,1042240,1435,900283,9035,99603,7344,32059,136,0,324,0,1697,59,4090,0,146,1336,382,274,0,1210,206,48,0,0,0,447,977,8639,77,47,0,47,0,0,297,333,1868,0,4583,1376,62,0,199,0,560,"N/A",61,48,71,678,0,72,1399,160,150,0,0,276]
["South Carolina",2010,null,4577399,3786,3870879,23788,537961,21768,152441,1741,1670,1457,365,4691,1867,3998,249,38,16060,17486,813,233,4253,2174,703,514,2211,2059,603,5184,3765,3709,818,1175,1371,0,0,1173,486,4908,1390,7912,20749,118,3883,1458,1020,4689,154,"N/A",95,3816,4965,455,478,9786,3070,1190,1057,382,269]
["South Dakota",2010,null,805616,1372,680993,6027,96805,5853,25777,325,25,745,61,1338,807,0,0,0,251,24,75,457,80,439,3520,571,82,129,0,0,407,144,4615,201,252,560,2260,38,0,0,38,758,262,2020,160,296,122,209,0,0,"N/A",0,1334,0,0,224,1564,0,736,648,0]
["Tennessee",2010,null,6282706,4009,5299496,24505,801355,21988,159778,8897,343,2291,4736,8019,1858,765,248,394,14168,11065,243,333,3162,4764,1052,2506,11188,2602,84,1450,1733,5529,1504,9029,4342,290,187,2433,197,2230,621,4800,7102,0,4462,669,430,2562,805,4765,63,"N/A",8701,2062,0,8650,1412,2201,2831,0,0]
["Texas",2010,null,24899075,8102,20500156,52416,3740344,51566,486558,8636,11613,16521,15251,68959,16361,924,704,460,26668,16671,3718,2033,20169,6985,3946,11598,5153,31149,1318,4724,7139,13775,6088,7773,12061,1027,4893,8324,1067,7058,11752,16624,12183,2452,8317,22969,4373,7161,975,5249,1936,13044,"N/A",4123,52,13713,8847,2221,5927,1874,4180]
["Utah",2010,null,2724064,2775,2240636,18397,388410,17535,77780,93,1798,8147,316,12187,3987,119,0,138,2097,966,932,7692,1831,517,483,299,235,46,148,426,246,261,914,127,1255,1929,118,4549,0,247,518,1462,1167,0,1527,886,2525,557,0,838,875,459,5305,"N/A",297,3005,3792,0,338,2126,383]
["Vermont",2010,null,619363,779,534975,5691,59032,4857,22529,0,184,65,0,1001,326,1287,87,9,2063,496,49,0,370,0,91,0,176,0,824,300,3599,201,85,0,51,236,0,58,2760,751,0,4056,539,30,50,0,100,524,227,134,153,125,565,0,"N/A",400,128,0,377,52,0]
["Virginia",2010,null,7930773,4735,6752310,28251,870491,21599,259507,2671,3296,3807,1233,17088,3229,2468,1265,10593,18165,11927,2347,1159,7576,2892,1135,2103,2051,2148,1494,24822,4104,5733,462,1858,4262,866,523,748,372,6825,1098,17525,23829,201,7708,781,2137,11796,1543,8339,98,5842,12938,1551,676,"N/A",4373,6779,2648,423,1306]
["Washington",2010,null,6661321,4568,5464985,26926,946923,24983,191784,1322,5644,5971,658,39468,4883,642,202,243,5378,3107,4246,12661,3931,1912,1685,1694,886,1011,717,629,1448,2871,1323,737,3727,5094,323,5310,282,721,1012,4140,2143,515,2727,1986,26235,2893,220,3047,866,789,11338,4020,981,7266,"N/A",62,2180,638,0]
["West Virginia",2010,null,1833535,1890,1625125,9824,166168,9198,39609,41,1326,0,0,760,608,84,556,480,1842,485,0,88,356,366,0,161,851,60,0,4249,191,657,0,44,160,39,0,25,107,906,0,611,2552,268,7925,229,0,4908,238,647,0,1160,968,112,208,4999,192,"N/A",150,0,182]
["Wisconsin",2010,null,5623196,3124,4824045,20412,691592,17462,93065,552,798,1854,518,4506,1890,359,351,98,4492,1656,550,902,20299,2563,2300,752,287,331,448,1088,992,6317,16741,810,1716,154,853,1049,69,632,123,1291,1817,497,1674,89,1444,2211,0,1142,235,856,3039,476,75,771,1013,256,"N/A",129,521]
["Wyoming",2010,null,556954,1133,444614,8794,82255,8679,28046,172,0,1511,0,2784,4390,0,0,0,396,745,25,942,415,132,462,532,519,107,0,51,252,570,218,0,421,2528,1711,416,0,0,707,146,34,233,56,62,14,95,0,220,258,495,1990,3226,75,580,556,0,0,"N/A",0]
["Puerto Rico",2010,null,3676493,2933,3392179,13112,247593,12844,31732,629,156,288,0,1177,388,899,0,0,11262,207,0,0,1642,109,0,112,254,109,0,59,2004,89,50,170,221,0,0,0,0,1244,364,4768,146,0,69,0,0,1516,684,109,0,30,977,882,0,392,0,141,585,0,"N/A"]
[]
[null,null,null,{"$f":"MIN(D4:D162)","v":556954},{"$f":"MIN(E4:E162)","v":779},444614,5021,59032,4634]

{"sheet":"StateListAbbrev","index":8,"n_rows":53,"n_cols":3,"rows_kept":53,"cut":false,"hidden":true,"merged":[]}
["Abbrev","State","Abbrev"]
["AL","Alabama","AL"]
["AK","Alaska","AK"]
["AZ","Arizona","AZ"]
["AR","Arkansas","AR"]
["CA","California","CA"]
["CO","Colorado","CO"]
["CT","Connecticut","CT"]
["DE","Delaware","DE"]
["DC","District of Columbia ","DC"]
["FL","Florida","FL"]
["GA","Georgia","GA"]
["HI","Hawaii","HI"]
["ID","Idaho","ID"]
["IL","Illinois","IL"]
["IN","Indiana","IN"]
["IA","Iowa","IA"]
["KS","Kansas","KS"]
["KY","Kentucky","KY"]
["LA","Louisiana","LA"]
["ME","Maine","ME"]
["MD","Maryland","MD"]
["MA","Massachusetts","MA"]
["MI","Michigan","MI"]
["MN","Minnesota","MN"]
["MS","Mississippi","MS"]
["MO","Missouri","MO"]
["MT","Montana","MT"]
["NE","Nebraska","NE"]
["NV","Nevada","NV"]
["NH","New Hampshire","NH"]
["NJ","New Jersey","NJ"]
["NM","New Mexico","NM"]
["NY","New York","NY"]
["NC","North Carolina","NC"]
["ND","North Dakota","ND"]
["OH","Ohio","OH"]
["OK","Oklahoma","OK"]
["OR","Oregon","OR"]
["PA","Pennsylvania","PA"]
["PR","Puerto Rico","PR"]
["RI","Rhode Island","RI"]
["SC","South Carolina","SC"]
["SD","South Dakota","SD"]
["TN","Tennessee","TN"]
["TX","Texas","TX"]
["UT","Utah","UT"]
["VT","Vermont","VT"]
["VA","Virginia","VA"]
["WA","Washington","WA"]
["WV","West Virginia","WV"]
["WI","Wisconsin","WI"]
["WY","Wyoming","WY"]