{"text_format":"1","workbook":"xlsx","n_sheets":4,"sheets":["Dashboard","Data","Calc","Pivots"],"not_rendered":{"charts":14,"images":0,"macros":1,"external_links":0,"defined_names":42,"comments":0,"pivot_tables":7},"unopened":[],"bounds":{"document_bytes":16777216,"sheet_cells":100000,"rows_first":2000,"rows_last":500,"rows_between":2000,"halvings":0,"cell_chars":16384,"cell_head_chars":4096},"cells_cut":0,"cells_raw":0,"read":"whole","date_system":"1900"}

{"sheet":"Dashboard","index":0,"n_rows":20,"n_cols":3,"rows_kept":20,"cut":false,"hidden":false,"merged":[]}
[]
[]
[]
[]
[]
[]
[null,null,{"$f":"StateName","v":"United States"}]
[]
[]
[]
[]
[]
[]
[]
[]
[]
[]
[]
[]
[null,null,{"$f":"StateName2","v":"Oregon"}]

{"sheet":"Data","index":1,"n_rows":161,"n_cols":58,"rows_kept":161,"cut":false,"hidden":false,"merged":[]}
[null,null,null,null,null,"*State of Residence Last Year"]
["Year","State of Residence","Population","Same Residence Last Yr","Changed Residence Last Yr","TOTAL","Alabama","Alaska","Arizona","Arkansas","California","Colorado","Connecticut","Delaware","District of Columbia","Florida","Georgia","Hawaii","Idaho","Illinois","Indiana","Iowa","Kansas","Kentucky","Louisiana","Maine","Maryland","Massachusetts","Michigan","Minnesota","Mississippi","Missouri","Montana","Nebraska","Nevada","New Hampshire","New Jersey","New Mexico","New York","North Carolina","North Dakota","Ohio","Oklahoma","Oregon","Pennsylvania","Rhode Island","South Carolina","South Dakota","Tennessee","Texas","Utah","Vermont","Virginia","Washington","West Virginia","Wisconsin","Wyoming","Puerto Rico"]
["2012-01-01","United States",310212755,263612596,37696597,7070345,109210,84068,206842,64967,566986,161530,87023,25149,59513,428325,252262,61509,55191,277953,144597,73325,93134,103004,95956,38574,157664,158156,175733,115946,66947,142754,33832,48816,98882,38696,219202,63921,405864,238663,23959,199202,102572,108182,237156,30498,127418,22534,163843,402187,82165,20056,238540,180462,47425,97724,32228,74500]
["2012-01-01","Alabama",4764428,4054260,590326,104600,0,1004,962,660,3077,1386,284,42,162,11244,19920,627,493,2722,1347,345,865,2495,3104,67,1513,334,2298,752,4952,1555,101,151,1009,161,1702,459,2709,5133,228,1411,194,200,1837,0,2811,518,10539,7468,579,0,3170,1034,128,760,88,619]
["2012-01-01","Alaska",721186,592551,90613,33415,1097,0,1520,196,3494,556,0,0,356,1991,928,1376,538,58,260,13,221,161,120,66,508,297,563,192,56,819,371,1195,803,118,116,263,736,920,264,1316,335,3174,255,0,384,99,451,1488,330,79,1265,3725,0,206,136,25]
["2012-01-01","Arizona",6468907,5242674,953789,232457,1331,3717,0,1214,44889,13790,417,246,36,5553,2263,2491,2934,10744,2930,2702,2498,1328,724,616,3007,1961,9598,8570,293,2595,1118,2293,6712,510,2564,6946,7402,2721,877,7906,1626,8587,4280,614,1070,1472,5075,14788,5916,207,2763,13247,765,3765,2786,1791]
["2012-01-01","Arkansas",2912680,2453347,373046,76948,374,855,1677,0,3525,603,185,0,205,2682,1525,0,0,3576,1172,409,1033,1310,3953,17,169,254,1283,295,3689,9105,258,166,121,0,157,547,2262,3057,0,1135,9938,193,516,59,52,673,4195,11767,269,0,1159,251,84,695,1498,0]
["2012-01-01","California",37572738,31777868,5046618,493641,2509,6995,38916,3472,0,15150,6764,474,3199,21004,10790,11906,5331,21251,5891,2284,2790,3763,5180,1256,7902,14356,8921,8539,2556,6729,3060,3302,27968,1327,12057,5921,31261,11195,1827,10653,6671,22724,10466,1648,4110,826,5802,43005,12172,544,15625,34569,1413,5681,1886,2323]
["2012-01-01","Colorado",5123944,4131357,751921,205060,3108,3457,10589,1043,22152,0,1317,70,488,8615,5834,2536,2660,6374,4336,2776,5283,2500,5048,20,2844,5939,3343,2992,835,3771,2021,4472,3789,679,2464,6520,7250,4378,1918,4533,4582,2419,3950,137,2383,756,2535,17355,6398,503,3796,4853,837,3000,5602,1144]
["2012-01-01","Connecticut",3555319,3114940,334918,80311,46,439,3167,200,3161,367,0,22,288,6578,1702,408,97,912,53,0,0,124,909,1224,1752,8743,753,605,276,358,50,45,172,1009,5665,444,23310,3379,0,287,415,35,2214,1558,940,0,260,3279,45,709,1729,1593,174,711,104,3228]
["2012-01-01","Delaware",906576,782216,86003,34757,119,692,188,0,2221,0,1489,0,11,715,179,0,32,567,62,30,113,0,178,0,5649,157,227,351,58,80,0,91,572,99,5846,85,3566,1349,0,191,0,0,6828,135,298,0,344,133,166,0,1746,29,161,0,0,56]
["2012-01-01","District of Columbia ",624847,500267,61992,53830,79,1247,902,35,4999,677,618,78,0,1705,1079,38,46,795,469,133,164,112,283,194,14120,1524,944,393,44,337,0,172,42,197,1451,116,3085,985,0,651,0,157,1494,635,150,0,577,1473,116,267,9537,481,293,721,215,0]
["2012-01-01","Florida",19114620,16032617,2380288,537148,18599,10704,6473,3321,20386,8766,8975,1099,780,0,42754,3177,1268,22565,13803,3864,5661,6912,5550,7348,10442,15159,23400,5460,5490,10666,1758,945,1241,2362,27606,2853,53009,23133,239,22927,3142,2919,25659,3050,11366,1070,16275,28564,2499,2747,25697,4943,3533,6216,773,21638]
["2012-01-01","Georgia",9796547,8231384,1236302,277466,13864,2654,6657,1041,14174,4710,1829,226,1352,42870,0,1409,936,7143,5972,1687,1497,6172,4100,222,3619,4153,9949,2237,3280,3377,251,1283,3783,15,4920,915,13957,16009,207,7501,3299,453,9076,440,18611,257,17606,16198,20,84,10702,1965,1237,3441,106,1730]
["2012-01-01","Hawaii",1374852,1164145,134827,55145,608,1417,1865,24,9756,1216,191,278,230,2780,1448,0,404,318,292,84,1135,485,207,91,2491,1266,321,192,44,944,131,75,760,85,410,284,2382,2241,0,884,1095,1763,1087,106,644,459,1314,3300,2183,0,1393,5920,197,295,50,336]
["2012-01-01","Idaho",1573036,1296975,210151,59283,575,1198,2424,291,10280,1186,44,120,116,2014,583,206,0,532,283,90,63,83,54,0,107,338,683,637,87,214,3800,35,2535,0,214,675,938,817,0,1018,93,4963,169,0,205,118,1957,1352,6617,0,269,10398,0,225,677,136]
["2012-01-01","Illinois",12725119,11009321,1441191,208755,883,2250,7139,1587,14940,3036,955,234,1066,12687,8745,869,1384,0,16907,8529,2009,2923,1229,526,1865,3296,12583,6537,2744,13264,228,1302,1478,283,2366,1359,7561,3761,196,6872,1491,954,4588,462,1583,394,4648,16780,1154,156,4311,2704,1221,14414,302,2049]
["2012-01-01","Indiana",6457067,5493090,805228,134137,1625,479,2763,564,6033,1225,823,639,1045,11472,2258,856,186,28436,0,1678,1624,11177,736,0,1050,837,11017,1543,1948,4526,134,591,1011,0,1537,219,2316,2665,113,11235,1198,387,2419,0,1414,111,3547,4490,105,0,1932,258,507,1727,1681,136]
["2012-01-01","Iowa",3035469,2585979,362938,75760,503,951,1590,451,3268,3252,112,0,151,4335,596,521,290,11969,1716,0,918,819,763,78,419,585,946,7505,751,4168,452,7698,681,56,1018,114,1230,734,833,1127,1465,348,451,0,943,1158,1148,3553,886,0,268,919,22,3607,392,786]
["2012-01-01","Kansas",2848708,2361899,381695,88284,853,333,3094,2158,5411,3746,210,0,456,3118,1896,149,456,1702,1679,1527,0,617,438,211,282,187,1125,682,452,21022,300,4126,851,0,267,1029,571,813,261,1310,8408,848,918,18,556,154,1542,8468,97,70,1705,3265,139,486,278,82]
["2012-01-01","Kentucky",4328626,3676472,521511,112787,4137,304,1103,518,3415,712,246,706,254,9232,4173,647,50,4445,12203,238,602,0,666,46,1120,419,7302,605,646,2381,0,723,301,84,496,554,5239,3643,122,17041,577,298,2226,0,1347,0,10064,3345,464,45,3319,1988,3346,1395,0,170]
["2012-01-01","Louisiana",4545914,3912023,528406,91215,2329,403,2021,3645,5139,1433,164,0,596,6534,4478,378,265,1229,1359,544,420,1649,0,251,642,549,1080,330,6791,1591,428,745,931,11,975,150,2786,2284,64,1115,2159,195,1239,737,1914,0,2348,24488,277,45,1857,1581,238,682,146,655]
["2012-01-01","Maine",1315586,1132344,151438,27523,129,38,230,0,1610,314,1468,234,32,2926,511,0,143,195,0,7,277,482,15,0,325,3887,116,430,79,69,0,82,35,3655,405,272,2519,1112,0,628,79,215,976,1024,173,0,985,496,200,349,573,118,51,0,59,38]
["2012-01-01","Maryland",5816472,5068457,549973,154983,1261,1947,760,136,8614,1071,881,4100,21213,9610,4610,610,429,3621,1210,569,1726,715,606,332,0,3977,2167,1422,581,256,0,132,330,1124,6260,638,11736,7507,116,2522,463,378,15485,82,2297,0,1800,5612,1061,589,20579,1431,1957,460,0,294]
["2012-01-01","Massachusetts",6580641,5752166,626380,142577,636,890,1972,394,12770,980,10525,506,379,12890,2789,1108,188,2886,677,151,565,52,1556,3907,2381,0,1337,966,155,453,49,182,787,13331,8046,521,19467,2514,81,1829,297,1528,8236,6863,2477,194,823,3694,1027,2534,4098,1653,385,584,264,4056]
["2012-01-01","Michigan",9778980,8330990,1268105,133981,2341,1152,7168,906,8085,2363,798,114,274,13146,4270,291,242,10047,10976,993,805,3409,1284,261,2201,1720,0,1127,922,2206,218,113,1354,446,1617,1318,5731,3912,265,11318,705,811,2739,68,1822,66,3259,8638,819,60,3057,2146,353,4768,1277,782]
["2012-01-01","Minnesota",5315228,4536303,653012,101042,1299,523,3065,375,8086,3565,696,0,310,2372,2235,1277,575,5896,2026,7220,924,57,791,187,1841,814,2212,0,202,1709,1257,992,932,0,1038,322,1849,1745,6672,2635,1212,781,1106,299,1705,3442,1738,4001,429,77,1037,1685,0,17618,213,134]
["2012-01-01","Mississippi",2947696,2529377,339807,73500,5141,0,710,2680,4371,799,106,0,97,4676,2669,184,586,2703,1200,160,400,446,8588,163,379,67,1768,568,0,2634,166,138,526,60,2127,86,1492,1709,98,896,562,465,613,185,596,79,11643,7230,454,0,1929,433,0,611,307,81]
["2012-01-01","Missouri",5951913,4965459,801093,162930,1333,2186,2297,9434,10717,3798,410,234,144,8374,3451,2114,596,22001,4184,5956,20218,2291,1178,996,1246,810,2964,2798,1110,0,511,1999,836,35,960,451,2834,3988,636,3557,5298,1186,1535,361,2856,527,3122,9278,3287,318,2609,2312,148,2636,810,826]
["2012-01-01","Montana",995544,829489,126463,37690,31,726,1548,63,5428,2135,0,0,0,1875,292,556,3385,542,163,415,224,367,0,225,33,97,822,481,32,447,0,108,968,115,156,259,482,1082,977,402,1018,2950,457,0,230,191,45,1393,260,87,156,4783,0,750,934,0]
["2012-01-01","Nebraska",1829420,1540361,237937,43266,245,626,2406,363,3438,2023,0,0,0,1368,786,165,315,1193,290,6815,3103,131,411,68,129,195,258,1489,176,2223,108,0,233,0,524,158,318,874,497,563,587,106,702,0,456,2507,232,3130,229,79,1076,1327,111,316,917,0]
["2012-01-01","Nevada",2725280,2105070,481496,124285,761,2161,8748,353,49978,6402,143,373,468,3381,745,2053,1503,2822,362,714,1202,952,421,209,934,318,1235,1157,783,694,1086,714,0,175,912,1138,3521,767,702,1407,1520,3101,1601,336,480,0,1699,5484,4605,121,1135,2997,100,1046,766,237]
["2012-01-01","New Hampshire",1309203,1127376,125118,50484,0,437,440,0,1514,572,1345,0,101,2746,470,43,20,673,297,53,102,284,7,6118,33,18990,426,0,0,289,0,110,0,0,591,223,2905,1609,0,324,186,208,890,1248,323,0,77,2150,557,2960,660,113,80,239,71,75]
["2012-01-01","New Jersey",8772744,7929570,655465,130223,779,359,1328,57,4330,380,3466,1921,840,10649,3002,22,113,2052,1039,357,426,631,339,430,3474,4907,324,570,106,384,67,35,908,126,0,45,40495,3236,55,1452,1540,760,23597,429,2372,581,1400,2509,425,35,5024,1847,297,680,23,2574]
["2012-01-01","New Mexico",2060595,1769341,226243,54693,787,320,6391,410,4536,4780,280,100,25,4707,192,168,355,790,660,384,672,159,790,57,505,303,602,284,451,1216,139,194,604,268,252,0,1111,335,41,1178,1076,932,822,0,325,509,338,11955,1382,81,1560,1251,0,321,95,429]
["2012-01-01","New York",19352153,17202134,1723117,270053,1364,4002,4146,247,24623,3596,14595,477,3936,27392,7592,1598,607,8017,3040,955,1437,1753,1083,1345,7321,15073,5191,1059,773,3310,421,78,600,2760,42574,646,0,10544,77,4625,1327,1055,22895,3222,5952,0,1279,11231,622,2764,7939,2614,921,979,396,7321]
["2012-01-01","North Carolina",9640490,8167830,1149080,273149,4329,1458,3493,861,13883,4790,4914,2180,1801,26365,16823,1566,334,6378,4532,775,1595,1531,919,1259,9005,3710,6161,1523,2377,2623,244,628,1627,754,11468,1138,19891,0,206,9337,1263,1333,12179,290,25532,351,9230,12638,1189,445,26759,5915,2677,2266,604,2025]
["2012-01-01","North Dakota",689838,563978,84294,38213,83,70,1571,0,999,546,65,0,70,950,98,160,540,799,55,458,161,22,18,98,232,187,757,15257,72,1490,1776,950,854,0,140,161,331,231,0,6,280,724,114,244,14,1754,746,1414,43,758,403,1604,0,543,365,0]
["2012-01-01","Ohio",11414635,9735390,1440815,196391,3705,2207,4929,884,8995,3180,1355,1079,985,16366,8052,1198,412,9510,13534,1039,1166,13227,2214,1189,5026,2189,16336,1122,1017,3026,276,1052,907,189,4703,1361,8732,5498,453,0,858,432,14147,435,2445,47,3542,11760,197,364,3193,2862,7820,974,202,1403]
["2012-01-01","Oklahoma",3762311,3107367,531347,108972,1030,1279,2974,5777,8950,4717,0,380,151,5011,2581,189,905,1100,1490,1088,7065,1354,2562,167,750,1233,1347,906,1850,5210,798,300,1101,549,1523,1244,1981,1961,308,1148,0,1261,494,0,569,108,2471,25508,2588,197,1749,1574,368,1061,45,0]
["2012-01-01","Oregon",3857465,3158450,560673,118925,373,2513,7954,165,31862,4472,381,0,696,1660,1032,2501,5093,1676,1380,834,556,202,227,446,457,760,570,1792,186,403,2192,570,5935,39,385,920,2379,1482,42,1411,725,0,904,177,461,119,802,3347,4793,367,676,21224,593,426,765,152]
["2012-01-01","Pennsylvania",12630082,11107110,1252378,215500,1926,1658,3529,573,7772,2574,3311,4814,2921,14631,4337,245,359,3749,1599,125,967,1233,694,988,17529,5900,2642,1169,55,1171,135,214,1600,1138,33791,1001,32898,6380,166,14319,378,234,0,771,3023,159,1273,6768,1276,1012,11960,1787,6762,1550,434,7847]
["2012-01-01","Rhode Island",1040527,899551,101165,33446,20,0,93,0,2146,332,4170,0,313,2752,168,120,0,385,0,0,27,286,24,279,482,11253,230,131,0,210,0,188,25,611,1219,36,3603,478,0,63,0,139,735,0,481,0,120,823,0,53,1008,287,0,135,21,116]
["2012-01-01","South Carolina",4668886,3929626,564350,156705,1665,1244,2222,839,5979,1915,1590,697,435,11552,18570,638,198,2125,3802,643,1064,1924,2709,2077,3565,2313,2966,757,1407,1884,93,158,1025,917,6517,1052,10746,24764,656,4388,555,255,6497,538,0,816,3550,5351,566,298,9377,1629,1345,832,0,1070]
["2012-01-01","South Dakota",821669,676014,115606,26051,0,855,435,227,1494,1744,2,0,0,970,122,8,78,74,210,2441,403,0,0,0,60,61,892,3568,34,474,248,2175,135,0,0,175,371,240,1725,64,21,667,515,0,158,0,507,1715,388,5,340,1026,131,314,979,134]
["2012-01-01","Tennessee",6378278,5396833,783077,177098,12116,1281,2250,3306,8396,2473,936,176,180,15641,16012,1058,787,7094,5591,617,2630,13202,2452,1040,1743,1525,4507,1178,10568,2694,308,432,735,271,783,751,6279,5904,7,6200,2495,1080,3329,26,4300,0,0,8716,784,133,8008,1876,3248,1622,358,717]
["2012-01-01","Texas",25711791,21354247,3656070,507752,9993,6759,18908,13781,62702,16616,2769,181,1189,31259,20362,5040,2387,19672,8264,4934,12699,6040,29348,1293,4969,4813,9501,2803,6402,12319,1813,4794,8266,761,6797,16762,20274,22660,989,8728,26284,3827,10449,1763,4470,1264,10368,0,4610,113,17734,11630,1729,4192,2472,4435]
["2012-01-01","Utah",2805440,2324019,373980,87870,126,2819,7966,361,15286,5350,142,0,0,2428,1142,1436,5129,1588,475,2791,398,217,345,380,613,1503,1670,385,284,1553,1057,489,5391,507,437,686,2129,842,175,1875,1338,4089,944,351,60,47,863,3605,0,39,1369,3529,0,1445,2216,239]
["2012-01-01","Vermont",620224,532237,61242,24431,16,93,127,0,1112,382,1626,0,116,966,56,6,0,230,68,30,0,1243,73,883,862,3318,284,315,0,23,147,0,17,2893,833,74,4780,328,0,214,11,26,935,341,124,39,193,493,81,0,728,98,0,151,96,0]
["2012-01-01","Virginia",8085389,6857430,915242,250653,2515,1906,2420,445,14780,5352,2725,2279,10964,19574,9535,3823,652,7089,2663,221,1144,3908,1638,1144,23925,3767,2982,2294,1344,1914,658,357,973,535,9073,947,15893,25575,852,5622,2810,1541,14190,1605,7936,35,6189,12944,2092,423,0,4160,3839,1258,143,516]
["2012-01-01","Washington",6815763,5648199,904695,215494,1507,4328,8362,1413,45597,5195,2901,100,773,9370,6363,5239,10604,4298,1089,1159,2544,1368,1646,532,1191,2911,3470,2703,615,2802,2919,682,5671,309,2300,872,5562,4088,217,3192,1223,25525,3397,97,2727,94,3206,14196,5298,223,3839,0,215,1168,394,1025]
["2012-01-01","West Virginia",1837518,1613322,174112,47125,477,306,79,0,1231,104,143,674,294,1919,1108,166,181,220,328,68,39,2249,90,35,5352,164,778,20,0,59,0,0,229,129,1213,81,1721,4683,175,6757,520,118,5208,0,1098,36,1061,622,0,54,6317,297,0,470,252,79]
["2012-01-01","Wisconsin",5660677,4849945,693737,99192,323,236,3257,253,5347,1600,657,296,15,4937,970,333,360,22285,2480,4161,1160,635,598,233,1306,489,3917,18965,238,1263,784,324,1163,3,606,526,2033,2939,284,2610,289,945,1563,144,1053,329,1051,2765,900,62,1267,1208,0,0,30,975]
["2012-01-01","Wyoming",569734,459226,77324,31149,260,590,2014,244,2035,5599,0,0,0,733,166,0,745,905,179,259,539,4,88,0,294,548,965,290,136,244,1901,1216,355,0,121,604,231,459,338,819,964,893,230,0,122,1175,4,1427,1710,0,138,1323,0,282,0,16]
["2012-01-01","Puerto Rico",3628402,3366593,238042,20044,8,57,54,93,519,0,370,0,0,4192,232,110,0,1021,121,0,143,37,59,0,108,2258,435,0,0,0,0,0,0,0,1922,28,2314,638,0,328,0,0,2313,624,4,0,15,360,0,0,684,0,8,989,0,0]
["2011-01-01","United States",307900319,261087925,37998701,6987416,106806,88850,211816,77226,562343,160623,91295,26631,49732,437202,248892,61940,57831,269008,143228,74516,94180,99256,86593,33729,165041,145869,186505,103253,68597,138404,31204,52809,115943,43277,216369,61431,377800,225147,26563,206049,81009,109795,215127,31065,121426,29383,154243,404839,73211,18172,229227,190644,45956,105370,31991,76218]
["2011-01-01","Alabama",4745278,4024442,588293,117726,0,1771,1677,1642,3389,348,2921,232,399,20063,19346,1259,137,6991,1434,30,842,2686,2413,626,1606,112,2797,327,3945,1086,317,770,257,64,1996,119,1108,2697,284,2596,973,169,1075,0,2036,90,8710,7973,300,66,4935,2621,65,417,9,569]
["2011-01-01","Alaska",711962,571857,100280,35084,93,0,2467,190,3098,1583,138,11,140,1188,556,1366,475,985,181,319,750,237,1077,0,216,141,771,593,554,921,248,5,532,520,128,226,940,470,0,319,616,2161,378,0,186,301,388,2492,662,68,1488,4548,89,23,246,1044]
["2011-01-01","Arizona",6402301,5107496,1028366,222877,833,5001,0,1066,49635,10189,1875,0,389,3732,2206,2199,2190,10035,5855,4526,1708,2134,844,0,1918,743,9396,3297,1226,3872,2431,1393,8756,228,3379,4610,3880,2548,1159,4682,3219,4613,3436,72,1774,1657,1680,12688,10577,0,2233,13940,70,6473,2510,871]
["2011-01-01","Arkansas",2906632,2421746,405831,69845,691,560,439,0,4077,746,519,79,0,3067,1446,13,179,3684,1362,851,2008,213,2120,30,133,781,1881,232,1731,7314,713,332,641,52,341,775,674,1664,214,174,3761,632,567,0,235,0,6462,14767,0,0,1245,1477,24,687,252,529]
["2011-01-01","California",37222678,31213310,5271168,468428,2087,7358,35650,2648,0,21245,3073,1302,3240,22094,13303,9864,4796,20834,4673,3324,2810,1201,3600,1658,7793,10244,12069,5687,2092,7677,2599,1955,36159,1222,8053,5904,25629,8708,1392,10474,5113,18165,8550,1103,5758,1004,8761,37087,8944,745,15753,36481,832,5668,2047,1344]
["2011-01-01","Colorado",5048443,4048042,763233,202124,2340,3191,12338,1615,23234,0,1567,501,298,8075,3250,1852,1578,6027,2116,3510,3718,1361,908,1358,3303,2157,3225,3055,879,4552,4079,4582,4061,489,2863,8797,3998,4756,2249,5527,3824,5543,3348,435,718,1340,3193,22390,3856,914,6281,5524,412,3995,2942,476]
["2011-01-01","Connecticut",3548667,3139496,316883,71502,101,180,1387,84,3699,1502,0,62,607,4771,2000,587,133,1843,168,67,16,0,315,259,1267,8691,692,76,69,365,206,62,160,1221,3809,265,20015,1029,0,1383,217,117,3668,1488,997,0,123,1214,398,608,2555,2255,46,660,65,2105]
["2011-01-01","Delaware",897187,775414,83156,33912,81,329,541,0,699,169,66,0,154,810,639,201,441,34,210,0,7,305,0,0,4238,806,43,201,0,713,0,12,0,0,6297,0,3141,388,0,664,27,0,8571,131,153,0,221,883,475,0,1064,482,198,55,463,1008]
["2011-01-01","District of Columbia ",611608,489659,66519,48066,13,135,43,81,3797,452,981,128,0,1254,937,372,68,1397,128,241,6,297,0,0,14129,2048,1108,409,83,112,38,79,238,145,1035,0,2313,1716,285,306,0,51,1589,50,357,104,421,1083,75,445,7975,476,120,946,0,0]
["2011-01-01","Florida",18863948,15742168,2454255,498597,12635,7405,8451,3025,22420,9383,11704,1264,891,0,38658,3639,312,19152,11472,1846,2661,5441,6094,4689,15410,13701,19640,4663,5175,7114,559,3857,3527,4324,25206,1376,59288,23983,514,18191,2600,3315,20821,5002,11953,716,10451,25532,2343,2019,16614,6339,4964,7412,846,21611]
["2011-01-01","Georgia",9699859,8095407,1289450,271077,18799,1079,4292,2112,14949,2325,709,619,364,42666,0,1006,126,6080,2442,950,4513,3686,6541,408,3708,4436,6992,1808,5380,2514,246,4144,774,132,8371,791,14454,19138,201,6863,1632,727,5791,337,16914,536,16898,15760,793,361,9438,3701,1340,2727,504,1635]
["2011-01-01","Hawaii",1357806,1160948,122727,57542,1268,844,2900,242,10173,950,731,784,222,3160,2519,0,112,1884,402,478,125,18,179,106,341,92,1303,933,371,308,85,91,1548,107,564,354,4246,2307,32,970,685,2030,870,58,1681,0,636,3007,1040,0,2523,3790,312,147,14,238]
["2011-01-01","Idaho",1559637,1284530,208434,60336,263,4510,3543,224,9021,1813,0,0,0,1733,275,254,0,390,296,318,479,120,51,0,0,396,615,566,62,384,1602,439,3581,129,84,141,419,263,1201,260,288,7170,343,0,55,842,296,1303,6059,0,905,8991,0,165,487,249]
["2011-01-01","Illinois",12718402,11076528,1353853,216204,2823,4119,7657,3185,13930,3271,1819,277,1440,17548,6042,1269,393,0,23491,8420,2533,5569,1315,693,2565,3507,10274,4496,1521,13889,304,827,2454,590,3009,1573,6412,4057,105,8384,1002,792,3012,278,1582,1318,3223,11011,951,49,5233,3075,352,14507,58,2387]
["2011-01-01","Indiana",6437155,5478683,809158,127874,1562,371,3975,2016,7649,1930,1227,79,0,8595,2543,1057,1368,23071,0,916,1321,10177,2241,275,480,952,7896,1168,469,1824,34,622,511,90,651,504,2518,3038,70,11109,844,505,3998,49,3306,235,3879,6326,123,530,1486,1028,216,2923,117,132]
["2011-01-01","Iowa",3027718,2573313,370554,70405,207,967,1411,433,3297,2891,424,0,0,707,1938,299,161,13725,349,0,1776,387,228,26,487,466,1687,5634,408,3649,370,6490,2009,0,185,421,2361,1760,604,993,532,811,388,65,172,2842,623,2334,1482,38,720,856,115,2537,140,57]
["2011-01-01","Kansas",2833584,2372033,362782,83640,434,108,2028,998,4743,5030,412,74,128,1581,1146,287,264,2760,863,1715,0,1167,519,481,3180,28,1947,679,1517,22033,270,1648,657,27,1189,769,780,1223,379,1616,5022,285,1494,180,1102,104,1066,6575,196,0,1986,772,0,893,1285,775]
["2011-01-01","Kentucky",4316297,3686232,505741,110031,925,0,1818,1058,2130,221,176,0,201,7400,2725,63,36,4273,11071,536,253,0,1399,71,2076,1019,3178,475,1248,2793,216,471,1358,52,1289,553,2174,3916,117,19617,1256,459,1490,640,1387,0,16852,4661,140,151,5154,1121,1174,581,57,192]
["2011-01-01","Louisiana",4518629,3865118,538691,99138,3065,288,2010,2774,3957,1202,358,0,195,5193,4425,688,230,1189,1549,468,312,1520,0,120,1221,439,1163,698,10255,1375,278,176,994,15,453,1028,1360,2134,277,2641,4235,1531,455,268,1573,37,2495,30292,179,87,2055,1075,110,339,357,393]
["2011-01-01","Maine",1315833,1120364,157102,33818,634,37,325,38,829,290,2481,238,239,4304,507,177,0,675,164,275,523,158,138,0,52,4439,702,296,0,325,10,0,150,4302,694,144,2589,1439,19,483,25,471,915,234,587,42,394,1637,182,612,570,88,43,321,21,65]
["2011-01-01","Maryland",5759087,5008452,553895,153979,228,671,945,423,8595,1796,1608,6652,18492,7825,7113,1170,389,2392,1318,110,689,848,860,1526,0,3470,2077,810,1109,1469,73,0,1105,232,9627,797,9222,6686,0,3396,845,276,14158,197,2882,0,1942,3619,223,40,22089,1525,2027,353,80,779]
["2011-01-01","Massachusetts",6515057,5658768,656441,139830,1201,225,1017,167,11556,1388,9445,399,676,11396,3264,733,412,2991,640,138,969,180,977,4006,2762,0,2629,862,356,1261,596,637,163,12010,8332,199,19431,3964,61,1757,90,178,6538,10182,1621,44,371,5203,548,2246,2984,1673,911,441,0,4413]
["2011-01-01","Michigan",9766574,8340767,1242917,139158,3527,3456,3840,2054,7793,3425,1656,0,256,17712,4254,630,882,9897,7668,1709,1148,2578,955,599,1035,2861,0,2671,715,2509,84,439,1215,73,1849,508,6087,3405,159,11224,917,647,2864,385,2185,571,3106,9935,642,0,2327,1430,417,4018,841,908]
["2011-01-01","Minnesota",5277329,4505462,646176,101029,123,893,2314,951,6638,2662,74,86,367,2820,840,901,402,8209,786,6175,606,755,573,321,424,970,5164,0,549,1345,1457,1936,2682,21,631,540,2416,845,7574,1961,546,1800,870,0,447,5305,874,3062,919,177,1034,1413,92,19255,224,54]
["2011-01-01","Mississippi",2943021,2534036,332934,68511,8922,117,556,2315,4723,484,54,0,415,6152,3136,369,55,2068,611,650,66,1626,7139,0,265,1445,1610,614,0,1581,0,118,84,65,269,1075,364,483,0,991,566,74,2568,41,398,6,7683,5243,332,0,1453,286,303,1136,0,318]
["2011-01-01","Missouri",5937896,4963040,801046,149439,1395,2043,2356,6168,8386,3144,1516,0,215,4513,2964,871,560,20161,4404,4811,20884,1993,1728,291,716,463,2830,2026,1641,0,845,4860,1544,769,1114,1016,2904,3669,977,3240,6073,777,1810,359,267,361,2676,10293,1697,88,2684,2518,196,1503,1120,709]
["2011-01-01","Montana",987076,828254,122210,33553,449,1118,1971,49,3033,2856,58,365,0,291,231,32,1543,765,646,417,845,0,0,71,57,10,353,969,0,158,0,384,688,0,889,264,422,1173,360,321,96,1959,840,0,77,227,266,1329,1232,53,278,3835,14,146,2413,353]
["2011-01-01","Nebraska",1817126,1505191,253269,52070,169,721,1646,161,5124,3245,381,0,29,1105,434,275,506,1415,615,9575,3040,352,222,122,318,0,683,1455,424,1848,64,0,240,0,119,242,544,829,292,268,1255,1556,252,0,243,2999,226,5343,734,0,615,835,24,560,965,0]
["2011-01-01","Nevada",2688336,2084668,480317,110345,280,597,10142,310,40114,2714,189,184,983,2923,1731,4093,3929,1668,855,114,602,628,78,49,931,256,1663,1055,203,335,1137,32,0,0,2118,2136,1516,1333,0,1354,258,1691,570,86,165,588,96,7249,3365,0,1740,4680,0,2672,933,153]
["2011-01-01","New Hampshire",1305678,1141236,122129,37000,193,0,246,22,547,403,1617,20,68,1970,535,0,0,478,470,47,0,0,0,3080,222,15526,155,104,160,153,230,33,186,0,294,186,1471,1297,47,248,0,198,1015,608,588,86,126,605,158,2138,880,428,0,0,162,0]
["2011-01-01","New Jersey",8719952,7825661,693380,140194,189,1198,3784,57,5986,2203,1924,2100,781,12907,4268,264,256,3690,718,332,317,102,871,624,5335,4675,1889,1261,510,583,49,312,899,499,0,355,40815,2482,61,1121,773,360,19733,463,1586,0,1412,3801,256,0,4458,2454,1252,214,15,4312]
["2011-01-01","New Mexico",2055293,1753413,228218,62130,410,416,7444,682,7066,5525,0,0,212,2806,676,81,355,466,2030,0,1333,87,184,510,2277,252,908,438,556,1183,544,353,2099,114,245,0,1445,522,264,1742,234,916,492,0,145,240,899,13633,303,71,425,924,0,340,283,99]
["2011-01-01","New York",19248685,17055260,1756105,282209,1812,6124,2821,1041,25761,3724,15123,1124,3702,29344,10584,1002,434,6914,2198,928,838,2414,1495,2915,5037,14646,3936,1824,401,1417,391,579,1785,2972,41450,461,0,9336,374,5191,1425,2189,26596,1393,6947,112,2660,9151,773,3882,10800,2986,631,1878,688,10582]
["2011-01-01","North Carolina",9539412,8070238,1160510,265291,5420,3991,4286,327,15373,3919,1975,954,1135,28044,16192,1806,675,5971,3228,654,4995,1637,2936,824,10485,9053,7530,1294,1273,2638,563,1056,1048,2078,10374,1737,18321,0,189,10187,1390,1175,9450,444,20427,565,6057,6621,961,212,27302,3295,2780,2291,153,844]
["2011-01-01","North Dakota",675161,559906,79837,32510,97,393,1313,249,1356,1229,0,84,0,459,364,138,1209,571,130,208,75,0,422,50,10,369,328,12244,80,330,1227,218,845,0,183,99,264,900,0,286,59,264,652,0,1,1293,113,1862,429,0,166,404,0,1398,139,76]
["2011-01-01","Ohio",11418944,9764366,1425709,191778,1567,1637,6763,1952,9032,2690,1189,263,587,16492,4290,1044,312,7027,11588,1146,657,12744,1872,0,4982,2101,14330,1788,691,2003,101,1176,1851,1992,3936,255,8784,4572,204,0,2333,1326,14292,369,3826,34,6468,11987,691,68,5425,1979,7548,2534,1280,1607]
["2011-01-01","Oklahoma",3742698,3089041,528498,108878,591,1137,3770,6894,8233,3273,97,66,191,6056,3514,140,21,2179,2113,580,4626,1398,1934,271,432,160,1038,497,199,5781,803,1979,705,0,391,403,1858,1322,928,1608,0,917,1116,152,2015,600,1700,31595,587,0,1013,1246,44,942,1763,105]
["2011-01-01","Oregon",3828714,3128121,549332,127906,758,1935,7911,988,34214,2110,949,251,349,3384,1946,2491,6236,1350,1371,659,1263,71,0,269,453,1423,1652,1413,7,1172,1079,324,7222,427,1322,537,2056,1099,313,949,2034,0,1407,0,370,417,673,4498,3443,176,1179,21862,66,914,914,4]
["2011-01-01","Pennsylvania",12610486,11099077,1224564,234291,1332,759,2278,582,10672,2491,4150,5177,1401,19299,4627,495,236,3902,4086,1176,2323,4013,615,608,17751,6284,4406,853,1238,1761,338,582,1057,1326,36133,325,29436,11254,195,13075,283,1594,0,799,3438,142,3742,7006,1246,446,8419,3688,4631,2426,195,2723]
["2011-01-01","Rhode Island",1040022,903786,101689,26769,0,0,214,0,1949,301,2613,0,0,2230,476,0,107,373,41,82,374,211,121,228,472,7715,178,27,0,109,0,0,0,941,1224,93,2776,259,0,60,0,57,1125,0,223,0,210,207,181,621,485,262,199,2,23,293]
["2011-01-01","South Carolina",4624180,3899705,546666,157644,2999,2421,1971,1333,6592,1000,1752,841,589,15476,16355,712,55,2371,3249,1379,1885,2454,878,652,3807,730,4483,471,2163,1522,915,204,1017,372,4241,598,11317,23102,271,6327,1008,833,3523,453,0,62,3324,8623,181,91,7879,2510,1680,341,632,2166]
["2011-01-01","South Dakota",814175,688436,94655,27506,0,554,1422,659,1286,1021,0,0,0,101,69,0,186,267,285,4772,144,211,0,0,254,113,239,5342,129,354,232,1695,110,0,441,513,6,166,2060,84,40,15,57,7,529,0,0,1156,560,0,79,557,0,481,1310,0]
["2011-01-01","Tennessee",6333466,5342978,794556,170969,9326,531,1346,7393,7130,1372,150,155,307,15491,17507,179,0,8593,5645,387,1805,13884,1901,9,1135,1690,5983,445,9172,3795,43,631,883,132,1396,381,4921,9353,50,5944,3166,726,3360,14,5531,181,0,7009,200,38,6098,2852,1385,1213,131,1083]
["2011-01-01","Texas",25327104,20984855,3648260,514726,8747,6670,20073,16461,58992,19126,2927,884,2276,35777,17401,6106,4379,15064,10265,3236,12766,6616,25513,1357,9443,5035,15654,7691,6048,13473,537,3837,7793,459,7578,15225,26155,14956,809,12315,19302,3743,9107,1297,4075,1486,10788,0,5234,349,13231,15325,663,5982,2500,5225]
["2011-01-01","Utah",2769627,2295961,373984,85217,486,2151,6585,422,18237,3986,562,0,132,1643,1052,1701,7538,1447,545,290,1146,611,494,0,342,959,1099,939,143,511,1241,195,4315,34,506,1707,1937,1653,2,2584,150,2037,1496,0,309,128,549,4507,0,122,2413,4825,270,158,1058,0]
["2011-01-01","Vermont",621354,537304,60719,20463,0,580,310,0,819,529,2105,107,27,366,101,143,0,386,258,0,7,627,41,322,361,2378,335,206,0,69,0,0,15,2244,962,56,3723,250,0,383,0,124,389,401,21,0,327,185,182,0,740,156,53,137,38,19]
["2011-01-01","Virginia",7996552,6789620,889751,257130,4930,3202,4679,645,19371,4908,5376,961,6854,17773,8715,2917,434,4000,2703,1503,892,3630,2496,2855,22051,5386,7323,834,1682,2277,617,256,1717,1344,7327,1014,12455,22753,462,9570,853,3499,12009,1897,6612,908,7482,11655,1426,173,0,4615,9041,858,190,1222]
["2011-01-01","Washington",6748474,5565069,919925,208507,1821,5266,12397,756,38421,3938,1026,0,358,6094,8705,5940,10895,2062,2303,1000,2820,1271,1016,1313,1899,1580,3720,1543,1110,3307,2125,673,4925,824,2006,1569,4512,3870,189,2686,765,29168,2296,463,1519,227,2342,15491,4789,119,4233,0,157,1491,1507,1083]
["2011-01-01","West Virginia",1836614,1609110,172262,50068,221,598,50,225,1442,124,594,89,300,2949,1296,147,120,1331,210,0,0,515,326,45,7515,236,459,0,0,309,60,78,293,160,1431,0,2017,3865,0,8545,97,132,4205,284,1857,0,546,1574,114,23,5561,83,0,42,0,680]
["2011-01-01","Wisconsin",5647213,4846550,675623,109439,708,432,4045,335,6637,2592,993,219,123,4338,1745,1108,566,25521,4017,3306,418,1040,850,12,147,733,5623,17927,983,2090,143,483,663,480,378,714,2213,2120,1383,1358,118,1057,1294,368,377,590,744,1984,890,342,2573,1555,1090,0,14,728]
["2011-01-01","Wyoming",561389,462808,66648,30651,51,761,369,174,2539,6905,11,0,0,1525,46,0,2140,450,6,342,286,83,114,0,0,152,849,357,70,241,1105,1784,427,0,7,76,113,395,237,22,462,960,284,13,219,1043,69,1398,2140,4,451,1803,0,168,0,0]
["2011-01-01","Puerto Rico",3669195,3403602,238263,22649,35,378,229,0,207,0,1849,13,212,6614,247,0,13,624,784,0,38,0,0,0,70,1412,88,0,27,101,0,0,0,0,2150,51,2615,200,0,0,79,0,1978,490,3,113,224,444,0,0,1077,41,14,229,0,0]
["2010-01-01","United States",305628607,258552348,38582885,6743229,99221,94692,176768,64264,573988,140620,89360,30055,56052,427853,244992,49218,53122,277579,130170,66922,90681,92999,88131,32209,159866,144152,178207,104765,68363,148055,35870,43531,109409,38399,193972,50438,363139,207025,24450,188013,90616,100185,209810,24948,117569,27915,143135,411641,75541,18380,232002,166162,49349,111240,28186,59885]
["2010-01-01","Alabama",4729509,3987155,620465,108723,0,3013,676,1481,3827,1278,454,811,211,15062,21644,267,304,2503,3945,669,649,1967,1901,97,716,435,2334,386,7233,1373,229,169,265,0,356,650,3686,2371,169,2222,880,485,1477,0,2368,31,7409,6500,1336,0,2490,1171,41,1155,27,228]
["2010-01-01","Alaska",702974,565031,95878,36326,477,0,1354,47,3906,1930,0,0,14,2315,1251,1705,895,388,9,262,106,1440,100,574,704,107,923,530,263,0,616,215,240,316,413,421,255,698,69,156,1455,1793,126,0,121,531,477,4123,1274,353,714,2421,0,158,81,19]
["2010-01-01","Arizona",6332786,5069002,1001991,222725,416,3109,0,689,47164,7687,479,738,0,7712,4261,1966,2147,12250,2690,3008,1935,1705,2014,241,1284,1449,6354,5421,272,4567,1343,1750,10342,64,1782,4419,6618,4463,826,5225,2910,5430,5535,403,2310,1351,3061,14705,7164,664,3413,12645,595,5556,593,599]
["2010-01-01","Arkansas",2888304,2387806,412997,79127,1405,934,777,0,4457,2535,451,0,154,3578,3921,129,618,3221,722,85,3611,2540,4012,0,306,190,1506,222,2764,7320,85,394,67,0,77,0,289,1561,0,1137,8607,239,731,0,1496,243,2653,13707,361,0,494,264,0,821,443,87]
["2010-01-01","California",36907897,30790221,5413287,444749,3364,9579,33854,4172,0,15662,4631,643,3683,20362,8820,9528,5719,16482,6550,3163,3857,3394,2989,1796,10626,11969,10435,5095,2757,6921,3009,3062,27724,1614,10108,4632,20981,9593,392,8170,5708,20913,9948,526,5016,1604,4349,36582,10653,525,14232,30544,1446,6031,1336,1223]
["2010-01-01","Colorado",4988190,4042039,725413,186366,954,2225,12287,1034,26089,0,459,486,479,8849,6445,2355,839,6950,3296,2140,4308,1961,968,532,1532,2242,4587,2878,1277,1978,2042,4065,4131,791,1259,3921,4594,2940,802,2838,3464,4330,3928,192,1231,1847,1628,22253,4748,350,2739,7583,623,2499,4418,874]
["2010-01-01","Connecticut",3541146,3100742,342904,77333,896,0,664,334,4479,547,0,149,331,9207,748,182,147,3391,1074,108,0,400,0,528,1531,8510,770,934,67,42,0,0,507,1049,3475,112,20727,1345,0,1296,145,640,1955,1728,1140,0,430,1887,0,458,1735,2084,442,1092,47,2027]
["2010-01-01","Delaware",889812,764640,90001,30759,128,68,60,0,353,178,714,0,432,2362,585,0,0,612,0,0,28,163,0,294,4969,689,61,55,0,539,73,0,106,139,3678,59,4251,424,0,325,0,0,7318,149,195,0,146,178,0,0,1051,377,0,0,0,954]
["2010-01-01","District of Columbia ",596747,474676,63766,51244,360,591,662,155,4205,656,926,0,0,1100,1597,0,0,615,711,392,83,94,0,76,13503,1376,126,87,0,272,0,62,0,137,1924,61,3852,1897,98,598,0,601,2378,249,380,0,591,1180,0,199,7915,284,860,391,0,0]
["2010-01-01","Florida",18647600,15554008,2459530,482889,15830,5887,3907,3611,22130,6428,11183,3099,1110,0,35615,2021,884,17432,9030,2921,4136,6321,7232,5497,13241,13900,21359,5439,7929,7984,338,1544,7050,3645,22344,900,55011,19108,794,21047,3466,1655,19935,1982,10759,430,12882,24039,2833,1442,20080,3573,5634,8081,191,12968]
["2010-01-01","Georgia",9587237,8015409,1278548,249459,13840,3645,2554,599,8909,3224,2619,837,1708,49901,0,1040,414,9736,2649,1096,1355,6525,3645,0,5382,3910,6857,1169,2380,3072,52,148,1155,162,4151,826,12472,15361,0,9323,2070,843,6294,43,15562,557,14445,11424,380,361,8393,4495,358,3416,102,1010]
["2010-01-01","Hawaii",1346274,1140572,134315,53581,749,743,1398,0,12677,1073,307,0,0,4599,2013,0,42,715,192,68,387,95,88,89,990,1283,627,476,234,170,150,0,1925,496,443,11,1339,1510,69,625,57,1834,553,644,322,267,142,6694,467,0,2644,2705,483,1168,18,0]
["2010-01-01","Idaho",1550967,1279856,209272,55638,376,3264,3086,45,8932,1372,0,0,144,612,313,123,0,169,132,773,422,315,59,202,44,115,427,465,37,425,1509,0,2110,109,97,694,155,134,96,325,711,3202,172,0,0,296,1153,1746,8014,0,611,10876,133,233,1410,233]
["2010-01-01","Illinois",12680126,11009852,1404525,203959,1397,1764,5921,1194,16205,3850,2264,56,1047,8051,6781,1224,313,0,21918,9141,1970,2921,1419,55,1985,2811,11865,4300,1093,16703,928,546,2541,206,2331,996,8479,5504,1112,5103,1459,1224,5190,838,1565,292,3999,12245,658,260,3831,1642,812,15364,586,2055]
["2010-01-01","Indiana",6414862,5431015,833086,127353,1502,177,2210,1548,8959,1362,544,0,181,5496,1623,267,772,27950,0,1885,1582,10643,749,30,1641,103,9361,916,270,3893,164,705,227,114,1876,188,2564,2828,0,13272,681,423,2668,174,584,216,3093,6335,444,45,3673,571,669,1762,413,572]
["2010-01-01","Iowa",3013053,2553210,375650,72557,330,519,1483,247,2847,2554,114,0,53,1364,973,866,315,17016,1710,0,1520,334,315,0,134,189,1439,7564,117,6031,836,4783,623,381,472,492,273,1123,601,632,679,1071,378,0,591,1992,1617,4131,146,45,303,538,0,2705,111,149]
["2010-01-01","Kansas",2820894,2341401,372161,95059,44,1050,2238,1596,6125,6022,85,238,0,2863,1916,128,398,2943,1544,1875,0,1048,890,0,1369,100,806,1562,167,23384,289,2678,1318,76,1743,873,2390,1083,225,1509,7568,514,563,39,137,352,1152,9217,238,75,1648,1175,0,1233,573,68]
["2010-01-01","Kentucky",4296639,3638259,519887,118443,2161,3017,2598,558,3779,329,698,38,147,10119,6397,520,71,4659,11906,656,1109,0,437,0,1395,1036,4672,930,1442,3153,0,858,76,0,1147,122,2057,3758,0,15598,1153,181,2618,289,1286,163,11153,5758,905,525,3671,716,2297,1993,292,179]
["2010-01-01","Louisiana",4483529,3826390,547291,97889,5740,1504,1960,2382,5751,1215,89,0,264,9394,5766,342,202,2131,948,625,706,1656,0,162,963,995,1301,569,7032,2852,40,119,1552,462,171,294,2161,1443,438,1100,1074,281,1350,0,1130,0,1853,26134,473,0,1278,1509,210,237,31,402]
["2010-01-01","Maine",1313902,1136780,146735,27758,402,424,254,67,1066,478,1361,174,55,3025,844,62,0,311,259,337,56,484,115,0,243,3521,122,91,0,201,275,204,345,4058,902,234,2339,1001,55,315,124,0,375,379,148,0,249,458,390,420,654,381,0,0,500,204]
["2010-01-01","Maryland",5716785,4917637,588879,164484,1641,2672,1124,273,8206,2501,1603,8340,23202,6564,3454,422,357,3300,431,160,781,396,1376,53,0,1983,3572,820,403,1147,86,54,979,1369,9058,238,10736,5787,0,3277,607,723,13467,782,1710,49,2669,5883,655,350,24765,1542,4363,324,230,612]
["2010-01-01","Massachusetts",6489250,5583650,706624,140162,583,1891,1572,206,14971,1051,13270,131,1539,11118,1409,682,79,2842,1891,307,0,340,0,4666,3660,0,1624,2185,453,1957,388,46,792,9911,4709,161,20002,2798,0,2163,158,228,5316,6965,1659,0,918,7073,207,1526,4542,1627,0,546,0,3085]
["2010-01-01","Michigan",9762127,8310098,1291901,116149,2403,1040,3197,636,6726,2031,277,167,471,11646,3913,313,66,10651,7816,758,640,2353,1342,645,620,1206,0,1275,656,2921,312,213,1874,437,1676,669,3135,2444,53,9783,2276,537,3134,653,1446,706,4453,7184,545,45,2073,1427,446,6291,568,1432]
["2010-01-01","Minnesota",5244256,4480630,647946,89872,266,1169,4165,279,6233,2521,211,176,306,2575,1776,227,231,6641,1120,4948,1067,402,519,172,1259,1092,2631,0,196,1549,1020,734,540,183,513,151,1309,1673,7316,1035,284,738,730,123,1597,3237,1155,2619,1013,0,2371,1328,200,17929,343,39]
["2010-01-01","Mississippi",2931228,2510729,340266,72321,8306,1192,187,4941,3000,1167,71,0,0,4814,4014,276,121,3030,1403,114,330,407,7390,0,649,107,2495,863,0,959,314,0,408,0,403,633,1026,2227,0,1312,663,0,750,145,1860,56,8158,5755,232,0,572,508,94,879,490,814]
["2010-01-01","Missouri",5920858,4968921,786726,145226,819,1051,2988,4381,9840,1903,243,314,478,8317,2492,380,830,21277,3351,4708,23427,2552,2238,171,1359,1395,2610,1701,1183,0,220,2636,1060,108,1320,150,2630,1825,848,2163,4647,314,1639,0,954,512,3311,12884,1319,498,3206,1107,177,1331,359,867]
["2010-01-01","Montana",978507,821709,117752,35630,212,650,1909,672,5756,2185,128,71,0,1373,46,0,1458,1094,251,169,60,321,85,76,51,59,648,1323,242,564,0,340,548,0,0,660,246,1072,1677,89,182,1620,419,0,110,295,111,2101,964,0,497,3250,0,357,1689,11]
["2010-01-01","Nebraska",1802697,1497138,247005,51290,232,35,2322,674,4430,4182,361,177,0,1775,1202,257,127,1820,639,5536,2484,153,89,0,77,100,726,2254,823,2723,112,0,232,0,143,831,111,442,777,1232,702,506,345,0,65,2936,77,4445,537,0,772,1230,73,1046,1478,0]
["2010-01-01","Nevada",2667364,2030410,517261,102677,150,511,7818,530,35472,2935,648,0,0,3579,1187,4363,1686,1711,739,543,453,569,733,0,485,1275,2202,805,946,1747,770,1129,0,59,1528,1220,1204,957,37,1554,886,2629,1567,167,312,1203,706,5224,4500,197,1832,3290,56,419,144,502]
["2010-01-01","New Hampshire",1303865,1118359,141213,39367,152,0,544,0,1692,240,3134,0,298,1659,0,51,66,850,23,109,57,0,19,3242,49,13752,230,240,25,295,486,0,95,0,540,276,2462,471,0,28,0,508,674,988,51,0,372,1570,279,2566,745,261,0,268,0,56]
["2010-01-01","New Jersey",8709933,7841470,684482,127369,616,383,1625,258,8777,807,2503,1543,431,9841,4588,385,91,2656,402,332,442,91,249,95,4231,2626,1070,322,450,727,122,261,874,705,0,421,41374,3052,0,1584,32,613,22225,332,1134,0,852,3434,178,57,2670,964,358,586,0,2732]
["2010-01-01","New Mexico",2039549,1735950,220663,73605,751,969,6117,77,6547,2852,25,391,56,3259,1977,122,755,526,465,0,751,739,65,94,1968,2076,1460,179,719,138,1003,530,4192,79,160,0,784,1793,79,1712,1182,1659,809,46,152,204,1269,18511,1601,309,290,3004,0,407,752,632]
["2010-01-01","New York",19171916,16976205,1779540,269427,1310,5070,2649,362,25177,3135,15338,2603,1983,30553,7676,259,198,6533,2497,477,1189,804,1321,2270,5912,16855,4779,1649,872,1870,237,886,2077,2636,35333,829,0,13322,0,6510,2298,2284,20514,1913,7161,521,1730,9692,910,2900,8881,2503,444,2354,151,6740]
["2010-01-01","North Carolina",9443000,7982017,1141001,263256,3044,1618,2847,550,16699,1842,3752,479,1691,28983,15943,1567,724,5657,4132,1077,2192,4419,2180,2259,9881,4052,5789,1839,1187,1932,230,516,698,2130,7195,1186,19406,0,243,8661,1453,1796,11155,97,23196,362,8685,14329,790,350,25662,2874,3025,2012,870,1950]
["2010-01-01","North Dakota",665654,556222,75720,30100,109,1066,662,168,1411,873,30,0,175,492,799,53,69,39,45,289,114,97,374,0,121,52,298,12350,0,197,1236,328,382,0,144,380,188,637,0,134,108,313,392,0,0,1038,273,2513,462,0,25,696,0,749,219,0]
["2010-01-01","Ohio",11405101,9745227,1453401,172633,1289,1556,4715,434,8997,2859,1307,15,972,16495,9502,436,564,7092,9438,1270,1016,9159,743,291,3828,3686,15130,2298,89,1171,460,1531,2240,175,2465,515,5988,5985,26,0,1228,342,12012,444,2479,207,4987,7465,485,182,6769,2567,7814,1771,144,2140]
["2010-01-01","Oklahoma",3716264,3065497,528824,106511,1612,1397,2759,5873,9429,3184,68,109,0,5438,3159,773,611,2679,957,1108,5024,877,2208,298,382,465,1047,599,1733,4102,448,829,1079,69,890,2723,1118,1991,139,1385,0,398,1316,119,596,83,1872,28238,428,93,2286,2035,221,551,1713,209]
["2010-01-01","Oregon",3794008,3110896,545841,116700,400,2027,5264,246,34190,2050,270,0,217,2273,688,2323,4129,1565,317,161,678,0,0,0,595,1471,1159,668,735,1786,3386,777,2805,317,544,981,2538,1040,592,1541,821,0,1689,0,989,741,787,3826,2879,456,1124,22793,358,1981,523,821]
["2010-01-01","Pennsylvania",12577555,11053022,1239199,235580,369,2185,3668,807,12077,3657,4007,4608,1621,18212,4644,332,380,4490,2018,227,1426,1675,625,1621,18281,4455,4961,1491,563,1725,339,551,1810,729,42456,1250,30481,7611,521,14545,1254,918,0,377,1315,966,1611,7778,1048,215,10558,2495,4258,1300,1069,6275]
["2010-01-01","Rhode Island",1042240,900283,99603,32059,136,0,324,0,1697,59,4090,0,146,1336,382,274,0,1210,206,48,0,0,0,447,977,8639,77,47,0,47,0,0,297,333,1868,0,4583,1376,62,0,199,0,560,0,61,48,71,678,0,72,1399,160,150,0,0,276]
["2010-01-01","South Carolina",4577399,3870879,537961,152441,1741,1670,1457,365,4691,1867,3998,249,38,16060,17486,813,233,4253,2174,703,514,2211,2059,603,5184,3765,3709,818,1175,1371,0,0,1173,486,4908,1390,7912,20749,118,3883,1458,1020,4689,154,0,95,3816,4965,455,478,9786,3070,1190,1057,382,269]
["2010-01-01","South Dakota",805616,680993,96805,25777,325,25,745,61,1338,807,0,0,0,251,24,75,457,80,439,3520,571,82,129,0,0,407,144,4615,201,252,560,2260,38,0,0,38,758,262,2020,160,296,122,209,0,0,0,0,1334,0,0,224,1564,0,736,648,0]
["2010-01-01","Tennessee",6282706,5299496,801355,159778,8897,343,2291,4736,8019,1858,765,248,394,14168,11065,243,333,3162,4764,1052,2506,11188,2602,84,1450,1733,5529,1504,9029,4342,290,187,2433,197,2230,621,4800,7102,0,4462,669,430,2562,805,4765,63,0,8701,2062,0,8650,1412,2201,2831,0,0]
["2010-01-01","Texas",24899075,20500156,3740344,486558,8636,11613,16521,15251,68959,16361,924,704,460,26668,16671,3718,2033,20169,6985,3946,11598,5153,31149,1318,4724,7139,13775,6088,7773,12061,1027,4893,8324,1067,7058,11752,16624,12183,2452,8317,22969,4373,7161,975,5249,1936,13044,0,4123,52,13713,8847,2221,5927,1874,4180]
["2010-01-01","Utah",2724064,2240636,388410,77780,93,1798,8147,316,12187,3987,119,0,138,2097,966,932,7692,1831,517,483,299,235,46,148,426,246,261,914,127,1255,1929,118,4549,0,247,518,1462,1167,0,1527,886,2525,557,0,838,875,459,5305,0,297,3005,3792,0,338,2126,383]
["2010-01-01","Vermont",619363,534975,59032,22529,0,184,65,0,1001,326,1287,87,9,2063,496,49,0,370,0,91,0,176,0,824,300,3599,201,85,0,51,236,0,58,2760,751,0,4056,539,30,50,0,100,524,227,134,153,125,565,0,0,400,128,0,377,52,0]
["2010-01-01","Virginia",7930773,6752310,870491,259507,2671,3296,3807,1233,17088,3229,2468,1265,10593,18165,11927,2347,1159,7576,2892,1135,2103,2051,2148,1494,24822,4104,5733,462,1858,4262,866,523,748,372,6825,1098,17525,23829,201,7708,781,2137,11796,1543,8339,98,5842,12938,1551,676,0,4373,6779,2648,423,1306]
["2010-01-01","Washington",6661321,5464985,946923,191784,1322,5644,5971,658,39468,4883,642,202,243,5378,3107,4246,12661,3931,1912,1685,1694,886,1011,717,629,1448,2871,1323,737,3727,5094,323,5310,282,721,1012,4140,2143,515,2727,1986,26235,2893,220,3047,866,789,11338,4020,981,7266,0,62,2180,638,0]
["2010-01-01","West Virginia",1833535,1625125,166168,39609,41,1326,0,0,760,608,84,556,480,1842,485,0,88,356,366,0,161,851,60,0,4249,191,657,0,44,160,39,0,25,107,906,0,611,2552,268,7925,229,0,4908,238,647,0,1160,968,112,208,4999,192,0,150,0,182]
["2010-01-01","Wisconsin",5623196,4824045,691592,93065,552,798,1854,518,4506,1890,359,351,98,4492,1656,550,902,20299,2563,2300,752,287,331,448,1088,992,6317,16741,810,1716,154,853,1049,69,632,123,1291,1817,497,1674,89,1444,2211,0,1142,235,856,3039,476,75,771,1013,256,0,129,521]
["2010-01-01","Wyoming",556954,444614,82255,28046,172,0,1511,0,2784,4390,0,0,0,396,745,25,942,415,132,462,532,519,107,0,51,252,570,218,0,421,2528,1711,416,0,0,707,146,34,233,56,62,14,95,0,220,258,495,1990,3226,75,580,556,0,0,0,0]
["2010-01-01","Puerto Rico",3676493,3392179,247593,31732,629,156,288,0,1177,388,899,0,0,11262,207,0,0,1642,109,0,112,254,109,0,59,2004,89,50,170,221,0,0,0,0,1244,364,4768,146,0,69,0,0,1516,684,109,0,30,977,882,0,392,0,141,585,0,0]

{"sheet":"Calc","index":2,"n_rows":54,"n_cols":69,"rows_kept":54,"cut":false,"hidden":false,"merged":[]}
["StartYear",2010,null,"ListStates",null,"ListReports",null,"ListState1Pivots","MigrationPivots",null,"ListState1Charts","State1BarCharts","State1MigrationCharts",null,"ListPivotFields",null,"FilterSettings"]
["EndYear",2012,null,"United States",null,"Population",null,"pvtState1Population","pvtStateMigration",null,"chrtState1Population","chrtState1PopulationBar","chrtState1Migration",null,"State of Residence",null,"Pivot Table","State","Start Date","End Date"]
["StartDate",{"$f":"DATE(StartYear,1,1)","v":"2010-01-01"},null,"Alabama",null,"State Migration",null,"pvtState1SameResidence","pvtStateMigration",null,"chrtState1SameResidence","chrtState1SameResidenceBar","chrtState1Migration",null,null,null,"pvtState1Population","United States","2010-01-01","2012-01-01"]
["EndDate",{"$f":"DATE(EndYear,1,1)","v":"2012-01-01"},null,"Alaska",null,null,null,"pvtState1ChangedResidence","pvtStateMigration",null,"chrtState1ChangedResidence","chrtState1ChangedResidenceBar","chrtState1Migration",null,null,null,"pvtState1SameResidence","Arizona","2010-01-01","2012-01-01"]
["MinDate",{"$f":"MIN(CensusData[Year])","v":"2010-01-01"},null,"Arizona",null,null,null,null,null,null,null,null,null,null,null,null,"pvtState1ChangedResidence","Arizona","2010-01-01","2011-01-01"]
["MaxDate",{"$f":"MAX(CensusData[Year])","v":"2012-01-01"},null,"Arkansas",null,null,null,null,null,null,null,null,null,null,null,null,"pvtState2Population","Oregon","2010-01-01","2012-01-01"]
["ComboDate",{"$f":"StartYear&\" - \"&EndYear","v":"2010 - 2012"},null,"California",null,null,null,null,null,null,null,null,null,null,null,null,"pvtState2SameResidence","Pennsylvania","2010-01-01","2012-01-01"]
["Report",1,null,"Colorado",null,null,null,null,null,null,null,null,null,null,null,null,"pvtState2ChangedResidence","Pennsylvania","2010-01-01","2012-01-01"]
["ReportName",{"$f":"INDEX(ListReports[ListReports],Report,1)","v":"Population"},null,"Connecticut",null,null,null,null,null,null,null,null,null,null,null,null,"pvtStateMigration",null,"2010-01-01","2012-01-01"]
["PivotFieldName",{"$f":"INDEX(ListPivotFields[ListPivotFields],Report,1)","v":"State of Residence"},null,"Delaware"]
["State",1,null,"District of Columbia ",null,null,null,"ListState2Pivots","MigrationPivots",null,"ListState2Charts","State2BarCharts","State2MigrationCharts"]
["StateName",{"$f":"INDEX(ListStates[ListStates],State,1)","v":"United States"},null,"Florida",null,null,null,"pvtState2Population","pvtStateMigration",null,"chrtState2Population","chrtState2PopulationBar","chrtState2Migration",null,null,null,"State1Stats"]
["State2",39,null,"Georgia",null,null,null,"pvtState2SameResidence","pvtStateMigration",null,"chrtState2SameResidence","chrtState2SameResidenceBar","chrtState2Migration",null,null,null,"State","Avg Population","Population Growth","Same Residence","Same Residence Growth","Changed Residence","Changed Residence Growth","Same Residence Percentage","Changed Residence Percentage"]
["StateName2",{"$f":"INDEX(ListStates[],State2,1)","v":"Oregon"},null,"Hawaii",null,null,null,"pvtState2ChangedResidence","pvtStateMigration",null,"chrtState2ChangedResidence","chrtState2ChangedResidenceBar","chrtState2Migration",null,null,null,{"$f":"StateName","v":"United States"},{"$f":"AVERAGEIFS(CensusData[Population],CensusData[State of Residence],[State],CensusData[Year],\">=\"&StartDate,CensusData[Year],\"<=\"&EndDate)","v":307913893.66666669},{"$f":"SUMIFS(CensusData[Population],CensusData[State of Residence],[State],CensusData[Year],EndDate)-SUMIFS(CensusData[Population],CensusData[State of Residence],[State],CensusData[Year],StartDate)","v":4584148},{"$f":"AVERAGEIFS(CensusData[Same Residence Last Yr],CensusData[State of Residence],[State],CensusData[Year],\">=\"&StartDate,CensusData[Year],\"<=\"&EndDate)","v":261084289.66666666},{"$f":"SUMIFS(CensusData[Same Residence Last Yr],CensusData[State of Residence],[State],CensusData[Year],EndDate)-SUMIFS(CensusData[Same Residence Last Yr],CensusData[State of Residence],[State],CensusData[Year],StartDate)","v":5060248},{"$f":"AVERAGEIFS(CensusData[Changed Residence Last Yr],CensusData[State of Residence],[State],CensusData[Year],\">=\"&StartDate,CensusData[Year],\"<=\"&EndDate)","v":38092727.666666664},{"$f":"SUMIFS(CensusData[Changed Residence Last Yr],CensusData[State of Residence],[State],CensusData[Year],EndDate)-SUMIFS(CensusData[Changed Residence Last Yr],CensusData[State of Residence],[State],CensusData[Year],StartDate)","v":-886288},{"$f":"[Same Residence]/[Avg Population]","v":0.84791331289943161},{"$f":"[Changed Residence]/[Avg Population]","v":0.12371227297688647}]
["ChartOffset",{"$f":"IF(Report=2,1,IF(EndYear-StartYear=0,1,0))","v":0},null,"Idaho"]
["State1Pivot",1,null,"Illinois",null,null,null,null,null,null,null,null,null,null,null,null,"State2Stats"]
["State1PivotName",{"$f":"INDEX(ListState1Pivots[],State1Pivot,Report)","v":"pvtState1Population"},null,"Indiana",null,null,null,null,null,null,null,null,null,null,null,null,"State","Avg Population","Population Growth","Same Residence","Same Residence Growth","Changed Residence","Changed Residence Growth","Same Residence Percentage","Changed Residence Percentage"]
["State1ChartName",{"$f":"INDEX(ListState1Charts[],State1Pivot,Report+ChartOffset)","v":"chrtState1Population"},null,"Iowa",null,null,null,null,null,null,null,null,null,null,null,null,{"$f":"StateName2","v":"Oregon"},{"$f":"AVERAGEIFS(CensusData[Population],CensusData[State of Residence],[State],CensusData[Year],\">=\"&StartDate,CensusData[Year],\"<=\"&EndDate)","v":3826729},{"$f":"SUMIFS(CensusData[Population],CensusData[State of Residence],[State],CensusData[Year],EndDate)-SUMIFS(CensusData[Population],CensusData[State of Residence],[State],CensusData[Year],StartDate)","v":63457},{"$f":"AVERAGEIFS(CensusData[Same Residence Last Yr],CensusData[State of Residence],[State],CensusData[Year],\">=\"&StartDate,CensusData[Year],\"<=\"&EndDate)","v":3132489},{"$f":"SUMIFS(CensusData[Same Residence Last Yr],CensusData[State of Residence],[State],CensusData[Year],EndDate)-SUMIFS(CensusData[Same Residence Last Yr],CensusData[State of Residence],[State],CensusData[Year],StartDate)","v":47554},{"$f":"AVERAGEIFS(CensusData[Changed Residence Last Yr],CensusData[State of Residence],[State],CensusData[Year],\">=\"&StartDate,CensusData[Year],\"<=\"&EndDate)","v":551948.66666666663},{"$f":"SUMIFS(CensusData[Changed Residence Last Yr],CensusData[State of Residence],[State],CensusData[Year],EndDate)-SUMIFS(CensusData[Changed Residence Last Yr],CensusData[State of Residence],[State],CensusData[Year],StartDate)","v":14832},{"$f":"[Same Residence]/[Avg Population]","v":0.81858135237692553},{"$f":"[Changed Residence]/[Avg Population]","v":0.14423510697168956}]
["State1ChartLabel",{"$f":"CHOOSE(State1Pivot,\"Average Population\",\"No Change in Residence\",\"Changed Residence\")","v":"Average Population"},null,"Kansas"]
["State2Pivot",1,null,"Kentucky"]
["State2PivotName",{"$f":"INDEX(ListState2Pivots[],State2Pivot,Report)","v":"pvtState2Population"},null,"Louisiana",null,null,null,null,null,null,null,null,null,null,null,null,"State1Migration"]
["State2ChartName",{"$f":"INDEX(ListState2Charts[],State2Pivot,Report+ChartOffset)","v":"chrtState2Population"},null,"Maine",null,null,null,null,null,null,null,null,null,null,null,null,"State","Alabama ","Alaska ","Arizona ","Arkansas ","California ","Colorado ","Connecticut ","Delaware ","District of Columbia ","Florida ","Georgia ","Hawaii ","Idaho ","Illinois ","Indiana ","Iowa ","Kansas ","Kentucky ","Louisiana ","Maine ","Maryland ","Massachusetts ","Michigan ","Minnesota ","Mississippi ","Missouri ","Montana ","Nebraska ","Nevada ","New Hampshire ","New Jersey ","New Mexico ","New York ","North Carolina ","North Dakota ","Ohio ","Oklahoma ","Oregon ","Pennsylvania ","Rhode Island ","South Carolina ","South Dakota ","Tennessee ","Texas ","Utah ","Vermont ","Virginia ","Washington ","West Virginia ","Wisconsin ","Wyoming ","Puerto Rico "]
["State2ChartLabel",{"$f":"CHOOSE(State2Pivot,\"Average Population\",\"No Change in Residence\",\"Changed Residence\")","v":"Average Population"},null,"Maryland",null,null,null,null,null,null,null,null,null,null,null,null,{"$f":"StateName","v":"United States"},{"$f":"GETPIVOTDATA(R22&\"\",Pivots!$BE$3,\"State of Residence\",StateName)","v":105079},{"$f":"GETPIVOTDATA(S22&\"\",Pivots!$BE$3,\"State of Residence\",StateName)","v":89203.333333333328},{"$f":"GETPIVOTDATA(T22&\"\",Pivots!$BE$3,\"State of Residence\",StateName)","v":198475.33333333334},{"$f":"GETPIVOTDATA(U22&\"\",Pivots!$BE$3,\"State of Residence\",StateName)","v":68819},{"$f":"GETPIVOTDATA(V22&\"\",Pivots!$BE$3,\"State of Residence\",StateName)","v":567772.33333333337},{"$f":"GETPIVOTDATA(W22&\"\",Pivots!$BE$3,\"State of Residence\",StateName)","v":154257.66666666666},{"$f":"GETPIVOTDATA(X22&\"\",Pivots!$BE$3,\"State of Residence\",StateName)","v":89226},{"$f":"GETPIVOTDATA(Y22&\"\",Pivots!$BE$3,\"State of Residence\",StateName)","v":27278.333333333332},{"$f":"GETPIVOTDATA(Z22&\"\",Pivots!$BE$3,\"State of Residence\",StateName)","v":55099},{"$f":"GETPIVOTDATA(AA22&\"\",Pivots!$BE$3,\"State of Residence\",StateName)","v":431126.66666666669},{"$f":"GETPIVOTDATA(AB22&\"\",Pivots!$BE$3,\"State of Residence\",StateName)","v":248715.33333333334},{"$f":"GETPIVOTDATA(AC22&\"\",Pivots!$BE$3,\"State of Residence\",StateName)","v":57555.666666666664},{"$f":"GETPIVOTDATA(AD22&\"\",Pivots!$BE$3,\"State of Residence\",StateName)","v":55381.333333333336},{"$f":"GETPIVOTDATA(AE22&\"\",Pivots!$BE$3,\"State of Residence\",StateName)","v":274846.66666666669},{"$f":"GETPIVOTDATA(AF22&\"\",Pivots!$BE$3,\"State of Residence\",StateName)","v":139331.66666666666},{"$f":"GETPIVOTDATA(AG22&\"\",Pivots!$BE$3,\"State of Residence\",StateName)","v":71587.666666666672},{"$f":"GETPIVOTDATA(AH22&\"\",Pivots!$BE$3,\"State of Residence\",StateName)","v":92665},{"$f":"GETPIVOTDATA(AI22&\"\",Pivots!$BE$3,\"State of Residence\",StateName)","v":98419.666666666672},{"$f":"GETPIVOTDATA(AJ22&\"\",Pivots!$BE$3,\"State of Residence\",StateName)","v":90226.666666666672},{"$f":"GETPIVOTDATA(AK22&\"\",Pivots!$BE$3,\"State of Residence\",StateName)","v":34837.333333333336},{"$f":"GETPIVOTDATA(AL22&\"\",Pivots!$BE$3,\"State of Residence\",StateName)","v":160857},{"$f":"GETPIVOTDATA(AM22&\"\",Pivots!$BE$3,\"State of Residence\",StateName)","v":149392.33333333334},{"$f":"GETPIVOTDATA(AN22&\"\",Pivots!$BE$3,\"State of Residence\",StateName)","v":180148.33333333334},{"$f":"GETPIVOTDATA(AO22&\"\",Pivots!$BE$3,\"State of Residence\",StateName)","v":107988},{"$f":"GETPIVOTDATA(AP22&\"\",Pivots!$BE$3,\"State of Residence\",StateName)","v":67969},{"$f":"GETPIVOTDATA(AQ22&\"\",Pivots!$BE$3,\"State of Residence\",StateName)","v":143071},{"$f":"GETPIVOTDATA(AR22&\"\",Pivots!$BE$3,\"State of Residence\",StateName)","v":33635.333333333336},{"$f":"GETPIVOTDATA(AS22&\"\",Pivots!$BE$3,\"State of Residence\",StateName)","v":48385.333333333336},{"$f":"GETPIVOTDATA(AT22&\"\",Pivots!$BE$3,\"State of Residence\",StateName)","v":108078},{"$f":"GETPIVOTDATA(AU22&\"\",Pivots!$BE$3,\"State of Residence\",StateName)","v":40124},{"$f":"GETPIVOTDATA(AV22&\"\",Pivots!$BE$3,\"State of Residence\",StateName)","v":209847.66666666666},{"$f":"GETPIVOTDATA(AW22&\"\",Pivots!$BE$3,\"State of Residence\",StateName)","v":58596.666666666664},{"$f":"GETPIVOTDATA(AX22&\"\",Pivots!$BE$3,\"State of Residence\",StateName)","v":382267.66666666669},{"$f":"GETPIVOTDATA(AY22&\"\",Pivots!$BE$3,\"State of Residence\",StateName)","v":223611.66666666666},{"$f":"GETPIVOTDATA(AZ22&\"\",Pivots!$BE$3,\"State of Residence\",StateName)","v":24990.666666666668},{"$f":"GETPIVOTDATA(BA22&\"\",Pivots!$BE$3,\"State of Residence\",StateName)","v":197754.66666666666},{"$f":"GETPIVOTDATA(BB22&\"\",Pivots!$BE$3,\"State of Residence\",StateName)","v":91399},{"$f":"GETPIVOTDATA(BC22&\"\",Pivots!$BE$3,\"State of Residence\",StateName)","v":106054},{"$f":"GETPIVOTDATA(BD22&\"\",Pivots!$BE$3,\"State of Residence\",StateName)","v":220697.66666666666},{"$f":"GETPIVOTDATA(BE22&\"\",Pivots!$BE$3,\"State of Residence\",StateName)","v":28837},{"$f":"GETPIVOTDATA(BF22&\"\",Pivots!$BE$3,\"State of Residence\",StateName)","v":122137.66666666667},{"$f":"GETPIVOTDATA(BG22&\"\",Pivots!$BE$3,\"State of Residence\",StateName)","v":26610.666666666668},{"$f":"GETPIVOTDATA(BH22&\"\",Pivots!$BE$3,\"State of Residence\",StateName)","v":153740.33333333334},{"$f":"GETPIVOTDATA(BI22&\"\",Pivots!$BE$3,\"State of Residence\",StateName)","v":406222.33333333331},{"$f":"GETPIVOTDATA(BJ22&\"\",Pivots!$BE$3,\"State of Residence\",StateName)","v":76972.333333333328},{"$f":"GETPIVOTDATA(BK22&\"\",Pivots!$BE$3,\"State of Residence\",StateName)","v":18869.333333333332},{"$f":"GETPIVOTDATA(BL22&\"\",Pivots!$BE$3,\"State of Residence\",StateName)","v":233256.33333333334},{"$f":"GETPIVOTDATA(BM22&\"\",Pivots!$BE$3,\"State of Residence\",StateName)","v":179089.33333333334},{"$f":"GETPIVOTDATA(BN22&\"\",Pivots!$BE$3,\"State of Residence\",StateName)","v":47576.666666666664},{"$f":"GETPIVOTDATA(BO22&\"\",Pivots!$BE$3,\"State of Residence\",StateName)","v":104778},{"$f":"GETPIVOTDATA(BP22&\"\",Pivots!$BE$3,\"State of Residence\",StateName)","v":30801.666666666668},{"$f":"GETPIVOTDATA(BQ22&\"\",Pivots!$BE$3,\"State of Residence\",StateName)","v":70201}]
[null,null,null,"Massachusetts"]
[null,null,null,"Michigan",null,null,null,null,null,null,null,null,null,null,null,null,"State2Migration"]
[null,null,null,"Minnesota",null,null,null,null,null,null,null,null,null,null,null,null,"State","Alabama ","Alaska ","Arizona ","Arkansas ","California ","Colorado ","Connecticut ","Delaware ","District of Columbia ","Florida ","Georgia ","Hawaii ","Idaho ","Illinois ","Indiana ","Iowa ","Kansas ","Kentucky ","Louisiana ","Maine ","Maryland ","Massachusetts ","Michigan ","Minnesota ","Mississippi ","Missouri ","Montana ","Nebraska ","Nevada ","New Hampshire ","New Jersey ","New Mexico ","New York ","North Carolina ","North Dakota ","Ohio ","Oklahoma ","Oregon ","Pennsylvania ","Rhode Island ","South Carolina ","South Dakota ","Tennessee ","Texas ","Utah ","Vermont ","Virginia ","Washington ","West Virginia ","Wisconsin ","Wyoming ","Puerto Rico "]
[null,null,null,"Mississippi",null,null,null,null,null,null,null,null,null,null,null,null,{"$f":"StateName2","v":"Oregon"},{"$f":"GETPIVOTDATA(R26&\"\",Pivots!$BE$3,\"State of Residence\",StateName2)","v":510.33333333333331},{"$f":"GETPIVOTDATA(S26&\"\",Pivots!$BE$3,\"State of Residence\",StateName2)","v":2158.3333333333335},{"$f":"GETPIVOTDATA(T26&\"\",Pivots!$BE$3,\"State of Residence\",StateName2)","v":7043},{"$f":"GETPIVOTDATA(U26&\"\",Pivots!$BE$3,\"State of Residence\",StateName2)","v":466.33333333333331},{"$f":"GETPIVOTDATA(V26&\"\",Pivots!$BE$3,\"State of Residence\",StateName2)","v":33422},{"$f":"GETPIVOTDATA(W26&\"\",Pivots!$BE$3,\"State of Residence\",StateName2)","v":2877.3333333333335},{"$f":"GETPIVOTDATA(X26&\"\",Pivots!$BE$3,\"State of Residence\",StateName2)","v":533.33333333333337},{"$f":"GETPIVOTDATA(Y26&\"\",Pivots!$BE$3,\"State of Residence\",StateName2)","v":83.666666666666671},{"$f":"GETPIVOTDATA(Z26&\"\",Pivots!$BE$3,\"State of Residence\",StateName2)","v":420.66666666666669},{"$f":"GETPIVOTDATA(AA26&\"\",Pivots!$BE$3,\"State of Residence\",StateName2)","v":2439},{"$f":"GETPIVOTDATA(AB26&\"\",Pivots!$BE$3,\"State of Residence\",StateName2)","v":1222},{"$f":"GETPIVOTDATA(AC26&\"\",Pivots!$BE$3,\"State of Residence\",StateName2)","v":2438.3333333333335},{"$f":"GETPIVOTDATA(AD26&\"\",Pivots!$BE$3,\"State of Residence\",StateName2)","v":5152.666666666667},{"$f":"GETPIVOTDATA(AE26&\"\",Pivots!$BE$3,\"State of Residence\",StateName2)","v":1530.3333333333333},{"$f":"GETPIVOTDATA(AF26&\"\",Pivots!$BE$3,\"State of Residence\",StateName2)","v":1022.6666666666666},{"$f":"GETPIVOTDATA(AG26&\"\",Pivots!$BE$3,\"State of Residence\",StateName2)","v":551.33333333333337},{"$f":"GETPIVOTDATA(AH26&\"\",Pivots!$BE$3,\"State of Residence\",StateName2)","v":832.33333333333337},{"$f":"GETPIVOTDATA(AI26&\"\",Pivots!$BE$3,\"State of Residence\",StateName2)","v":91},{"$f":"GETPIVOTDATA(AJ26&\"\",Pivots!$BE$3,\"State of Residence\",StateName2)","v":75.666666666666671},{"$f":"GETPIVOTDATA(AK26&\"\",Pivots!$BE$3,\"State of Residence\",StateName2)","v":238.33333333333334},{"$f":"GETPIVOTDATA(AL26&\"\",Pivots!$BE$3,\"State of Residence\",StateName2)","v":501.66666666666669},{"$f":"GETPIVOTDATA(AM26&\"\",Pivots!$BE$3,\"State of Residence\",StateName2)","v":1218},{"$f":"GETPIVOTDATA(AN26&\"\",Pivots!$BE$3,\"State of Residence\",StateName2)","v":1127},{"$f":"GETPIVOTDATA(AO26&\"\",Pivots!$BE$3,\"State of Residence\",StateName2)","v":1291},{"$f":"GETPIVOTDATA(AP26&\"\",Pivots!$BE$3,\"State of Residence\",StateName2)","v":309.33333333333331},{"$f":"GETPIVOTDATA(AQ26&\"\",Pivots!$BE$3,\"State of Residence\",StateName2)","v":1120.3333333333333},{"$f":"GETPIVOTDATA(AR26&\"\",Pivots!$BE$3,\"State of Residence\",StateName2)","v":2219},{"$f":"GETPIVOTDATA(AS26&\"\",Pivots!$BE$3,\"State of Residence\",StateName2)","v":557},{"$f":"GETPIVOTDATA(AT26&\"\",Pivots!$BE$3,\"State of Residence\",StateName2)","v":5320.666666666667},{"$f":"GETPIVOTDATA(AU26&\"\",Pivots!$BE$3,\"State of Residence\",StateName2)","v":261},{"$f":"GETPIVOTDATA(AV26&\"\",Pivots!$BE$3,\"State of Residence\",StateName2)","v":750.33333333333337},{"$f":"GETPIVOTDATA(AW26&\"\",Pivots!$BE$3,\"State of Residence\",StateName2)","v":812.66666666666663},{"$f":"GETPIVOTDATA(AX26&\"\",Pivots!$BE$3,\"State of Residence\",StateName2)","v":2324.3333333333335},{"$f":"GETPIVOTDATA(AY26&\"\",Pivots!$BE$3,\"State of Residence\",StateName2)","v":1207},{"$f":"GETPIVOTDATA(AZ26&\"\",Pivots!$BE$3,\"State of Residence\",StateName2)","v":315.66666666666669},{"$f":"GETPIVOTDATA(BA26&\"\",Pivots!$BE$3,\"State of Residence\",StateName2)","v":1300.3333333333333},{"$f":"GETPIVOTDATA(BB26&\"\",Pivots!$BE$3,\"State of Residence\",StateName2)","v":1193.3333333333333},{"$f":"GETPIVOTDATA(BC26&\"\",Pivots!$BE$3,\"State of Residence\",StateName2)","v":0},{"$f":"GETPIVOTDATA(BD26&\"\",Pivots!$BE$3,\"State of Residence\",StateName2)","v":1333.3333333333333},{"$f":"GETPIVOTDATA(BE26&\"\",Pivots!$BE$3,\"State of Residence\",StateName2)","v":59},{"$f":"GETPIVOTDATA(BF26&\"\",Pivots!$BE$3,\"State of Residence\",StateName2)","v":606.66666666666663},{"$f":"GETPIVOTDATA(BG26&\"\",Pivots!$BE$3,\"State of Residence\",StateName2)","v":425.66666666666669},{"$f":"GETPIVOTDATA(BH26&\"\",Pivots!$BE$3,\"State of Residence\",StateName2)","v":754},{"$f":"GETPIVOTDATA(BI26&\"\",Pivots!$BE$3,\"State of Residence\",StateName2)","v":3890.3333333333335},{"$f":"GETPIVOTDATA(BJ26&\"\",Pivots!$BE$3,\"State of Residence\",StateName2)","v":3705},{"$f":"GETPIVOTDATA(BK26&\"\",Pivots!$BE$3,\"State of Residence\",StateName2)","v":333},{"$f":"GETPIVOTDATA(BL26&\"\",Pivots!$BE$3,\"State of Residence\",StateName2)","v":993},{"$f":"GETPIVOTDATA(BM26&\"\",Pivots!$BE$3,\"State of Residence\",StateName2)","v":21959.666666666668},{"$f":"GETPIVOTDATA(BN26&\"\",Pivots!$BE$3,\"State of Residence\",StateName2)","v":339},{"$f":"GETPIVOTDATA(BO26&\"\",Pivots!$BE$3,\"State of Residence\",StateName2)","v":1107},{"$f":"GETPIVOTDATA(BP26&\"\",Pivots!$BE$3,\"State of Residence\",StateName2)","v":734},{"$f":"GETPIVOTDATA(BQ26&\"\",Pivots!$BE$3,\"State of Residence\",StateName2)","v":325.66666666666669}]
[null,null,null,"Missouri"]
[null,null,null,"Montana"]
[null,null,null,"Nebraska"]
[null,null,null,"Nevada"]
[null,null,null,"New Hampshire"]
[null,null,null,"New Jersey"]
[null,null,null,"New Mexico"]
[null,null,null,"New York"]
[null,null,null,"North Carolina"]
[null,null,null,"North Dakota"]
[null,null,null,"Ohio"]
[null,null,null,"Oklahoma"]
[null,null,null,"Oregon"]
[null,null,null,"Pennsylvania"]
[null,null,null,"Rhode Island"]
[null,null,null,"South Carolina"]
[null,null,null,"South Dakota"]
[null,null,null,"Tennessee"]
[null,null,null,"Texas"]
[null,null,null,"Utah"]
[null,null,null,"Vermont"]
[null,null,null,"Virginia"]
[null,null,null,"Washington"]
[null,null,null,"West Virginia"]
[null,null,null,"Wisconsin"]
[null,null,null,"Wyoming"]
[null,null,null,"Puerto Rico"]

{"sheet":"Pivots","index":3,"n_rows":67,"n_cols":265,"rows_kept":67,"cut":false,"hidden":false,"merged":[]}
[]
["pvtState1Population",null,null,null,null,null,null,null,null,null,null,null,null,null,null,null,null,null,null,null,null,null,null,null,null,null,null,null,null,null,null,null,null,null,null,null,null,null,null,null,null,null,null,null,null,null,null,null,null,null,null,null,null,null,null,null,"pvtStateMigration"]
["Sum of Population",null,null,null,null,null,null,null,null,null,null,null,null,null,null,null,null,null,null,null,null,null,null,null,null,null,null,null,null,null,null,null,null,null,null,null,null,null,null,null,null,null,null,null,null,null,null,null,null,null,null,null,null,null,null,null,null,"2010-01-01",null,null,null,null,null,null,null,null,null,null,null,null,null,null,null,null,null,null,null,null,null,null,null,null,null,null,null,null,null,null,null,null,null,null,null,null,null,null,null,null,null,null,null,null,null,null,null,null,null,null,null,"2011-01-01",null,null,null,null,null,null,null,null,null,null,null,null,null,null,null,null,null,null,null,null,null,null,null,null,null,null,null,null,null,null,null,null,null,null,null,null,null,null,null,null,null,null,null,null,null,null,null,null,null,null,null,"2012-01-01",null,null,null,null,null,null,null,null,null,null,null,null,null,null,null,null,null,null,null,null,null,null,null,null,null,null,null,null,null,null,null,null,null,null,null,null,null,null,null,null,null,null,null,null,null,null,null,null,null,null,null,"Total Alabama ","Total Alaska ","Total Arizona ","Total Arkansas ","Total California ","Total Colorado ","Total Connecticut ","Total Delaware ","Total District of Columbia ","Total Florida ","Total Georgia ","Total Hawaii ","Total Idaho ","Total Illinois ","Total Indiana ","Total Iowa ","Total Kansas ","Total Kentucky ","Total Louisiana ","Total Maine ","Total Maryland ","Total Massachusetts ","Total Michigan ","Total Minnesota ","Total Mississippi ","Total Missouri ","Total Montana ","Total Nebraska ","Total Nevada ","Total New Hampshire ","Total New Jersey ","Total New Mexico ","Total New York ","Total North Carolina ","Total North Dakota ","Total Ohio ","Total Oklahoma ","Total Oregon ","Total Pennsylvania ","Total Rhode Island ","Total South Carolina ","Total South Dakota ","Total Tennessee ","Total Texas ","Total Utah ","Total Vermont ","Total Virginia ","Total Washington ","Total West Virginia ","Total Wisconsin ","Total Wyoming ","Total Puerto Rico "]
[null,"United States",null,null,null,null,null,null,null,null,null,null,null,null,null,null,null,null,null,null,null,null,null,null,null,null,null,null,null,null,null,null,null,null,null,null,null,null,null,null,null,null,null,null,null,null,null,null,null,null,null,null,null,null,null,null,null,"Alabama ","Alaska ","Arizona ","Arkansas ","California ","Colorado ","Connecticut ","Delaware ","District of Columbia ","Florida ","Georgia ","Hawaii ","Idaho ","Illinois ","Indiana ","Iowa ","Kansas ","Kentucky ","Louisiana ","Maine ","Maryland ","Massachusetts ","Michigan ","Minnesota ","Mississippi ","Missouri ","Montana ","Nebraska ","Nevada ","New Hampshire ","New Jersey ","New Mexico ","New York ","North Carolina ","North Dakota ","Ohio ","Oklahoma ","Oregon ","Pennsylvania ","Rhode Island ","South Carolina ","South Dakota ","Tennessee ","Texas ","Utah ","Vermont ","Virginia ","Washington ","West Virginia ","Wisconsin ","Wyoming ","Puerto Rico ","Alabama ","Alaska ","Arizona ","Arkansas ","California ","Colorado ","Connecticut ","Delaware ","District of Columbia ","Florida ","Georgia ","Hawaii ","Idaho ","Illinois ","Indiana ","Iowa ","Kansas ","Kentucky ","Louisiana ","Maine ","Maryland ","Massachusetts ","Michigan ","Minnesota ","Mississippi ","Missouri ","Montana ","Nebraska ","Nevada ","New Hampshire ","New Jersey ","New Mexico ","New York ","North Carolina ","North Dakota ","Ohio ","Oklahoma ","Oregon ","Pennsylvania ","Rhode Island ","South Carolina ","South Dakota ","Tennessee ","Texas ","Utah ","Vermont ","Virginia ","Washington ","West Virginia ","Wisconsin ","Wyoming ","Puerto Rico ","Alabama ","Alaska ","Arizona ","Arkansas ","California ","Colorado ","Connecticut ","Delaware ","District of Columbia ","Florida ","Georgia ","Hawaii ","Idaho ","Illinois ","Indiana ","Iowa ","Kansas ","Kentucky ","Louisiana ","Maine ","Maryland ","Massachusetts ","Michigan ","Minnesota ","Mississippi ","Missouri ","Montana ","Nebraska ","Nevada ","New Hampshire ","New Jersey ","New Mexico ","New York ","North Carolina ","North Dakota ","Ohio ","Oklahoma ","Oregon ","Pennsylvania ","Rhode Island ","South Carolina ","South Dakota ","Tennessee ","Texas ","Utah ","Vermont ","Virginia ","Washington ","West Virginia ","Wisconsin ","Wyoming ","Puerto Rico "]
["2010-01-01",305628607,null,null,null,null,null,null,null,null,null,null,null,null,null,null,null,null,null,null,null,null,null,null,null,null,null,null,null,null,null,null,null,null,null,null,null,null,null,null,null,null,null,null,null,null,null,null,null,null,null,null,null,null,null,null,"Alabama",0,3013,676,1481,3827,1278,454,811,211,15062,21644,267,304,2503,3945,669,649,1967,1901,97,716,435,2334,386,7233,1373,229,169,265,0,356,650,3686,2371,169,2222,880,485,1477,0,2368,31,7409,6500,1336,0,2490,1171,41,1155,27,228,0,1771,1677,1642,3389,348,2921,232,399,20063,19346,1259,137,6991,1434,30,842,2686,2413,626,1606,112,2797,327,3945,1086,317,770,257,64,1996,119,1108,2697,284,2596,973,169,1075,0,2036,90,8710,7973,300,66,4935,2621,65,417,9,569,0,1004,962,660,3077,1386,284,42,162,11244,19920,627,493,2722,1347,345,865,2495,3104,67,1513,334,2298,752,4952,1555,101,151,1009,161,1702,459,2709,5133,228,1411,194,200,1837,0,2811,518,10539,7468,579,0,3170,1034,128,760,88,619,0,1929.3333333333333,1105,1261,3431,1004,1219.6666666666667,361.66666666666669,257.33333333333331,15456.333333333334,20303.333333333332,717.66666666666663,311.33333333333331,4072,2242,348,785.33333333333337,2382.6666666666665,2472.6666666666665,263.33333333333331,1278.3333333333333,293.66666666666669,2476.3333333333335,488.33333333333331,5376.666666666667,1338,215.66666666666666,363.33333333333331,510.33333333333331,75,1351.3333333333333,409.33333333333331,2501,3400.3333333333335,227,2076.3333333333335,682.33333333333337,284.66666666666669,1463,0,2405,213,8886,7313.666666666667,738.33333333333337,22,3531.6666666666665,1608.6666666666667,78,777.33333333333337,41.333333333333336,472]
["2011-01-01",307900319,null,null,null,null,null,null,null,null,null,null,null,null,null,null,null,null,null,null,null,null,null,null,null,null,null,null,null,null,null,null,null,null,null,null,null,null,null,null,null,null,null,null,null,null,null,null,null,null,null,null,null,null,null,null,"Alaska",477,0,1354,47,3906,1930,0,0,14,2315,1251,1705,895,388,9,262,106,1440,100,574,704,107,923,530,263,0,616,215,240,316,413,421,255,698,69,156,1455,1793,126,0,121,531,477,4123,1274,353,714,2421,0,158,81,19,93,0,2467,190,3098,1583,138,11,140,1188,556,1366,475,985,181,319,750,237,1077,0,216,141,771,593,554,921,248,5,532,520,128,226,940,470,0,319,616,2161,378,0,186,301,388,2492,662,68,1488,4548,89,23,246,1044,1097,0,1520,196,3494,556,0,0,356,1991,928,1376,538,58,260,13,221,161,120,66,508,297,563,192,56,819,371,1195,803,118,116,263,736,920,264,1316,335,3174,255,0,384,99,451,1488,330,79,1265,3725,0,206,136,25,555.66666666666663,0,1780.3333333333333,144.33333333333334,3499.3333333333335,1356.3333333333333,46,3.6666666666666665,170,1831.3333333333333,911.66666666666663,1482.3333333333333,636,477,150,198,359,612.66666666666663,432.33333333333331,213.33333333333334,476,181.66666666666666,752.33333333333337,438.33333333333331,291,580,411.66666666666669,471.66666666666669,525,318,219,303.33333333333331,643.66666666666663,696,111,597,802,2376,253,0,230.33333333333334,310.33333333333331,438.66666666666669,2701,755.33333333333337,166.66666666666666,1155.6666666666667,3564.6666666666665,29.666666666666668,129,154.33333333333334,362.66666666666669]
["2012-01-01",310212755,null,null,null,null,null,null,null,null,null,null,null,null,null,null,null,null,null,null,null,null,null,null,null,null,null,null,null,null,null,null,null,null,null,null,null,null,null,null,null,null,null,null,null,null,null,null,null,null,null,null,null,null,null,null,"Arizona",416,3109,0,689,47164,7687,479,738,0,7712,4261,1966,2147,12250,2690,3008,1935,1705,2014,241,1284,1449,6354,5421,272,4567,1343,1750,10342,64,1782,4419,6618,4463,826,5225,2910,5430,5535,403,2310,1351,3061,14705,7164,664,3413,12645,595,5556,593,599,833,5001,0,1066,49635,10189,1875,0,389,3732,2206,2199,2190,10035,5855,4526,1708,2134,844,0,1918,743,9396,3297,1226,3872,2431,1393,8756,228,3379,4610,3880,2548,1159,4682,3219,4613,3436,72,1774,1657,1680,12688,10577,0,2233,13940,70,6473,2510,871,1331,3717,0,1214,44889,13790,417,246,36,5553,2263,2491,2934,10744,2930,2702,2498,1328,724,616,3007,1961,9598,8570,293,2595,1118,2293,6712,510,2564,6946,7402,2721,877,7906,1626,8587,4280,614,1070,1472,5075,14788,5916,207,2763,13247,765,3765,2786,1791,860,3942.3333333333335,0,989.66666666666663,47229.333333333336,10555.333333333334,923.66666666666663,328,141.66666666666666,5665.666666666667,2910,2218.6666666666665,2423.6666666666665,11009.666666666666,3825,3412,2047,1722.3333333333333,1194,285.66666666666669,2069.6666666666665,1384.3333333333333,8449.3333333333339,5762.666666666667,597,3678,1630.6666666666667,1812,8603.3333333333339,267.33333333333331,2575,5325,5966.666666666667,3244,954,5937.666666666667,2585,6210,4417,363,1718,1493.3333333333333,3272,14060.333333333334,7885.666666666667,290.33333333333331,2803,13277.333333333334,476.66666666666669,5264.666666666667,1963,1087]
[null,null,null,null,null,null,null,null,null,null,null,null,null,null,null,null,null,null,null,null,null,null,null,null,null,null,null,null,null,null,null,null,null,null,null,null,null,null,null,null,null,null,null,null,null,null,null,null,null,null,null,null,null,null,null,null,"Arkansas",1405,934,777,0,4457,2535,451,0,154,3578,3921,129,618,3221,722,85,3611,2540,4012,0,306,190,1506,222,2764,7320,85,394,67,0,77,0,289,1561,0,1137,8607,239,731,0,1496,243,2653,13707,361,0,494,264,0,821,443,87,691,560,439,0,4077,746,519,79,0,3067,1446,13,179,3684,1362,851,2008,213,2120,30,133,781,1881,232,1731,7314,713,332,641,52,341,775,674,1664,214,174,3761,632,567,0,235,0,6462,14767,0,0,1245,1477,24,687,252,529,374,855,1677,0,3525,603,185,0,205,2682,1525,0,0,3576,1172,409,1033,1310,3953,17,169,254,1283,295,3689,9105,258,166,121,0,157,547,2262,3057,0,1135,9938,193,516,59,52,673,4195,11767,269,0,1159,251,84,695,1498,0,823.33333333333337,783,964.33333333333337,0,4019.6666666666665,1294.6666666666667,385,26.333333333333332,119.66666666666667,3109,2297.3333333333335,47.333333333333336,265.66666666666669,3493.6666666666665,1085.3333333333333,448.33333333333331,2217.3333333333335,1354.3333333333333,3361.6666666666665,15.666666666666666,202.66666666666666,408.33333333333331,1556.6666666666667,249.66666666666666,2728,7913,352,297.33333333333331,276.33333333333331,17.333333333333332,191.66666666666666,440.66666666666669,1075,2094,71.333333333333329,815.33333333333337,7435.333333333333,354.66666666666669,604.66666666666663,19.666666666666668,594.33333333333337,305.33333333333331,4436.666666666667,13413.666666666666,210,0,966,664,36,734.33333333333337,731,205.33333333333334]
[null,null,null,null,null,null,null,null,null,null,null,null,null,null,null,null,null,null,null,null,null,null,null,null,null,null,null,null,null,null,null,null,null,null,null,null,null,null,null,null,null,null,null,null,null,null,null,null,null,null,null,null,null,null,null,null,"California",3364,9579,33854,4172,0,15662,4631,643,3683,20362,8820,9528,5719,16482,6550,3163,3857,3394,2989,1796,10626,11969,10435,5095,2757,6921,3009,3062,27724,1614,10108,4632,20981,9593,392,8170,5708,20913,9948,526,5016,1604,4349,36582,10653,525,14232,30544,1446,6031,1336,1223,2087,7358,35650,2648,0,21245,3073,1302,3240,22094,13303,9864,4796,20834,4673,3324,2810,1201,3600,1658,7793,10244,12069,5687,2092,7677,2599,1955,36159,1222,8053,5904,25629,8708,1392,10474,5113,18165,8550,1103,5758,1004,8761,37087,8944,745,15753,36481,832,5668,2047,1344,2509,6995,38916,3472,0,15150,6764,474,3199,21004,10790,11906,5331,21251,5891,2284,2790,3763,5180,1256,7902,14356,8921,8539,2556,6729,3060,3302,27968,1327,12057,5921,31261,11195,1827,10653,6671,22724,10466,1648,4110,826,5802,43005,12172,544,15625,34569,1413,5681,1886,2323,2653.3333333333335,7977.333333333333,36140,3430.6666666666665,0,17352.333333333332,4822.666666666667,806.33333333333337,3374,21153.333333333332,10971,10432.666666666666,5282,19522.333333333332,5704.666666666667,2923.6666666666665,3152.3333333333335,2786,3923,1570,8773.6666666666661,12189.666666666666,10475,6440.333333333333,2468.3333333333335,7109,2889.3333333333335,2773,30617,1387.6666666666667,10072.666666666666,5485.666666666667,25957,9832,1203.6666666666667,9765.6666666666661,5830.666666666667,20600.666666666668,9654.6666666666661,1092.3333333333333,4961.333333333333,1144.6666666666667,6304,38891.333333333336,10589.666666666666,604.66666666666663,15203.333333333334,33864.666666666664,1230.3333333333333,5793.333333333333,1756.3333333333333,1630]
[null,null,null,null,null,null,null,null,null,null,null,null,null,null,null,null,null,null,null,null,null,null,null,null,null,null,null,null,null,null,null,null,null,null,null,null,null,null,null,null,null,null,null,null,null,null,null,null,null,null,null,null,null,null,null,null,"Colorado",954,2225,12287,1034,26089,0,459,486,479,8849,6445,2355,839,6950,3296,2140,4308,1961,968,532,1532,2242,4587,2878,1277,1978,2042,4065,4131,791,1259,3921,4594,2940,802,2838,3464,4330,3928,192,1231,1847,1628,22253,4748,350,2739,7583,623,2499,4418,874,2340,3191,12338,1615,23234,0,1567,501,298,8075,3250,1852,1578,6027,2116,3510,3718,1361,908,1358,3303,2157,3225,3055,879,4552,4079,4582,4061,489,2863,8797,3998,4756,2249,5527,3824,5543,3348,435,718,1340,3193,22390,3856,914,6281,5524,412,3995,2942,476,3108,3457,10589,1043,22152,0,1317,70,488,8615,5834,2536,2660,6374,4336,2776,5283,2500,5048,20,2844,5939,3343,2992,835,3771,2021,4472,3789,679,2464,6520,7250,4378,1918,4533,4582,2419,3950,137,2383,756,2535,17355,6398,503,3796,4853,837,3000,5602,1144,2134,2957.6666666666665,11738,1230.6666666666667,23825,0,1114.3333333333333,352.33333333333331,421.66666666666669,8513,5176.333333333333,2247.6666666666665,1692.3333333333333,6450.333333333333,3249.3333333333335,2808.6666666666665,4436.333333333333,1940.6666666666667,2308,636.66666666666663,2559.6666666666665,3446,3718.3333333333335,2975,997,3433.6666666666665,2714,4373,3993.6666666666665,653,2195.3333333333335,6412.666666666667,5280.666666666667,4024.6666666666665,1656.3333333333333,4299.333333333333,3956.6666666666665,4097.333333333333,3742,254.66666666666666,1444,1314.3333333333333,2452,20666,5000.666666666667,589,4272,5986.666666666667,624,3164.6666666666665,4320.666666666667,831.33333333333337]
[null,null,null,null,null,null,null,null,null,null,null,null,null,null,null,null,null,null,null,null,null,null,null,null,null,null,null,null,null,null,null,null,null,null,null,null,null,null,null,null,null,null,null,null,null,null,null,null,null,null,null,null,null,null,null,null,"Connecticut",896,0,664,334,4479,547,0,149,331,9207,748,182,147,3391,1074,108,0,400,0,528,1531,8510,770,934,67,42,0,0,507,1049,3475,112,20727,1345,0,1296,145,640,1955,1728,1140,0,430,1887,0,458,1735,2084,442,1092,47,2027,101,180,1387,84,3699,1502,0,62,607,4771,2000,587,133,1843,168,67,16,0,315,259,1267,8691,692,76,69,365,206,62,160,1221,3809,265,20015,1029,0,1383,217,117,3668,1488,997,0,123,1214,398,608,2555,2255,46,660,65,2105,46,439,3167,200,3161,367,0,22,288,6578,1702,408,97,912,53,0,0,124,909,1224,1752,8743,753,605,276,358,50,45,172,1009,5665,444,23310,3379,0,287,415,35,2214,1558,940,0,260,3279,45,709,1729,1593,174,711,104,3228,347.66666666666669,206.33333333333334,1739.3333333333333,206,3779.6666666666665,805.33333333333337,0,77.666666666666671,408.66666666666669,6852,1483.3333333333333,392.33333333333331,125.66666666666667,2048.6666666666665,431.66666666666669,58.333333333333336,5.333333333333333,174.66666666666666,408,670.33333333333337,1516.6666666666667,8648,738.33333333333337,538.33333333333337,137.33333333333334,255,85.333333333333329,35.666666666666664,279.66666666666669,1093,4316.333333333333,273.66666666666669,21350.666666666668,1917.6666666666667,0,988.66666666666663,259,264,2612.3333333333335,1591.3333333333333,1025.6666666666667,0,271,2126.6666666666665,147.66666666666666,591.66666666666663,2006.3333333333333,1977.3333333333333,220.66666666666666,821,72,2453.3333333333335]
[null,null,null,null,null,null,null,null,null,null,null,null,null,null,null,null,null,null,null,null,null,null,null,null,null,null,null,null,null,null,null,null,null,null,null,null,null,null,null,null,null,null,null,null,null,null,null,null,null,null,null,null,null,null,null,null,"Delaware",128,68,60,0,353,178,714,0,432,2362,585,0,0,612,0,0,28,163,0,294,4969,689,61,55,0,539,73,0,106,139,3678,59,4251,424,0,325,0,0,7318,149,195,0,146,178,0,0,1051,377,0,0,0,954,81,329,541,0,699,169,66,0,154,810,639,201,441,34,210,0,7,305,0,0,4238,806,43,201,0,713,0,12,0,0,6297,0,3141,388,0,664,27,0,8571,131,153,0,221,883,475,0,1064,482,198,55,463,1008,119,692,188,0,2221,0,1489,0,11,715,179,0,32,567,62,30,113,0,178,0,5649,157,227,351,58,80,0,91,572,99,5846,85,3566,1349,0,191,0,0,6828,135,298,0,344,133,166,0,1746,29,161,0,0,56,109.33333333333333,363,263,0,1091,115.66666666666667,756.33333333333337,0,199,1295.6666666666667,467.66666666666669,67,157.66666666666666,404.33333333333331,90.666666666666671,10,49.333333333333336,156,59.333333333333336,98,4952,550.66666666666663,110.33333333333333,202.33333333333334,19.333333333333332,444,24.333333333333332,34.333333333333336,226,79.333333333333329,5273.666666666667,48,3652.6666666666665,720.33333333333337,0,393.33333333333331,9,0,7572.333333333333,138.33333333333334,215.33333333333334,0,237,398,213.66666666666666,0,1287,296,119.66666666666667,18.333333333333332,154.33333333333334,672.66666666666663]
[null,null,null,null,null,null,null,null,null,null,null,null,null,null,null,null,null,null,null,null,null,null,null,null,null,null,null,null,null,null,null,null,null,null,null,null,null,null,null,null,null,null,null,null,null,null,null,null,null,null,null,null,null,null,null,null,"District of Columbia ",360,591,662,155,4205,656,926,0,0,1100,1597,0,0,615,711,392,83,94,0,76,13503,1376,126,87,0,272,0,62,0,137,1924,61,3852,1897,98,598,0,601,2378,249,380,0,591,1180,0,199,7915,284,860,391,0,0,13,135,43,81,3797,452,981,128,0,1254,937,372,68,1397,128,241,6,297,0,0,14129,2048,1108,409,83,112,38,79,238,145,1035,0,2313,1716,285,306,0,51,1589,50,357,104,421,1083,75,445,7975,476,120,946,0,0,79,1247,902,35,4999,677,618,78,0,1705,1079,38,46,795,469,133,164,112,283,194,14120,1524,944,393,44,337,0,172,42,197,1451,116,3085,985,0,651,0,157,1494,635,150,0,577,1473,116,267,9537,481,293,721,215,0,150.66666666666666,657.66666666666663,535.66666666666663,90.333333333333329,4333.666666666667,595,841.66666666666663,68.666666666666671,0,1353,1204.3333333333333,136.66666666666666,38,935.66666666666663,436,255.33333333333334,84.333333333333329,167.66666666666666,94.333333333333329,90,13917.333333333334,1649.3333333333333,726,296.33333333333331,42.333333333333336,240.33333333333334,12.666666666666666,104.33333333333333,93.333333333333329,159.66666666666666,1470,59,3083.3333333333335,1532.6666666666667,127.66666666666667,518.33333333333337,0,269.66666666666669,1820.3333333333333,311.33333333333331,295.66666666666669,34.666666666666664,529.66666666666663,1245.3333333333333,63.666666666666664,303.66666666666669,8475.6666666666661,413.66666666666669,424.33333333333331,686,71.666666666666671,0]
["pvtState1SameResidence",null,null,null,null,null,null,null,null,null,null,null,null,null,null,null,null,null,null,null,null,null,null,null,null,null,null,null,null,null,null,null,null,null,null,null,null,null,null,null,null,null,null,null,null,null,null,null,null,null,null,null,null,null,null,null,"Florida",15830,5887,3907,3611,22130,6428,11183,3099,1110,0,35615,2021,884,17432,9030,2921,4136,6321,7232,5497,13241,13900,21359,5439,7929,7984,338,1544,7050,3645,22344,900,55011,19108,794,21047,3466,1655,19935,1982,10759,430,12882,24039,2833,1442,20080,3573,5634,8081,191,12968,12635,7405,8451,3025,22420,9383,11704,1264,891,0,38658,3639,312,19152,11472,1846,2661,5441,6094,4689,15410,13701,19640,4663,5175,7114,559,3857,3527,4324,25206,1376,59288,23983,514,18191,2600,3315,20821,5002,11953,716,10451,25532,2343,2019,16614,6339,4964,7412,846,21611,18599,10704,6473,3321,20386,8766,8975,1099,780,0,42754,3177,1268,22565,13803,3864,5661,6912,5550,7348,10442,15159,23400,5460,5490,10666,1758,945,1241,2362,27606,2853,53009,23133,239,22927,3142,2919,25659,3050,11366,1070,16275,28564,2499,2747,25697,4943,3533,6216,773,21638,15688,7998.666666666667,6277,3319,21645.333333333332,8192.3333333333339,10620.666666666666,1820.6666666666667,927,0,39009,2945.6666666666665,821.33333333333337,19716.333333333332,11435,2877,4152.666666666667,6224.666666666667,6292,5844.666666666667,13031,14253.333333333334,21466.333333333332,5187.333333333333,6198,8588,885,2115.3333333333335,3939.3333333333335,3443.6666666666665,25052,1709.6666666666667,55769.333333333336,22074.666666666668,515.66666666666663,20721.666666666668,3069.3333333333335,2629.6666666666665,22138.333333333332,3344.6666666666665,11359.333333333334,738.66666666666663,13202.666666666666,26045,2558.3333333333335,2069.3333333333335,20797,4951.666666666667,4710.333333333333,7236.333333333333,603.33333333333337,18739]
["Sum of Same Residence Last Yr",null,null,null,null,null,null,null,null,null,null,null,null,null,null,null,null,null,null,null,null,null,null,null,null,null,null,null,null,null,null,null,null,null,null,null,null,null,null,null,null,null,null,null,null,null,null,null,null,null,null,null,null,null,null,null,"Georgia",13840,3645,2554,599,8909,3224,2619,837,1708,49901,0,1040,414,9736,2649,1096,1355,6525,3645,0,5382,3910,6857,1169,2380,3072,52,148,1155,162,4151,826,12472,15361,0,9323,2070,843,6294,43,15562,557,14445,11424,380,361,8393,4495,358,3416,102,1010,18799,1079,4292,2112,14949,2325,709,619,364,42666,0,1006,126,6080,2442,950,4513,3686,6541,408,3708,4436,6992,1808,5380,2514,246,4144,774,132,8371,791,14454,19138,201,6863,1632,727,5791,337,16914,536,16898,15760,793,361,9438,3701,1340,2727,504,1635,13864,2654,6657,1041,14174,4710,1829,226,1352,42870,0,1409,936,7143,5972,1687,1497,6172,4100,222,3619,4153,9949,2237,3280,3377,251,1283,3783,15,4920,915,13957,16009,207,7501,3299,453,9076,440,18611,257,17606,16198,20,84,10702,1965,1237,3441,106,1730,15501,2459.3333333333335,4501,1250.6666666666667,12677.333333333334,3419.6666666666665,1719,560.66666666666663,1141.3333333333333,45145.666666666664,0,1151.6666666666667,492,7653,3687.6666666666665,1244.3333333333333,2455,5461,4762,210,4236.333333333333,4166.333333333333,7932.666666666667,1738,3680,2987.6666666666665,183,1858.3333333333333,1904,103,5814,844,13627.666666666666,16836,136,7895.666666666667,2333.6666666666665,674.33333333333337,7053.666666666667,273.33333333333331,17029,450,16316.333333333334,14460.666666666666,397.66666666666669,268.66666666666669,9511,3387,978.33333333333337,3194.6666666666665,237.33333333333334,1458.3333333333333]
[null,"Arizona",null,null,null,null,null,null,null,null,null,null,null,null,null,null,null,null,null,null,null,null,null,null,null,null,null,null,null,null,null,null,null,null,null,null,null,null,null,null,null,null,null,null,null,null,null,null,null,null,null,null,null,null,null,null,"Hawaii",749,743,1398,0,12677,1073,307,0,0,4599,2013,0,42,715,192,68,387,95,88,89,990,1283,627,476,234,170,150,0,1925,496,443,11,1339,1510,69,625,57,1834,553,644,322,267,142,6694,467,0,2644,2705,483,1168,18,0,1268,844,2900,242,10173,950,731,784,222,3160,2519,0,112,1884,402,478,125,18,179,106,341,92,1303,933,371,308,85,91,1548,107,564,354,4246,2307,32,970,685,2030,870,58,1681,0,636,3007,1040,0,2523,3790,312,147,14,238,608,1417,1865,24,9756,1216,191,278,230,2780,1448,0,404,318,292,84,1135,485,207,91,2491,1266,321,192,44,944,131,75,760,85,410,284,2382,2241,0,884,1095,1763,1087,106,644,459,1314,3300,2183,0,1393,5920,197,295,50,336,875,1001.3333333333334,2054.3333333333335,88.666666666666671,10868.666666666666,1079.6666666666667,409.66666666666669,354,150.66666666666666,3513,1993.3333333333333,0,186,972.33333333333337,295.33333333333331,210,549,199.33333333333334,158,95.333333333333329,1274,880.33333333333337,750.33333333333337,533.66666666666663,216.33333333333334,474,122,55.333333333333336,1411,229.33333333333334,472.33333333333331,216.33333333333334,2655.6666666666665,2019.3333333333333,33.666666666666664,826.33333333333337,612.33333333333337,1875.6666666666667,836.66666666666663,269.33333333333331,882.33333333333337,242,697.33333333333337,4333.666666666667,1230,0,2186.6666666666665,4138.333333333333,330.66666666666669,536.66666666666663,27.333333333333332,191.33333333333334]
["2010-01-01",5069002,null,null,null,null,null,null,null,null,null,null,null,null,null,null,null,null,null,null,null,null,null,null,null,null,null,null,null,null,null,null,null,null,null,null,null,null,null,null,null,null,null,null,null,null,null,null,null,null,null,null,null,null,null,null,"Idaho",376,3264,3086,45,8932,1372,0,0,144,612,313,123,0,169,132,773,422,315,59,202,44,115,427,465,37,425,1509,0,2110,109,97,694,155,134,96,325,711,3202,172,0,0,296,1153,1746,8014,0,611,10876,133,233,1410,233,263,4510,3543,224,9021,1813,0,0,0,1733,275,254,0,390,296,318,479,120,51,0,0,396,615,566,62,384,1602,439,3581,129,84,141,419,263,1201,260,288,7170,343,0,55,842,296,1303,6059,0,905,8991,0,165,487,249,575,1198,2424,291,10280,1186,44,120,116,2014,583,206,0,532,283,90,63,83,54,0,107,338,683,637,87,214,3800,35,2535,0,214,675,938,817,0,1018,93,4963,169,0,205,118,1957,1352,6617,0,269,10398,0,225,677,136,404.66666666666669,2990.6666666666665,3017.6666666666665,186.66666666666666,9411,1457,14.666666666666666,40,86.666666666666671,1453,390.33333333333331,194.33333333333334,0,363.66666666666669,237,393.66666666666669,321.33333333333331,172.66666666666666,54.666666666666664,67.333333333333329,50.333333333333336,283,575,556,62,341,2303.6666666666665,158,2742,79.333333333333329,131.66666666666666,503.33333333333331,504,404.66666666666669,432.33333333333331,534.33333333333337,364,5111.666666666667,228,0,86.666666666666671,418.66666666666669,1135.3333333333333,1467,6896.666666666667,0,595,10088.333333333334,44.333333333333336,207.66666666666666,858,206]
["2011-01-01",5107496,null,null,null,null,null,null,null,null,null,null,null,null,null,null,null,null,null,null,null,null,null,null,null,null,null,null,null,null,null,null,null,null,null,null,null,null,null,null,null,null,null,null,null,null,null,null,null,null,null,null,null,null,null,null,"Illinois",1397,1764,5921,1194,16205,3850,2264,56,1047,8051,6781,1224,313,0,21918,9141,1970,2921,1419,55,1985,2811,11865,4300,1093,16703,928,546,2541,206,2331,996,8479,5504,1112,5103,1459,1224,5190,838,1565,292,3999,12245,658,260,3831,1642,812,15364,586,2055,2823,4119,7657,3185,13930,3271,1819,277,1440,17548,6042,1269,393,0,23491,8420,2533,5569,1315,693,2565,3507,10274,4496,1521,13889,304,827,2454,590,3009,1573,6412,4057,105,8384,1002,792,3012,278,1582,1318,3223,11011,951,49,5233,3075,352,14507,58,2387,883,2250,7139,1587,14940,3036,955,234,1066,12687,8745,869,1384,0,16907,8529,2009,2923,1229,526,1865,3296,12583,6537,2744,13264,228,1302,1478,283,2366,1359,7561,3761,196,6872,1491,954,4588,462,1583,394,4648,16780,1154,156,4311,2704,1221,14414,302,2049,1701,2711,6905.666666666667,1988.6666666666667,15025,3385.6666666666665,1679.3333333333333,189,1184.3333333333333,12762,7189.333333333333,1120.6666666666667,696.66666666666663,0,20772,8696.6666666666661,2170.6666666666665,3804.3333333333335,1321,424.66666666666669,2138.3333333333335,3204.6666666666665,11574,5111,1786,14618.666666666666,486.66666666666669,891.66666666666663,2157.6666666666665,359.66666666666669,2568.6666666666665,1309.3333333333333,7484,4440.666666666667,471,6786.333333333333,1317.3333333333333,990,4263.333333333333,526,1576.6666666666667,668,3956.6666666666665,13345.333333333334,921,155,4458.333333333333,2473.6666666666665,795,14761.666666666666,315.33333333333331,2163.6666666666665]
["2012-01-01",5242674,null,null,null,null,null,null,null,null,null,null,null,null,null,null,null,null,null,null,null,null,null,null,null,null,null,null,null,null,null,null,null,null,null,null,null,null,null,null,null,null,null,null,null,null,null,null,null,null,null,null,null,null,null,null,"Indiana",1502,177,2210,1548,8959,1362,544,0,181,5496,1623,267,772,27950,0,1885,1582,10643,749,30,1641,103,9361,916,270,3893,164,705,227,114,1876,188,2564,2828,0,13272,681,423,2668,174,584,216,3093,6335,444,45,3673,571,669,1762,413,572,1562,371,3975,2016,7649,1930,1227,79,0,8595,2543,1057,1368,23071,0,916,1321,10177,2241,275,480,952,7896,1168,469,1824,34,622,511,90,651,504,2518,3038,70,11109,844,505,3998,49,3306,235,3879,6326,123,530,1486,1028,216,2923,117,132,1625,479,2763,564,6033,1225,823,639,1045,11472,2258,856,186,28436,0,1678,1624,11177,736,0,1050,837,11017,1543,1948,4526,134,591,1011,0,1537,219,2316,2665,113,11235,1198,387,2419,0,1414,111,3547,4490,105,0,1932,258,507,1727,1681,136,1563,342.33333333333331,2982.6666666666665,1376,7547,1505.6666666666667,864.66666666666663,239.33333333333334,408.66666666666669,8521,2141.3333333333335,726.66666666666663,775.33333333333337,26485.666666666668,0,1493,1509,10665.666666666666,1242,101.66666666666667,1057,630.66666666666663,9424.6666666666661,1209,895.66666666666663,3414.3333333333335,110.66666666666667,639.33333333333337,583,68,1354.6666666666667,303.66666666666669,2466,2843.6666666666665,61,11872,907.66666666666663,438.33333333333331,3028.3333333333335,74.333333333333329,1768,187.33333333333334,3506.3333333333335,5717,224,191.66666666666666,2363.6666666666665,619,464,2137.3333333333335,737,280]
[null,null,null,null,null,null,null,null,null,null,null,null,null,null,null,null,null,null,null,null,null,null,null,null,null,null,null,null,null,null,null,null,null,null,null,null,null,null,null,null,null,null,null,null,null,null,null,null,null,null,null,null,null,null,null,null,"Iowa",330,519,1483,247,2847,2554,114,0,53,1364,973,866,315,17016,1710,0,1520,334,315,0,134,189,1439,7564,117,6031,836,4783,623,381,472,492,273,1123,601,632,679,1071,378,0,591,1992,1617,4131,146,45,303,538,0,2705,111,149,207,967,1411,433,3297,2891,424,0,0,707,1938,299,161,13725,349,0,1776,387,228,26,487,466,1687,5634,408,3649,370,6490,2009,0,185,421,2361,1760,604,993,532,811,388,65,172,2842,623,2334,1482,38,720,856,115,2537,140,57,503,951,1590,451,3268,3252,112,0,151,4335,596,521,290,11969,1716,0,918,819,763,78,419,585,946,7505,751,4168,452,7698,681,56,1018,114,1230,734,833,1127,1465,348,451,0,943,1158,1148,3553,886,0,268,919,22,3607,392,786,346.66666666666669,812.33333333333337,1494.6666666666667,377,3137.3333333333335,2899,216.66666666666666,0,68,2135.3333333333335,1169,562,255.33333333333334,14236.666666666666,1258.3333333333333,0,1404.6666666666667,513.33333333333337,435.33333333333331,34.666666666666664,346.66666666666669,413.33333333333331,1357.3333333333333,6901,425.33333333333331,4616,552.66666666666663,6323.666666666667,1104.3333333333333,145.66666666666666,558.33333333333337,342.33333333333331,1288,1205.6666666666667,679.33333333333337,917.33333333333337,892,743.33333333333337,405.66666666666669,21.666666666666668,568.66666666666663,1997.3333333333333,1129.3333333333333,3339.3333333333335,838,27.666666666666668,430.33333333333331,771,45.666666666666664,2949.6666666666665,214.33333333333334,330.66666666666669]
[null,null,null,null,null,null,null,null,null,null,null,null,null,null,null,null,null,null,null,null,null,null,null,null,null,null,null,null,null,null,null,null,null,null,null,null,null,null,null,null,null,null,null,null,null,null,null,null,null,null,null,null,null,null,null,null,"Kansas",44,1050,2238,1596,6125,6022,85,238,0,2863,1916,128,398,2943,1544,1875,0,1048,890,0,1369,100,806,1562,167,23384,289,2678,1318,76,1743,873,2390,1083,225,1509,7568,514,563,39,137,352,1152,9217,238,75,1648,1175,0,1233,573,68,434,108,2028,998,4743,5030,412,74,128,1581,1146,287,264,2760,863,1715,0,1167,519,481,3180,28,1947,679,1517,22033,270,1648,657,27,1189,769,780,1223,379,1616,5022,285,1494,180,1102,104,1066,6575,196,0,1986,772,0,893,1285,775,853,333,3094,2158,5411,3746,210,0,456,3118,1896,149,456,1702,1679,1527,0,617,438,211,282,187,1125,682,452,21022,300,4126,851,0,267,1029,571,813,261,1310,8408,848,918,18,556,154,1542,8468,97,70,1705,3265,139,486,278,82,443.66666666666669,497,2453.3333333333335,1584,5426.333333333333,4932.666666666667,235.66666666666666,104,194.66666666666666,2520.6666666666665,1652.6666666666667,188,372.66666666666669,2468.3333333333335,1362,1705.6666666666667,0,944,615.66666666666663,230.66666666666666,1610.3333333333333,105,1292.6666666666667,974.33333333333337,712,22146.333333333332,286.33333333333331,2817.3333333333335,942,34.333333333333336,1066.3333333333333,890.33333333333337,1247,1039.6666666666667,288.33333333333331,1478.3333333333333,6999.333333333333,549,991.66666666666663,79,598.33333333333337,203.33333333333334,1253.3333333333333,8086.666666666667,177,48.333333333333336,1779.6666666666667,1737.3333333333333,46.333333333333336,870.66666666666663,712,308.33333333333331]
[null,null,null,null,null,null,null,null,null,null,null,null,null,null,null,null,null,null,null,null,null,null,null,null,null,null,null,null,null,null,null,null,null,null,null,null,null,null,null,null,null,null,null,null,null,null,null,null,null,null,null,null,null,null,null,null,"Kentucky",2161,3017,2598,558,3779,329,698,38,147,10119,6397,520,71,4659,11906,656,1109,0,437,0,1395,1036,4672,930,1442,3153,0,858,76,0,1147,122,2057,3758,0,15598,1153,181,2618,289,1286,163,11153,5758,905,525,3671,716,2297,1993,292,179,925,0,1818,1058,2130,221,176,0,201,7400,2725,63,36,4273,11071,536,253,0,1399,71,2076,1019,3178,475,1248,2793,216,471,1358,52,1289,553,2174,3916,117,19617,1256,459,1490,640,1387,0,16852,4661,140,151,5154,1121,1174,581,57,192,4137,304,1103,518,3415,712,246,706,254,9232,4173,647,50,4445,12203,238,602,0,666,46,1120,419,7302,605,646,2381,0,723,301,84,496,554,5239,3643,122,17041,577,298,2226,0,1347,0,10064,3345,464,45,3319,1988,3346,1395,0,170,2407.6666666666665,1107,1839.6666666666667,711.33333333333337,3108,420.66666666666669,373.33333333333331,248,200.66666666666666,8917,4431.666666666667,410,52.333333333333336,4459,11726.666666666666,476.66666666666669,654.66666666666663,0,834,39,1530.3333333333333,824.66666666666663,5050.666666666667,670,1112,2775.6666666666665,72,684,578.33333333333337,45.333333333333336,977.33333333333337,409.66666666666669,3156.6666666666665,3772.3333333333335,79.666666666666671,17418.666666666668,995.33333333333337,312.66666666666669,2111.3333333333335,309.66666666666669,1340,54.333333333333336,12689.666666666666,4588,503,240.33333333333334,4048,1275,2272.3333333333335,1323,116.33333333333333,180.33333333333334]
[null,null,null,null,null,null,null,null,null,null,null,null,null,null,null,null,null,null,null,null,null,null,null,null,null,null,null,null,null,null,null,null,null,null,null,null,null,null,null,null,null,null,null,null,null,null,null,null,null,null,null,null,null,null,null,null,"Louisiana",5740,1504,1960,2382,5751,1215,89,0,264,9394,5766,342,202,2131,948,625,706,1656,0,162,963,995,1301,569,7032,2852,40,119,1552,462,171,294,2161,1443,438,1100,1074,281,1350,0,1130,0,1853,26134,473,0,1278,1509,210,237,31,402,3065,288,2010,2774,3957,1202,358,0,195,5193,4425,688,230,1189,1549,468,312,1520,0,120,1221,439,1163,698,10255,1375,278,176,994,15,453,1028,1360,2134,277,2641,4235,1531,455,268,1573,37,2495,30292,179,87,2055,1075,110,339,357,393,2329,403,2021,3645,5139,1433,164,0,596,6534,4478,378,265,1229,1359,544,420,1649,0,251,642,549,1080,330,6791,1591,428,745,931,11,975,150,2786,2284,64,1115,2159,195,1239,737,1914,0,2348,24488,277,45,1857,1581,238,682,146,655,3711.3333333333335,731.66666666666663,1997,2933.6666666666665,4949,1283.3333333333333,203.66666666666666,0,351.66666666666669,7040.333333333333,4889.666666666667,469.33333333333331,232.33333333333334,1516.3333333333333,1285.3333333333333,545.66666666666663,479.33333333333331,1608.3333333333333,0,177.66666666666666,942,661,1181.3333333333333,532.33333333333337,8026,1939.3333333333333,248.66666666666666,346.66666666666669,1159,162.66666666666666,533,490.66666666666669,2102.3333333333335,1953.6666666666667,259.66666666666669,1618.6666666666667,2489.3333333333335,669,1014.6666666666666,335,1539,12.333333333333334,2232,26971.333333333332,309.66666666666669,44,1730,1388.3333333333333,186,419.33333333333331,178,483.33333333333331]
[null,null,null,null,null,null,null,null,null,null,null,null,null,null,null,null,null,null,null,null,null,null,null,null,null,null,null,null,null,null,null,null,null,null,null,null,null,null,null,null,null,null,null,null,null,null,null,null,null,null,null,null,null,null,null,null,"Maine",402,424,254,67,1066,478,1361,174,55,3025,844,62,0,311,259,337,56,484,115,0,243,3521,122,91,0,201,275,204,345,4058,902,234,2339,1001,55,315,124,0,375,379,148,0,249,458,390,420,654,381,0,0,500,204,634,37,325,38,829,290,2481,238,239,4304,507,177,0,675,164,275,523,158,138,0,52,4439,702,296,0,325,10,0,150,4302,694,144,2589,1439,19,483,25,471,915,234,587,42,394,1637,182,612,570,88,43,321,21,65,129,38,230,0,1610,314,1468,234,32,2926,511,0,143,195,0,7,277,482,15,0,325,3887,116,430,79,69,0,82,35,3655,405,272,2519,1112,0,628,79,215,976,1024,173,0,985,496,200,349,573,118,51,0,59,38,388.33333333333331,166.33333333333334,269.66666666666669,35,1168.3333333333333,360.66666666666669,1770,215.33333333333334,108.66666666666667,3418.3333333333335,620.66666666666663,79.666666666666671,47.666666666666664,393.66666666666669,141,206.33333333333334,285.33333333333331,374.66666666666669,89.333333333333329,0,206.66666666666666,3949,313.33333333333331,272.33333333333331,26.333333333333332,198.33333333333334,95,95.333333333333329,176.66666666666666,4005,667,216.66666666666666,2482.3333333333335,1184,24.666666666666668,475.33333333333331,76,228.66666666666666,755.33333333333337,545.66666666666663,302.66666666666669,14,542.66666666666663,863.66666666666663,257.33333333333331,460.33333333333331,599,195.66666666666666,31.333333333333332,107,193.33333333333334,102.33333333333333]
[null,null,null,null,null,null,null,null,null,null,null,null,null,null,null,null,null,null,null,null,null,null,null,null,null,null,null,null,null,null,null,null,null,null,null,null,null,null,null,null,null,null,null,null,null,null,null,null,null,null,null,null,null,null,null,null,"Maryland",1641,2672,1124,273,8206,2501,1603,8340,23202,6564,3454,422,357,3300,431,160,781,396,1376,53,0,1983,3572,820,403,1147,86,54,979,1369,9058,238,10736,5787,0,3277,607,723,13467,782,1710,49,2669,5883,655,350,24765,1542,4363,324,230,612,228,671,945,423,8595,1796,1608,6652,18492,7825,7113,1170,389,2392,1318,110,689,848,860,1526,0,3470,2077,810,1109,1469,73,0,1105,232,9627,797,9222,6686,0,3396,845,276,14158,197,2882,0,1942,3619,223,40,22089,1525,2027,353,80,779,1261,1947,760,136,8614,1071,881,4100,21213,9610,4610,610,429,3621,1210,569,1726,715,606,332,0,3977,2167,1422,581,256,0,132,330,1124,6260,638,11736,7507,116,2522,463,378,15485,82,2297,0,1800,5612,1061,589,20579,1431,1957,460,0,294,1043.3333333333333,1763.3333333333333,943,277.33333333333331,8471.6666666666661,1789.3333333333333,1364,6364,20969,7999.666666666667,5059,734,391.66666666666669,3104.3333333333335,986.33333333333337,279.66666666666669,1065.3333333333333,653,947.33333333333337,637,0,3143.3333333333335,2605.3333333333335,1017.3333333333334,697.66666666666663,957.33333333333337,53,62,804.66666666666663,908.33333333333337,8315,557.66666666666663,10564.666666666666,6660,38.666666666666664,3065,638.33333333333337,459,14370,353.66666666666669,2296.3333333333335,16.333333333333332,2137,5038,646.33333333333337,326.33333333333331,22477.666666666668,1499.3333333333333,2782.3333333333335,379,103.33333333333333,561.66666666666663]
["pvtState1ChangedResidence",null,null,null,null,null,null,null,null,null,null,null,null,null,null,null,null,null,null,null,null,null,null,null,null,null,null,null,null,null,null,null,null,null,null,null,null,null,null,null,null,null,null,null,null,null,null,null,null,null,null,null,null,null,null,null,"Massachusetts",583,1891,1572,206,14971,1051,13270,131,1539,11118,1409,682,79,2842,1891,307,0,340,0,4666,3660,0,1624,2185,453,1957,388,46,792,9911,4709,161,20002,2798,0,2163,158,228,5316,6965,1659,0,918,7073,207,1526,4542,1627,0,546,0,3085,1201,225,1017,167,11556,1388,9445,399,676,11396,3264,733,412,2991,640,138,969,180,977,4006,2762,0,2629,862,356,1261,596,637,163,12010,8332,199,19431,3964,61,1757,90,178,6538,10182,1621,44,371,5203,548,2246,2984,1673,911,441,0,4413,636,890,1972,394,12770,980,10525,506,379,12890,2789,1108,188,2886,677,151,565,52,1556,3907,2381,0,1337,966,155,453,49,182,787,13331,8046,521,19467,2514,81,1829,297,1528,8236,6863,2477,194,823,3694,1027,2534,4098,1653,385,584,264,4056,806.66666666666663,1002,1520.3333333333333,255.66666666666666,13099,1139.6666666666667,11080,345.33333333333331,864.66666666666663,11801.333333333334,2487.3333333333335,841,226.33333333333334,2906.3333333333335,1069.3333333333333,198.66666666666666,511.33333333333331,190.66666666666666,844.33333333333337,4193,2934.3333333333335,0,1863.3333333333333,1337.6666666666667,321.33333333333331,1223.6666666666667,344.33333333333331,288.33333333333331,580.66666666666663,11750.666666666666,7029,293.66666666666669,19633.333333333332,3092,47.333333333333336,1916.3333333333333,181.66666666666666,644.66666666666663,6696.666666666667,8003.333333333333,1919,79.333333333333329,704,5323.333333333333,594,2102,3874.6666666666665,1651,432,523.66666666666663,88,3851.3333333333335]
["Sum of Changed Residence Last Yr",null,null,null,null,null,null,null,null,null,null,null,null,null,null,null,null,null,null,null,null,null,null,null,null,null,null,null,null,null,null,null,null,null,null,null,null,null,null,null,null,null,null,null,null,null,null,null,null,null,null,null,null,null,null,null,"Michigan",2403,1040,3197,636,6726,2031,277,167,471,11646,3913,313,66,10651,7816,758,640,2353,1342,645,620,1206,0,1275,656,2921,312,213,1874,437,1676,669,3135,2444,53,9783,2276,537,3134,653,1446,706,4453,7184,545,45,2073,1427,446,6291,568,1432,3527,3456,3840,2054,7793,3425,1656,0,256,17712,4254,630,882,9897,7668,1709,1148,2578,955,599,1035,2861,0,2671,715,2509,84,439,1215,73,1849,508,6087,3405,159,11224,917,647,2864,385,2185,571,3106,9935,642,0,2327,1430,417,4018,841,908,2341,1152,7168,906,8085,2363,798,114,274,13146,4270,291,242,10047,10976,993,805,3409,1284,261,2201,1720,0,1127,922,2206,218,113,1354,446,1617,1318,5731,3912,265,11318,705,811,2739,68,1822,66,3259,8638,819,60,3057,2146,353,4768,1277,782,2757,1882.6666666666667,4735,1198.6666666666667,7534.666666666667,2606.3333333333335,910.33333333333337,93.666666666666671,333.66666666666669,14168,4145.666666666667,411.33333333333331,396.66666666666669,10198.333333333334,8820,1153.3333333333333,864.33333333333337,2780,1193.6666666666667,501.66666666666669,1285.3333333333333,1929,0,1691,764.33333333333337,2545.3333333333335,204.66666666666666,255,1481,318.66666666666669,1714,831.66666666666663,4984.333333333333,3253.6666666666665,159,10775,1299.3333333333333,665,2912.3333333333335,368.66666666666669,1817.6666666666667,447.66666666666669,3606,8585.6666666666661,668.66666666666663,35,2485.6666666666665,1667.6666666666667,405.33333333333331,5025.666666666667,895.33333333333337,1040.6666666666667]
[null,"Arizona",null,null,null,null,null,null,null,null,null,null,null,null,null,null,null,null,null,null,null,null,null,null,null,null,null,null,null,null,null,null,null,null,null,null,null,null,null,null,null,null,null,null,null,null,null,null,null,null,null,null,null,null,null,null,"Minnesota",266,1169,4165,279,6233,2521,211,176,306,2575,1776,227,231,6641,1120,4948,1067,402,519,172,1259,1092,2631,0,196,1549,1020,734,540,183,513,151,1309,1673,7316,1035,284,738,730,123,1597,3237,1155,2619,1013,0,2371,1328,200,17929,343,39,123,893,2314,951,6638,2662,74,86,367,2820,840,901,402,8209,786,6175,606,755,573,321,424,970,5164,0,549,1345,1457,1936,2682,21,631,540,2416,845,7574,1961,546,1800,870,0,447,5305,874,3062,919,177,1034,1413,92,19255,224,54,1299,523,3065,375,8086,3565,696,0,310,2372,2235,1277,575,5896,2026,7220,924,57,791,187,1841,814,2212,0,202,1709,1257,992,932,0,1038,322,1849,1745,6672,2635,1212,781,1106,299,1705,3442,1738,4001,429,77,1037,1685,0,17618,213,134,562.66666666666663,861.66666666666663,3181.3333333333335,535,6985.666666666667,2916,327,87.333333333333329,327.66666666666669,2589,1617,801.66666666666663,402.66666666666669,6915.333333333333,1310.6666666666667,6114.333333333333,865.66666666666663,404.66666666666669,627.66666666666663,226.66666666666666,1174.6666666666667,958.66666666666663,3335.6666666666665,0,315.66666666666669,1534.3333333333333,1244.6666666666667,1220.6666666666667,1384.6666666666667,68,727.33333333333337,337.66666666666669,1858,1421,7187.333333333333,1877,680.66666666666663,1106.3333333333333,902,140.66666666666666,1249.6666666666667,3994.6666666666665,1255.6666666666667,3227.3333333333335,787,84.666666666666671,1480.6666666666667,1475.3333333333333,97.333333333333329,18267.333333333332,260,75.666666666666671]
["2010-01-01",1001991,null,null,null,null,null,null,null,null,null,null,null,null,null,null,null,null,null,null,null,null,null,null,null,null,null,null,null,null,null,null,null,null,null,null,null,null,null,null,null,null,null,null,null,null,null,null,null,null,null,null,null,null,null,null,"Mississippi",8306,1192,187,4941,3000,1167,71,0,0,4814,4014,276,121,3030,1403,114,330,407,7390,0,649,107,2495,863,0,959,314,0,408,0,403,633,1026,2227,0,1312,663,0,750,145,1860,56,8158,5755,232,0,572,508,94,879,490,814,8922,117,556,2315,4723,484,54,0,415,6152,3136,369,55,2068,611,650,66,1626,7139,0,265,1445,1610,614,0,1581,0,118,84,65,269,1075,364,483,0,991,566,74,2568,41,398,6,7683,5243,332,0,1453,286,303,1136,0,318,5141,0,710,2680,4371,799,106,0,97,4676,2669,184,586,2703,1200,160,400,446,8588,163,379,67,1768,568,0,2634,166,138,526,60,2127,86,1492,1709,98,896,562,465,613,185,596,79,11643,7230,454,0,1929,433,0,611,307,81,7456.333333333333,436.33333333333331,484.33333333333331,3312,4031.3333333333335,816.66666666666663,77,0,170.66666666666666,5214,3273,276.33333333333331,254,2600.3333333333335,1071.3333333333333,308,265.33333333333331,826.33333333333337,7705.666666666667,54.333333333333336,431,539.66666666666663,1957.6666666666667,681.66666666666663,0,1724.6666666666667,160,85.333333333333329,339.33333333333331,41.666666666666664,933,598,960.66666666666663,1473,32.666666666666664,1066.3333333333333,597,179.66666666666666,1310.3333333333333,123.66666666666667,951.33333333333337,47,9161.3333333333339,6076,339.33333333333331,0,1318,409,132.33333333333334,875.33333333333337,265.66666666666669,404.33333333333331]
["2011-01-01",1028366,null,null,null,null,null,null,null,null,null,null,null,null,null,null,null,null,null,null,null,null,null,null,null,null,null,null,null,null,null,null,null,null,null,null,null,null,null,null,null,null,null,null,null,null,null,null,null,null,null,null,null,null,null,null,"Missouri",819,1051,2988,4381,9840,1903,243,314,478,8317,2492,380,830,21277,3351,4708,23427,2552,2238,171,1359,1395,2610,1701,1183,0,220,2636,1060,108,1320,150,2630,1825,848,2163,4647,314,1639,0,954,512,3311,12884,1319,498,3206,1107,177,1331,359,867,1395,2043,2356,6168,8386,3144,1516,0,215,4513,2964,871,560,20161,4404,4811,20884,1993,1728,291,716,463,2830,2026,1641,0,845,4860,1544,769,1114,1016,2904,3669,977,3240,6073,777,1810,359,267,361,2676,10293,1697,88,2684,2518,196,1503,1120,709,1333,2186,2297,9434,10717,3798,410,234,144,8374,3451,2114,596,22001,4184,5956,20218,2291,1178,996,1246,810,2964,2798,1110,0,511,1999,836,35,960,451,2834,3988,636,3557,5298,1186,1535,361,2856,527,3122,9278,3287,318,2609,2312,148,2636,810,826,1182.3333333333333,1760,2547,6661,9647.6666666666661,2948.3333333333335,723,182.66666666666666,279,7068,2969,1121.6666666666667,662,21146.333333333332,3979.6666666666665,5158.333333333333,21509.666666666668,2278.6666666666665,1714.6666666666667,486,1107,889.33333333333337,2801.3333333333335,2175,1311.3333333333333,0,525.33333333333337,3165,1146.6666666666667,304,1131.3333333333333,539,2789.3333333333335,3160.6666666666665,820.33333333333337,2986.6666666666665,5339.333333333333,759,1661.3333333333333,240,1359,466.66666666666669,3036.3333333333335,10818.333333333334,2101,301.33333333333331,2833,1979,173.66666666666666,1823.3333333333333,763,800.66666666666663]
[null,null,null,null,null,null,null,null,null,null,null,null,null,null,null,null,null,null,null,null,null,null,null,null,null,null,null,null,null,null,null,null,null,null,null,null,null,null,null,null,null,null,null,null,null,null,null,null,null,null,null,null,null,null,null,null,"Montana",212,650,1909,672,5756,2185,128,71,0,1373,46,0,1458,1094,251,169,60,321,85,76,51,59,648,1323,242,564,0,340,548,0,0,660,246,1072,1677,89,182,1620,419,0,110,295,111,2101,964,0,497,3250,0,357,1689,11,449,1118,1971,49,3033,2856,58,365,0,291,231,32,1543,765,646,417,845,0,0,71,57,10,353,969,0,158,0,384,688,0,889,264,422,1173,360,321,96,1959,840,0,77,227,266,1329,1232,53,278,3835,14,146,2413,353,31,726,1548,63,5428,2135,0,0,0,1875,292,556,3385,542,163,415,224,367,0,225,33,97,822,481,32,447,0,108,968,115,156,259,482,1082,977,402,1018,2950,457,0,230,191,45,1393,260,87,156,4783,0,750,934,0,230.66666666666666,831.33333333333337,1809.3333333333333,261.33333333333331,4739,2392,62,145.33333333333334,0,1179.6666666666667,189.66666666666666,196,2128.6666666666665,800.33333333333337,353.33333333333331,333.66666666666669,376.33333333333331,229.33333333333334,28.333333333333332,124,47,55.333333333333336,607.66666666666663,924.33333333333337,91.333333333333329,389.66666666666669,0,277.33333333333331,734.66666666666663,38.333333333333336,348.33333333333331,394.33333333333331,383.33333333333331,1109,1004.6666666666666,270.66666666666669,432,2176.3333333333335,572,0,139,237.66666666666666,140.66666666666666,1607.6666666666667,818.66666666666663,46.666666666666664,310.33333333333331,3956,4.666666666666667,417.66666666666669,1678.6666666666667,121.33333333333333]
[null,null,null,null,null,null,null,null,null,null,null,null,null,null,null,null,null,null,null,null,null,null,null,null,null,null,null,null,null,null,null,null,null,null,null,null,null,null,null,null,null,null,null,null,null,null,null,null,null,null,null,null,null,null,null,null,"Nebraska",232,35,2322,674,4430,4182,361,177,0,1775,1202,257,127,1820,639,5536,2484,153,89,0,77,100,726,2254,823,2723,112,0,232,0,143,831,111,442,777,1232,702,506,345,0,65,2936,77,4445,537,0,772,1230,73,1046,1478,0,169,721,1646,161,5124,3245,381,0,29,1105,434,275,506,1415,615,9575,3040,352,222,122,318,0,683,1455,424,1848,64,0,240,0,119,242,544,829,292,268,1255,1556,252,0,243,2999,226,5343,734,0,615,835,24,560,965,0,245,626,2406,363,3438,2023,0,0,0,1368,786,165,315,1193,290,6815,3103,131,411,68,129,195,258,1489,176,2223,108,0,233,0,524,158,318,874,497,563,587,106,702,0,456,2507,232,3130,229,79,1076,1327,111,316,917,0,215.33333333333334,460.66666666666669,2124.6666666666665,399.33333333333331,4330.666666666667,3150,247.33333333333334,59,9.6666666666666661,1416,807.33333333333337,232.33333333333334,316,1476,514.66666666666663,7308.666666666667,2875.6666666666665,212,240.66666666666666,63.333333333333336,174.66666666666666,98.333333333333329,555.66666666666663,1732.6666666666667,474.33333333333331,2264.6666666666665,94.666666666666671,0,235,0,262,410.33333333333331,324.33333333333331,715,522,687.66666666666663,848,722.66666666666663,433,0,254.66666666666666,2814,178.33333333333334,4306,500,26.333333333333332,821,1130.6666666666667,69.333333333333329,640.66666666666663,1120,0]
[null,null,null,null,null,null,null,null,null,null,null,null,null,null,null,null,null,null,null,null,null,null,null,null,null,null,null,null,null,null,null,null,null,null,null,null,null,null,null,null,null,null,null,null,null,null,null,null,null,null,null,null,null,null,null,null,"Nevada",150,511,7818,530,35472,2935,648,0,0,3579,1187,4363,1686,1711,739,543,453,569,733,0,485,1275,2202,805,946,1747,770,1129,0,59,1528,1220,1204,957,37,1554,886,2629,1567,167,312,1203,706,5224,4500,197,1832,3290,56,419,144,502,280,597,10142,310,40114,2714,189,184,983,2923,1731,4093,3929,1668,855,114,602,628,78,49,931,256,1663,1055,203,335,1137,32,0,0,2118,2136,1516,1333,0,1354,258,1691,570,86,165,588,96,7249,3365,0,1740,4680,0,2672,933,153,761,2161,8748,353,49978,6402,143,373,468,3381,745,2053,1503,2822,362,714,1202,952,421,209,934,318,1235,1157,783,694,1086,714,0,175,912,1138,3521,767,702,1407,1520,3101,1601,336,480,0,1699,5484,4605,121,1135,2997,100,1046,766,237,397,1089.6666666666667,8902.6666666666661,397.66666666666669,41854.666666666664,4017,326.66666666666669,185.66666666666666,483.66666666666669,3294.3333333333335,1221,3503,2372.6666666666665,2067,652,457,752.33333333333337,716.33333333333337,410.66666666666669,86,783.33333333333337,616.33333333333337,1700,1005.6666666666666,644,925.33333333333337,997.66666666666663,625,0,78,1519.3333333333333,1498,2080.3333333333335,1019,246.33333333333334,1438.3333333333333,888,2473.6666666666665,1246,196.33333333333334,319,597,833.66666666666663,5985.666666666667,4156.666666666667,106,1569,3655.6666666666665,52,1379,614.33333333333337,297.33333333333331]
[null,null,null,null,null,null,null,null,null,null,null,null,null,null,null,null,null,null,null,null,null,null,null,null,null,null,null,null,null,null,null,null,null,null,null,null,null,null,null,null,null,null,null,null,null,null,null,null,null,null,null,null,null,null,null,null,"New Hampshire",152,0,544,0,1692,240,3134,0,298,1659,0,51,66,850,23,109,57,0,19,3242,49,13752,230,240,25,295,486,0,95,0,540,276,2462,471,0,28,0,508,674,988,51,0,372,1570,279,2566,745,261,0,268,0,56,193,0,246,22,547,403,1617,20,68,1970,535,0,0,478,470,47,0,0,0,3080,222,15526,155,104,160,153,230,33,186,0,294,186,1471,1297,47,248,0,198,1015,608,588,86,126,605,158,2138,880,428,0,0,162,0,0,437,440,0,1514,572,1345,0,101,2746,470,43,20,673,297,53,102,284,7,6118,33,18990,426,0,0,289,0,110,0,0,591,223,2905,1609,0,324,186,208,890,1248,323,0,77,2150,557,2960,660,113,80,239,71,75,115,145.66666666666666,410,7.333333333333333,1251,405,2032,6.666666666666667,155.66666666666666,2125,335,31.333333333333332,28.666666666666668,667,263.33333333333331,69.666666666666671,53,94.666666666666671,8.6666666666666661,4146.666666666667,101.33333333333333,16089.333333333334,270.33333333333331,114.66666666666667,61.666666666666664,245.66666666666666,238.66666666666666,47.666666666666664,93.666666666666671,0,475,228.33333333333334,2279.3333333333335,1125.6666666666667,15.666666666666666,200,62,304.66666666666669,859.66666666666663,948,320.66666666666669,28.666666666666668,191.66666666666666,1441.6666666666667,331.33333333333331,2554.6666666666665,761.66666666666663,267.33333333333331,26.666666666666668,169,77.666666666666671,43.666666666666664]
[null,null,null,null,null,null,null,null,null,null,null,null,null,null,null,null,null,null,null,null,null,null,null,null,null,null,null,null,null,null,null,null,null,null,null,null,null,null,null,null,null,null,null,null,null,null,null,null,null,null,null,null,null,null,null,null,"New Jersey",616,383,1625,258,8777,807,2503,1543,431,9841,4588,385,91,2656,402,332,442,91,249,95,4231,2626,1070,322,450,727,122,261,874,705,0,421,41374,3052,0,1584,32,613,22225,332,1134,0,852,3434,178,57,2670,964,358,586,0,2732,189,1198,3784,57,5986,2203,1924,2100,781,12907,4268,264,256,3690,718,332,317,102,871,624,5335,4675,1889,1261,510,583,49,312,899,499,0,355,40815,2482,61,1121,773,360,19733,463,1586,0,1412,3801,256,0,4458,2454,1252,214,15,4312,779,359,1328,57,4330,380,3466,1921,840,10649,3002,22,113,2052,1039,357,426,631,339,430,3474,4907,324,570,106,384,67,35,908,126,0,45,40495,3236,55,1452,1540,760,23597,429,2372,581,1400,2509,425,35,5024,1847,297,680,23,2574,528,646.66666666666663,2245.6666666666665,124,6364.333333333333,1130,2631,1854.6666666666667,684,11132.333333333334,3952.6666666666665,223.66666666666666,153.33333333333334,2799.3333333333335,719.66666666666663,340.33333333333331,395,274.66666666666669,486.33333333333331,383,4346.666666666667,4069.3333333333335,1094.3333333333333,717.66666666666663,355.33333333333331,564.66666666666663,79.333333333333329,202.66666666666666,893.66666666666663,443.33333333333331,0,273.66666666666669,40894.666666666664,2923.3333333333335,38.666666666666664,1385.6666666666667,781.66666666666663,577.66666666666663,21851.666666666668,408,1697.3333333333333,193.66666666666666,1221.3333333333333,3248,286.33333333333331,30.666666666666668,4050.6666666666665,1755,635.66666666666663,493.33333333333331,12.666666666666666,3206]
[null,null,null,null,null,null,null,null,null,null,null,null,null,null,null,null,null,null,null,null,null,null,null,null,null,null,null,null,null,null,null,null,null,null,null,null,null,null,null,null,null,null,null,null,null,null,null,null,null,null,null,null,null,null,null,null,"New Mexico",751,969,6117,77,6547,2852,25,391,56,3259,1977,122,755,526,465,0,751,739,65,94,1968,2076,1460,179,719,138,1003,530,4192,79,160,0,784,1793,79,1712,1182,1659,809,46,152,204,1269,18511,1601,309,290,3004,0,407,752,632,410,416,7444,682,7066,5525,0,0,212,2806,676,81,355,466,2030,0,1333,87,184,510,2277,252,908,438,556,1183,544,353,2099,114,245,0,1445,522,264,1742,234,916,492,0,145,240,899,13633,303,71,425,924,0,340,283,99,787,320,6391,410,4536,4780,280,100,25,4707,192,168,355,790,660,384,672,159,790,57,505,303,602,284,451,1216,139,194,604,268,252,0,1111,335,41,1178,1076,932,822,0,325,509,338,11955,1382,81,1560,1251,0,321,95,429,649.33333333333337,568.33333333333337,6650.666666666667,389.66666666666669,6049.666666666667,4385.666666666667,101.66666666666667,163.66666666666666,97.666666666666671,3590.6666666666665,948.33333333333337,123.66666666666667,488.33333333333331,594,1051.6666666666667,128,918.66666666666663,328.33333333333331,346.33333333333331,220.33333333333334,1583.3333333333333,877,990,300.33333333333331,575.33333333333337,845.66666666666663,562,359,2298.3333333333335,153.66666666666666,219,0,1113.3333333333333,883.33333333333337,128,1544,830.66666666666663,1169,707.66666666666663,15.333333333333334,207.33333333333334,317.66666666666669,835.33333333333337,14699.666666666666,1095.3333333333333,153.66666666666666,758.33333333333337,1726.3333333333333,0,356,376.66666666666669,386.66666666666669]
[null,null,null,null,null,null,null,null,null,null,null,null,null,null,null,null,null,null,null,null,null,null,null,null,null,null,null,null,null,null,null,null,null,null,null,null,null,null,null,null,null,null,null,null,null,null,null,null,null,null,null,null,null,null,null,null,"New York",1310,5070,2649,362,25177,3135,15338,2603,1983,30553,7676,259,198,6533,2497,477,1189,804,1321,2270,5912,16855,4779,1649,872,1870,237,886,2077,2636,35333,829,0,13322,0,6510,2298,2284,20514,1913,7161,521,1730,9692,910,2900,8881,2503,444,2354,151,6740,1812,6124,2821,1041,25761,3724,15123,1124,3702,29344,10584,1002,434,6914,2198,928,838,2414,1495,2915,5037,14646,3936,1824,401,1417,391,579,1785,2972,41450,461,0,9336,374,5191,1425,2189,26596,1393,6947,112,2660,9151,773,3882,10800,2986,631,1878,688,10582,1364,4002,4146,247,24623,3596,14595,477,3936,27392,7592,1598,607,8017,3040,955,1437,1753,1083,1345,7321,15073,5191,1059,773,3310,421,78,600,2760,42574,646,0,10544,77,4625,1327,1055,22895,3222,5952,0,1279,11231,622,2764,7939,2614,921,979,396,7321,1495.3333333333333,5065.333333333333,3205.3333333333335,550,25187,3485,15018.666666666666,1401.3333333333333,3207,29096.333333333332,8617.3333333333339,953,413,7154.666666666667,2578.3333333333335,786.66666666666663,1154.6666666666667,1657,1299.6666666666667,2176.6666666666665,6090,15524.666666666666,4635.333333333333,1510.6666666666667,682,2199,349.66666666666669,514.33333333333337,1487.3333333333333,2789.3333333333335,39785.666666666664,645.33333333333337,0,11067.333333333334,150.33333333333334,5442,1683.3333333333333,1842.6666666666667,23335,2176,6686.666666666667,211,1889.6666666666667,10024.666666666666,768.33333333333337,3182,9206.6666666666661,2701,665.33333333333337,1737,411.66666666666669,8214.3333333333339]
["pvtState2Population",null,null,null,null,null,null,null,null,null,null,null,null,null,null,null,null,null,null,null,null,null,null,null,null,null,null,null,null,null,null,null,null,null,null,null,null,null,null,null,null,null,null,null,null,null,null,null,null,null,null,null,null,null,null,null,"North Carolina",3044,1618,2847,550,16699,1842,3752,479,1691,28983,15943,1567,724,5657,4132,1077,2192,4419,2180,2259,9881,4052,5789,1839,1187,1932,230,516,698,2130,7195,1186,19406,0,243,8661,1453,1796,11155,97,23196,362,8685,14329,790,350,25662,2874,3025,2012,870,1950,5420,3991,4286,327,15373,3919,1975,954,1135,28044,16192,1806,675,5971,3228,654,4995,1637,2936,824,10485,9053,7530,1294,1273,2638,563,1056,1048,2078,10374,1737,18321,0,189,10187,1390,1175,9450,444,20427,565,6057,6621,961,212,27302,3295,2780,2291,153,844,4329,1458,3493,861,13883,4790,4914,2180,1801,26365,16823,1566,334,6378,4532,775,1595,1531,919,1259,9005,3710,6161,1523,2377,2623,244,628,1627,754,11468,1138,19891,0,206,9337,1263,1333,12179,290,25532,351,9230,12638,1189,445,26759,5915,2677,2266,604,2025,4264.333333333333,2355.6666666666665,3542,579.33333333333337,15318.333333333334,3517,3547,1204.3333333333333,1542.3333333333333,27797.333333333332,16319.333333333334,1646.3333333333333,577.66666666666663,6002,3964,835.33333333333337,2927.3333333333335,2529,2011.6666666666667,1447.3333333333333,9790.3333333333339,5605,6493.333333333333,1552,1612.3333333333333,2397.6666666666665,345.66666666666669,733.33333333333337,1124.3333333333333,1654,9679,1353.6666666666667,19206,0,212.66666666666666,9395,1368.6666666666667,1434.6666666666667,10928,277,23051.666666666668,426,7990.666666666667,11196,980,335.66666666666669,26574.333333333332,4028,2827.3333333333335,2189.6666666666665,542.33333333333337,1606.3333333333333]
["Sum of Population",null,null,null,null,null,null,null,null,null,null,null,null,null,null,null,null,null,null,null,null,null,null,null,null,null,null,null,null,null,null,null,null,null,null,null,null,null,null,null,null,null,null,null,null,null,null,null,null,null,null,null,null,null,null,null,"North Dakota",109,1066,662,168,1411,873,30,0,175,492,799,53,69,39,45,289,114,97,374,0,121,52,298,12350,0,197,1236,328,382,0,144,380,188,637,0,134,108,313,392,0,0,1038,273,2513,462,0,25,696,0,749,219,0,97,393,1313,249,1356,1229,0,84,0,459,364,138,1209,571,130,208,75,0,422,50,10,369,328,12244,80,330,1227,218,845,0,183,99,264,900,0,286,59,264,652,0,1,1293,113,1862,429,0,166,404,0,1398,139,76,83,70,1571,0,999,546,65,0,70,950,98,160,540,799,55,458,161,22,18,98,232,187,757,15257,72,1490,1776,950,854,0,140,161,331,231,0,6,280,724,114,244,14,1754,746,1414,43,758,403,1604,0,543,365,0,96.333333333333329,509.66666666666669,1182,139,1255.3333333333333,882.66666666666663,31.666666666666668,28,81.666666666666671,633.66666666666663,420.33333333333331,117,606,469.66666666666669,76.666666666666671,318.33333333333331,116.66666666666667,39.666666666666664,271.33333333333331,49.333333333333336,121,202.66666666666666,461,13283.666666666666,50.666666666666664,672.33333333333337,1413,498.66666666666669,693.66666666666663,0,155.66666666666666,213.33333333333334,261,589.33333333333337,0,142,149,433.66666666666669,386,81.333333333333329,5,1361.6666666666667,377.33333333333331,1929.6666666666667,311.33333333333331,252.66666666666666,198,901.33333333333337,0,896.66666666666663,241,25.333333333333332]
[null,"Oregon",null,null,null,null,null,null,null,null,null,null,null,null,null,null,null,null,null,null,null,null,null,null,null,null,null,null,null,null,null,null,null,null,null,null,null,null,null,null,null,null,null,null,null,null,null,null,null,null,null,null,null,null,null,null,"Ohio",1289,1556,4715,434,8997,2859,1307,15,972,16495,9502,436,564,7092,9438,1270,1016,9159,743,291,3828,3686,15130,2298,89,1171,460,1531,2240,175,2465,515,5988,5985,26,0,1228,342,12012,444,2479,207,4987,7465,485,182,6769,2567,7814,1771,144,2140,1567,1637,6763,1952,9032,2690,1189,263,587,16492,4290,1044,312,7027,11588,1146,657,12744,1872,0,4982,2101,14330,1788,691,2003,101,1176,1851,1992,3936,255,8784,4572,204,0,2333,1326,14292,369,3826,34,6468,11987,691,68,5425,1979,7548,2534,1280,1607,3705,2207,4929,884,8995,3180,1355,1079,985,16366,8052,1198,412,9510,13534,1039,1166,13227,2214,1189,5026,2189,16336,1122,1017,3026,276,1052,907,189,4703,1361,8732,5498,453,0,858,432,14147,435,2445,47,3542,11760,197,364,3193,2862,7820,974,202,1403,2187,1800,5469,1090,9008,2909.6666666666665,1283.6666666666667,452.33333333333331,848,16451,7281.333333333333,892.66666666666663,429.33333333333331,7876.333333333333,11520,1151.6666666666667,946.33333333333337,11710,1609.6666666666667,493.33333333333331,4612,2658.6666666666665,15265.333333333334,1736,599,2066.6666666666665,279,1253,1666,785.33333333333337,3701.3333333333335,710.33333333333337,7834.666666666667,5351.666666666667,227.66666666666666,0,1473,700,13483.666666666666,416,2916.6666666666665,96,4999,10404,457.66666666666669,204.66666666666666,5129,2469.3333333333335,7727.333333333333,1759.6666666666667,542,1716.6666666666667]
["2010-01-01",3794008,null,null,null,null,null,null,null,null,null,null,null,null,null,null,null,null,null,null,null,null,null,null,null,null,null,null,null,null,null,null,null,null,null,null,null,null,null,null,null,null,null,null,null,null,null,null,null,null,null,null,null,null,null,null,"Oklahoma",1612,1397,2759,5873,9429,3184,68,109,0,5438,3159,773,611,2679,957,1108,5024,877,2208,298,382,465,1047,599,1733,4102,448,829,1079,69,890,2723,1118,1991,139,1385,0,398,1316,119,596,83,1872,28238,428,93,2286,2035,221,551,1713,209,591,1137,3770,6894,8233,3273,97,66,191,6056,3514,140,21,2179,2113,580,4626,1398,1934,271,432,160,1038,497,199,5781,803,1979,705,0,391,403,1858,1322,928,1608,0,917,1116,152,2015,600,1700,31595,587,0,1013,1246,44,942,1763,105,1030,1279,2974,5777,8950,4717,0,380,151,5011,2581,189,905,1100,1490,1088,7065,1354,2562,167,750,1233,1347,906,1850,5210,798,300,1101,549,1523,1244,1981,1961,308,1148,0,1261,494,0,569,108,2471,25508,2588,197,1749,1574,368,1061,45,0,1077.6666666666667,1271,3167.6666666666665,6181.333333333333,8870.6666666666661,3724.6666666666665,55,185,114,5501.666666666667,3084.6666666666665,367.33333333333331,512.33333333333337,1986,1520,925.33333333333337,5571.666666666667,1209.6666666666667,2234.6666666666665,245.33333333333334,521.33333333333337,619.33333333333337,1144,667.33333333333337,1260.6666666666667,5031,683,1036,961.66666666666663,206,934.66666666666663,1456.6666666666667,1652.3333333333333,1758,458.33333333333331,1380.3333333333333,0,858.66666666666663,975.33333333333337,90.333333333333329,1060,263.66666666666669,2014.3333333333333,28447,1201,96.666666666666671,1682.6666666666667,1618.3333333333333,211,851.33333333333337,1173.6666666666667,104.66666666666667]
["2011-01-01",3828714,null,null,null,null,null,null,null,null,null,null,null,null,null,null,null,null,null,null,null,null,null,null,null,null,null,null,null,null,null,null,null,null,null,null,null,null,null,null,null,null,null,null,null,null,null,null,null,null,null,null,null,null,null,null,"Oregon",400,2027,5264,246,34190,2050,270,0,217,2273,688,2323,4129,1565,317,161,678,0,0,0,595,1471,1159,668,735,1786,3386,777,2805,317,544,981,2538,1040,592,1541,821,0,1689,0,989,741,787,3826,2879,456,1124,22793,358,1981,523,821,758,1935,7911,988,34214,2110,949,251,349,3384,1946,2491,6236,1350,1371,659,1263,71,0,269,453,1423,1652,1413,7,1172,1079,324,7222,427,1322,537,2056,1099,313,949,2034,0,1407,0,370,417,673,4498,3443,176,1179,21862,66,914,914,4,373,2513,7954,165,31862,4472,381,0,696,1660,1032,2501,5093,1676,1380,834,556,202,227,446,457,760,570,1792,186,403,2192,570,5935,39,385,920,2379,1482,42,1411,725,0,904,177,461,119,802,3347,4793,367,676,21224,593,426,765,152,510.33333333333331,2158.3333333333335,7043,466.33333333333331,33422,2877.3333333333335,533.33333333333337,83.666666666666671,420.66666666666669,2439,1222,2438.3333333333335,5152.666666666667,1530.3333333333333,1022.6666666666666,551.33333333333337,832.33333333333337,91,75.666666666666671,238.33333333333334,501.66666666666669,1218,1127,1291,309.33333333333331,1120.3333333333333,2219,557,5320.666666666667,261,750.33333333333337,812.66666666666663,2324.3333333333335,1207,315.66666666666669,1300.3333333333333,1193.3333333333333,0,1333.3333333333333,59,606.66666666666663,425.66666666666669,754,3890.3333333333335,3705,333,993,21959.666666666668,339,1107,734,325.66666666666669]
["2012-01-01",3857465,null,null,null,null,null,null,null,null,null,null,null,null,null,null,null,null,null,null,null,null,null,null,null,null,null,null,null,null,null,null,null,null,null,null,null,null,null,null,null,null,null,null,null,null,null,null,null,null,null,null,null,null,null,null,"Pennsylvania",369,2185,3668,807,12077,3657,4007,4608,1621,18212,4644,332,380,4490,2018,227,1426,1675,625,1621,18281,4455,4961,1491,563,1725,339,551,1810,729,42456,1250,30481,7611,521,14545,1254,918,0,377,1315,966,1611,7778,1048,215,10558,2495,4258,1300,1069,6275,1332,759,2278,582,10672,2491,4150,5177,1401,19299,4627,495,236,3902,4086,1176,2323,4013,615,608,17751,6284,4406,853,1238,1761,338,582,1057,1326,36133,325,29436,11254,195,13075,283,1594,0,799,3438,142,3742,7006,1246,446,8419,3688,4631,2426,195,2723,1926,1658,3529,573,7772,2574,3311,4814,2921,14631,4337,245,359,3749,1599,125,967,1233,694,988,17529,5900,2642,1169,55,1171,135,214,1600,1138,33791,1001,32898,6380,166,14319,378,234,0,771,3023,159,1273,6768,1276,1012,11960,1787,6762,1550,434,7847,1209,1534,3158.3333333333335,654,10173.666666666666,2907.3333333333335,3822.6666666666665,4866.333333333333,1981,17380.666666666668,4536,357.33333333333331,325,4047,2567.6666666666665,509.33333333333331,1572,2307,644.66666666666663,1072.3333333333333,17853.666666666668,5546.333333333333,4003,1171,618.66666666666663,1552.3333333333333,270.66666666666669,449,1489,1064.3333333333333,37460,858.66666666666663,30938.333333333332,8415,294,13979.666666666666,638.33333333333337,915.33333333333337,0,649,2592,422.33333333333331,2208.6666666666665,7184,1190,557.66666666666663,10312.333333333334,2656.6666666666665,5217,1758.6666666666667,566,5615]
[null,null,null,null,null,null,null,null,null,null,null,null,null,null,null,null,null,null,null,null,null,null,null,null,null,null,null,null,null,null,null,null,null,null,null,null,null,null,null,null,null,null,null,null,null,null,null,null,null,null,null,null,null,null,null,null,"Puerto Rico",629,156,288,0,1177,388,899,0,0,11262,207,0,0,1642,109,0,112,254,109,0,59,2004,89,50,170,221,0,0,0,0,1244,364,4768,146,0,69,0,0,1516,684,109,0,30,977,882,0,392,0,141,585,0,0,35,378,229,0,207,0,1849,13,212,6614,247,0,13,624,784,0,38,0,0,0,70,1412,88,0,27,101,0,0,0,0,2150,51,2615,200,0,0,79,0,1978,490,3,113,224,444,0,0,1077,41,14,229,0,0,8,57,54,93,519,0,370,0,0,4192,232,110,0,1021,121,0,143,37,59,0,108,2258,435,0,0,0,0,0,0,0,1922,28,2314,638,0,328,0,0,2313,624,4,0,15,360,0,0,684,0,8,989,0,0,224,197,190.33333333333334,31,634.33333333333337,129.33333333333334,1039.3333333333333,4.333333333333333,70.666666666666671,7356,228.66666666666666,36.666666666666664,4.333333333333333,1095.6666666666667,338,0,97.666666666666671,97,56,0,79,1891.3333333333333,204,16.666666666666668,65.666666666666671,107.33333333333333,0,0,0,0,1772,147.66666666666666,3232.3333333333335,328,0,132.33333333333334,26.333333333333332,0,1935.6666666666667,599.33333333333337,38.666666666666664,37.666666666666664,89.666666666666671,593.66666666666663,294,0,717.66666666666663,13.666666666666666,54.333333333333336,601,0,0]
[null,null,null,null,null,null,null,null,null,null,null,null,null,null,null,null,null,null,null,null,null,null,null,null,null,null,null,null,null,null,null,null,null,null,null,null,null,null,null,null,null,null,null,null,null,null,null,null,null,null,null,null,null,null,null,null,"Rhode Island",136,0,324,0,1697,59,4090,0,146,1336,382,274,0,1210,206,48,0,0,0,447,977,8639,77,47,0,47,0,0,297,333,1868,0,4583,1376,62,0,199,0,560,0,61,48,71,678,0,72,1399,160,150,0,0,276,0,0,214,0,1949,301,2613,0,0,2230,476,0,107,373,41,82,374,211,121,228,472,7715,178,27,0,109,0,0,0,941,1224,93,2776,259,0,60,0,57,1125,0,223,0,210,207,181,621,485,262,199,2,23,293,20,0,93,0,2146,332,4170,0,313,2752,168,120,0,385,0,0,27,286,24,279,482,11253,230,131,0,210,0,188,25,611,1219,36,3603,478,0,63,0,139,735,0,481,0,120,823,0,53,1008,287,0,135,21,116,52,0,210.33333333333334,0,1930.6666666666667,230.66666666666666,3624.3333333333335,0,153,2106,342,131.33333333333334,35.666666666666664,656,82.333333333333329,43.333333333333336,133.66666666666666,165.66666666666666,48.333333333333336,318,643.66666666666663,9202.3333333333339,161.66666666666666,68.333333333333329,0,122,0,62.666666666666664,107.33333333333333,628.33333333333337,1437,43,3654,704.33333333333337,20.666666666666668,41,66.333333333333329,65.333333333333329,806.66666666666663,0,255,16,133.66666666666666,569.33333333333337,60.333333333333336,248.66666666666666,964,236.33333333333334,116.33333333333333,45.666666666666664,14.666666666666666,228.33333333333334]
[null,null,null,null,null,null,null,null,null,null,null,null,null,null,null,null,null,null,null,null,null,null,null,null,null,null,null,null,null,null,null,null,null,null,null,null,null,null,null,null,null,null,null,null,null,null,null,null,null,null,null,null,null,null,null,null,"South Carolina",1741,1670,1457,365,4691,1867,3998,249,38,16060,17486,813,233,4253,2174,703,514,2211,2059,603,5184,3765,3709,818,1175,1371,0,0,1173,486,4908,1390,7912,20749,118,3883,1458,1020,4689,154,0,95,3816,4965,455,478,9786,3070,1190,1057,382,269,2999,2421,1971,1333,6592,1000,1752,841,589,15476,16355,712,55,2371,3249,1379,1885,2454,878,652,3807,730,4483,471,2163,1522,915,204,1017,372,4241,598,11317,23102,271,6327,1008,833,3523,453,0,62,3324,8623,181,91,7879,2510,1680,341,632,2166,1665,1244,2222,839,5979,1915,1590,697,435,11552,18570,638,198,2125,3802,643,1064,1924,2709,2077,3565,2313,2966,757,1407,1884,93,158,1025,917,6517,1052,10746,24764,656,4388,555,255,6497,538,0,816,3550,5351,566,298,9377,1629,1345,832,0,1070,2135,1778.3333333333333,1883.3333333333333,845.66666666666663,5754,1594,2446.6666666666665,595.66666666666663,354,14362.666666666666,17470.333333333332,721,162,2916.3333333333335,3075,908.33333333333337,1154.3333333333333,2196.3333333333335,1882,1110.6666666666667,4185.333333333333,2269.3333333333335,3719.3333333333335,682,1581.6666666666667,1592.3333333333333,336,120.66666666666667,1071.6666666666667,591.66666666666663,5222,1013.3333333333334,9991.6666666666661,22871.666666666668,348.33333333333331,4866,1007,702.66666666666663,4903,381.66666666666669,0,324.33333333333331,3563.3333333333335,6313,400.66666666666669,289,9014,2403,1405,743.33333333333337,338,1168.3333333333333]
[null,null,null,null,null,null,null,null,null,null,null,null,null,null,null,null,null,null,null,null,null,null,null,null,null,null,null,null,null,null,null,null,null,null,null,null,null,null,null,null,null,null,null,null,null,null,null,null,null,null,null,null,null,null,null,null,"South Dakota",325,25,745,61,1338,807,0,0,0,251,24,75,457,80,439,3520,571,82,129,0,0,407,144,4615,201,252,560,2260,38,0,0,38,758,262,2020,160,296,122,209,0,0,0,0,1334,0,0,224,1564,0,736,648,0,0,554,1422,659,1286,1021,0,0,0,101,69,0,186,267,285,4772,144,211,0,0,254,113,239,5342,129,354,232,1695,110,0,441,513,6,166,2060,84,40,15,57,7,529,0,0,1156,560,0,79,557,0,481,1310,0,0,855,435,227,1494,1744,2,0,0,970,122,8,78,74,210,2441,403,0,0,0,60,61,892,3568,34,474,248,2175,135,0,0,175,371,240,1725,64,21,667,515,0,158,0,507,1715,388,5,340,1026,131,314,979,134,108.33333333333333,478,867.33333333333337,315.66666666666669,1372.6666666666667,1190.6666666666667,0.66666666666666663,0,0,440.66666666666669,71.666666666666671,27.666666666666668,240.33333333333334,140.33333333333334,311.33333333333331,3577.6666666666665,372.66666666666669,97.666666666666671,43,0,104.66666666666667,193.66666666666666,425,4508.333333333333,121.33333333333333,360,346.66666666666669,2043.3333333333333,94.333333333333329,0,147,242,378.33333333333331,222.66666666666666,1935,102.66666666666667,119,268,260.33333333333331,2.3333333333333335,229,0,169,1401.6666666666667,316,1.6666666666666667,214.33333333333334,1049,43.666666666666664,510.33333333333331,979,44.666666666666664]
[null,null,null,null,null,null,null,null,null,null,null,null,null,null,null,null,null,null,null,null,null,null,null,null,null,null,null,null,null,null,null,null,null,null,null,null,null,null,null,null,null,null,null,null,null,null,null,null,null,null,null,null,null,null,null,null,"Tennessee",8897,343,2291,4736,8019,1858,765,248,394,14168,11065,243,333,3162,4764,1052,2506,11188,2602,84,1450,1733,5529,1504,9029,4342,290,187,2433,197,2230,621,4800,7102,0,4462,669,430,2562,805,4765,63,0,8701,2062,0,8650,1412,2201,2831,0,0,9326,531,1346,7393,7130,1372,150,155,307,15491,17507,179,0,8593,5645,387,1805,13884,1901,9,1135,1690,5983,445,9172,3795,43,631,883,132,1396,381,4921,9353,50,5944,3166,726,3360,14,5531,181,0,7009,200,38,6098,2852,1385,1213,131,1083,12116,1281,2250,3306,8396,2473,936,176,180,15641,16012,1058,787,7094,5591,617,2630,13202,2452,1040,1743,1525,4507,1178,10568,2694,308,432,735,271,783,751,6279,5904,7,6200,2495,1080,3329,26,4300,0,0,8716,784,133,8008,1876,3248,1622,358,717,10113,718.33333333333337,1962.3333333333333,5145,7848.333333333333,1901,617,193,293.66666666666669,15100,14861.333333333334,493.33333333333331,373.33333333333331,6283,5333.333333333333,685.33333333333337,2313.6666666666665,12758,2318.3333333333335,377.66666666666669,1442.6666666666667,1649.3333333333333,5339.666666666667,1042.3333333333333,9589.6666666666661,3610.3333333333335,213.66666666666666,416.66666666666669,1350.3333333333333,200,1469.6666666666667,584.33333333333337,5333.333333333333,7453,19,5535.333333333333,2110,745.33333333333337,3083.6666666666665,281.66666666666669,4865.333333333333,81.333333333333329,0,8142,1015.3333333333334,57,7585.333333333333,2046.6666666666667,2278,1888.6666666666667,163,600]
[null,null,null,null,null,null,null,null,null,null,null,null,null,null,null,null,null,null,null,null,null,null,null,null,null,null,null,null,null,null,null,null,null,null,null,null,null,null,null,null,null,null,null,null,null,null,null,null,null,null,null,null,null,null,null,null,"Texas",8636,11613,16521,15251,68959,16361,924,704,460,26668,16671,3718,2033,20169,6985,3946,11598,5153,31149,1318,4724,7139,13775,6088,7773,12061,1027,4893,8324,1067,7058,11752,16624,12183,2452,8317,22969,4373,7161,975,5249,1936,13044,0,4123,52,13713,8847,2221,5927,1874,4180,8747,6670,20073,16461,58992,19126,2927,884,2276,35777,17401,6106,4379,15064,10265,3236,12766,6616,25513,1357,9443,5035,15654,7691,6048,13473,537,3837,7793,459,7578,15225,26155,14956,809,12315,19302,3743,9107,1297,4075,1486,10788,0,5234,349,13231,15325,663,5982,2500,5225,9993,6759,18908,13781,62702,16616,2769,181,1189,31259,20362,5040,2387,19672,8264,4934,12699,6040,29348,1293,4969,4813,9501,2803,6402,12319,1813,4794,8266,761,6797,16762,20274,22660,989,8728,26284,3827,10449,1763,4470,1264,10368,0,4610,113,17734,11630,1729,4192,2472,4435,9125.3333333333339,8347.3333333333339,18500.666666666668,15164.333333333334,63551,17367.666666666668,2206.6666666666665,589.66666666666663,1308.3333333333333,31234.666666666668,18144.666666666668,4954.666666666667,2933,18301.666666666668,8504.6666666666661,4038.6666666666665,12354.333333333334,5936.333333333333,28670,1322.6666666666667,6378.666666666667,5662.333333333333,12976.666666666666,5527.333333333333,6741,12617.666666666666,1125.6666666666667,4508,8127.666666666667,762.33333333333337,7144.333333333333,14579.666666666666,21017.666666666668,16599.666666666668,1416.6666666666667,9786.6666666666661,22851.666666666668,3981,8905.6666666666661,1345,4598,1562,11400,0,4655.666666666667,171.33333333333334,14892.666666666666,11934,1537.6666666666667,5367,2282,4613.333333333333]
["pvtState2SameResidence",null,null,null,null,null,null,null,null,null,null,null,null,null,null,null,null,null,null,null,null,null,null,null,null,null,null,null,null,null,null,null,null,null,null,null,null,null,null,null,null,null,null,null,null,null,null,null,null,null,null,null,null,null,null,null,"United States",99221,94692,176768,64264,573988,140620,89360,30055,56052,427853,244992,49218,53122,277579,130170,66922,90681,92999,88131,32209,159866,144152,178207,104765,68363,148055,35870,43531,109409,38399,193972,50438,363139,207025,24450,188013,90616,100185,209810,24948,117569,27915,143135,411641,75541,18380,232002,166162,49349,111240,28186,59885,106806,88850,211816,77226,562343,160623,91295,26631,49732,437202,248892,61940,57831,269008,143228,74516,94180,99256,86593,33729,165041,145869,186505,103253,68597,138404,31204,52809,115943,43277,216369,61431,377800,225147,26563,206049,81009,109795,215127,31065,121426,29383,154243,404839,73211,18172,229227,190644,45956,105370,31991,76218,109210,84068,206842,64967,566986,161530,87023,25149,59513,428325,252262,61509,55191,277953,144597,73325,93134,103004,95956,38574,157664,158156,175733,115946,66947,142754,33832,48816,98882,38696,219202,63921,405864,238663,23959,199202,102572,108182,237156,30498,127418,22534,163843,402187,82165,20056,238540,180462,47425,97724,32228,74500,105079,89203.333333333328,198475.33333333334,68819,567772.33333333337,154257.66666666666,89226,27278.333333333332,55099,431126.66666666669,248715.33333333334,57555.666666666664,55381.333333333336,274846.66666666669,139331.66666666666,71587.666666666672,92665,98419.666666666672,90226.666666666672,34837.333333333336,160857,149392.33333333334,180148.33333333334,107988,67969,143071,33635.333333333336,48385.333333333336,108078,40124,209847.66666666666,58596.666666666664,382267.66666666669,223611.66666666666,24990.666666666668,197754.66666666666,91399,106054,220697.66666666666,28837,122137.66666666667,26610.666666666668,153740.33333333334,406222.33333333331,76972.333333333328,18869.333333333332,233256.33333333334,179089.33333333334,47576.666666666664,104778,30801.666666666668,70201]
["Sum of Same Residence Last Yr",null,null,null,null,null,null,null,null,null,null,null,null,null,null,null,null,null,null,null,null,null,null,null,null,null,null,null,null,null,null,null,null,null,null,null,null,null,null,null,null,null,null,null,null,null,null,null,null,null,null,null,null,null,null,null,"Utah",93,1798,8147,316,12187,3987,119,0,138,2097,966,932,7692,1831,517,483,299,235,46,148,426,246,261,914,127,1255,1929,118,4549,0,247,518,1462,1167,0,1527,886,2525,557,0,838,875,459,5305,0,297,3005,3792,0,338,2126,383,486,2151,6585,422,18237,3986,562,0,132,1643,1052,1701,7538,1447,545,290,1146,611,494,0,342,959,1099,939,143,511,1241,195,4315,34,506,1707,1937,1653,2,2584,150,2037,1496,0,309,128,549,4507,0,122,2413,4825,270,158,1058,0,126,2819,7966,361,15286,5350,142,0,0,2428,1142,1436,5129,1588,475,2791,398,217,345,380,613,1503,1670,385,284,1553,1057,489,5391,507,437,686,2129,842,175,1875,1338,4089,944,351,60,47,863,3605,0,39,1369,3529,0,1445,2216,239,235,2256,7566,366.33333333333331,15236.666666666666,4441,274.33333333333331,0,90,2056,1053.3333333333333,1356.3333333333333,6786.333333333333,1622,512.33333333333337,1188,614.33333333333337,354.33333333333331,295,176,460.33333333333331,902.66666666666663,1010,746,184.66666666666666,1106.3333333333333,1409,267.33333333333331,4751.666666666667,180.33333333333334,396.66666666666669,970.33333333333337,1842.6666666666667,1220.6666666666667,59,1995.3333333333333,791.33333333333337,2883.6666666666665,999,117,402.33333333333331,350,623.66666666666663,4472.333333333333,0,152.66666666666666,2262.3333333333335,4048.6666666666665,90,647,1800,207.33333333333334]
[null,"Pennsylvania",null,null,null,null,null,null,null,null,null,null,null,null,null,null,null,null,null,null,null,null,null,null,null,null,null,null,null,null,null,null,null,null,null,null,null,null,null,null,null,null,null,null,null,null,null,null,null,null,null,null,null,null,null,null,"Vermont",0,184,65,0,1001,326,1287,87,9,2063,496,49,0,370,0,91,0,176,0,824,300,3599,201,85,0,51,236,0,58,2760,751,0,4056,539,30,50,0,100,524,227,134,153,125,565,0,0,400,128,0,377,52,0,0,580,310,0,819,529,2105,107,27,366,101,143,0,386,258,0,7,627,41,322,361,2378,335,206,0,69,0,0,15,2244,962,56,3723,250,0,383,0,124,389,401,21,0,327,185,182,0,740,156,53,137,38,19,16,93,127,0,1112,382,1626,0,116,966,56,6,0,230,68,30,0,1243,73,883,862,3318,284,315,0,23,147,0,17,2893,833,74,4780,328,0,214,11,26,935,341,124,39,193,493,81,0,728,98,0,151,96,0,5.333333333333333,285.66666666666669,167.33333333333334,0,977.33333333333337,412.33333333333331,1672.6666666666667,64.666666666666671,50.666666666666664,1131.6666666666667,217.66666666666666,66,0,328.66666666666669,108.66666666666667,40.333333333333336,2.3333333333333335,682,38,676.33333333333337,507.66666666666669,3098.3333333333335,273.33333333333331,202,0,47.666666666666664,127.66666666666667,0,30,2632.3333333333335,848.66666666666663,43.333333333333336,4186.333333333333,372.33333333333331,10,215.66666666666666,3.6666666666666665,83.333333333333329,616,323,93,64,215,414.33333333333331,87.666666666666671,0,622.66666666666663,127.33333333333333,17.666666666666668,221.66666666666666,62,6.333333333333333]
["2010-01-01",11053022,null,null,null,null,null,null,null,null,null,null,null,null,null,null,null,null,null,null,null,null,null,null,null,null,null,null,null,null,null,null,null,null,null,null,null,null,null,null,null,null,null,null,null,null,null,null,null,null,null,null,null,null,null,null,"Virginia",2671,3296,3807,1233,17088,3229,2468,1265,10593,18165,11927,2347,1159,7576,2892,1135,2103,2051,2148,1494,24822,4104,5733,462,1858,4262,866,523,748,372,6825,1098,17525,23829,201,7708,781,2137,11796,1543,8339,98,5842,12938,1551,676,0,4373,6779,2648,423,1306,4930,3202,4679,645,19371,4908,5376,961,6854,17773,8715,2917,434,4000,2703,1503,892,3630,2496,2855,22051,5386,7323,834,1682,2277,617,256,1717,1344,7327,1014,12455,22753,462,9570,853,3499,12009,1897,6612,908,7482,11655,1426,173,0,4615,9041,858,190,1222,2515,1906,2420,445,14780,5352,2725,2279,10964,19574,9535,3823,652,7089,2663,221,1144,3908,1638,1144,23925,3767,2982,2294,1344,1914,658,357,973,535,9073,947,15893,25575,852,5622,2810,1541,14190,1605,7936,35,6189,12944,2092,423,0,4160,3839,1258,143,516,3372,2801.3333333333335,3635.3333333333335,774.33333333333337,17079.666666666668,4496.333333333333,3523,1501.6666666666667,9470.3333333333339,18504,10059,3029,748.33333333333337,6221.666666666667,2752.6666666666665,953,1379.6666666666667,3196.3333333333335,2094,1831,23599.333333333332,4419,5346,1196.6666666666667,1628,2817.6666666666665,713.66666666666663,378.66666666666669,1146,750.33333333333337,7741.666666666667,1019.6666666666666,15291,24052.333333333332,505,7633.333333333333,1481.3333333333333,2392.3333333333335,12665,1681.6666666666667,7629,347,6504.333333333333,12512.333333333334,1689.6666666666667,424,0,4382.666666666667,6553,1588,252,1014.6666666666666]
["2011-01-01",11099077,null,null,null,null,null,null,null,null,null,null,null,null,null,null,null,null,null,null,null,null,null,null,null,null,null,null,null,null,null,null,null,null,null,null,null,null,null,null,null,null,null,null,null,null,null,null,null,null,null,null,null,null,null,null,"Washington",1322,5644,5971,658,39468,4883,642,202,243,5378,3107,4246,12661,3931,1912,1685,1694,886,1011,717,629,1448,2871,1323,737,3727,5094,323,5310,282,721,1012,4140,2143,515,2727,1986,26235,2893,220,3047,866,789,11338,4020,981,7266,0,62,2180,638,0,1821,5266,12397,756,38421,3938,1026,0,358,6094,8705,5940,10895,2062,2303,1000,2820,1271,1016,1313,1899,1580,3720,1543,1110,3307,2125,673,4925,824,2006,1569,4512,3870,189,2686,765,29168,2296,463,1519,227,2342,15491,4789,119,4233,0,157,1491,1507,1083,1507,4328,8362,1413,45597,5195,2901,100,773,9370,6363,5239,10604,4298,1089,1159,2544,1368,1646,532,1191,2911,3470,2703,615,2802,2919,682,5671,309,2300,872,5562,4088,217,3192,1223,25525,3397,97,2727,94,3206,14196,5298,223,3839,0,215,1168,394,1025,1550,5079.333333333333,8910,942.33333333333337,41162,4672,1523,100.66666666666667,458,6947.333333333333,6058.333333333333,5141.666666666667,11386.666666666666,3430.3333333333335,1768,1281.3333333333333,2352.6666666666665,1175,1224.3333333333333,854,1239.6666666666667,1979.6666666666667,3353.6666666666665,1856.3333333333333,820.66666666666663,3278.6666666666665,3379.3333333333335,559.33333333333337,5302,471.66666666666669,1675.6666666666667,1151,4738,3367,307,2868.3333333333335,1324.6666666666667,26976,2862,260,2431,395.66666666666669,2112.3333333333335,13675,4702.333333333333,441,5112.666666666667,0,144.66666666666666,1613,846.33333333333337,702.66666666666663]
["2012-01-01",11107110,null,null,null,null,null,null,null,null,null,null,null,null,null,null,null,null,null,null,null,null,null,null,null,null,null,null,null,null,null,null,null,null,null,null,null,null,null,null,null,null,null,null,null,null,null,null,null,null,null,null,null,null,null,null,"West Virginia",41,1326,0,0,760,608,84,556,480,1842,485,0,88,356,366,0,161,851,60,0,4249,191,657,0,44,160,39,0,25,107,906,0,611,2552,268,7925,229,0,4908,238,647,0,1160,968,112,208,4999,192,0,150,0,182,221,598,50,225,1442,124,594,89,300,2949,1296,147,120,1331,210,0,0,515,326,45,7515,236,459,0,0,309,60,78,293,160,1431,0,2017,3865,0,8545,97,132,4205,284,1857,0,546,1574,114,23,5561,83,0,42,0,680,477,306,79,0,1231,104,143,674,294,1919,1108,166,181,220,328,68,39,2249,90,35,5352,164,778,20,0,59,0,0,229,129,1213,81,1721,4683,175,6757,520,118,5208,0,1098,36,1061,622,0,54,6317,297,0,470,252,79,246.33333333333334,743.33333333333337,43,75,1144.3333333333333,278.66666666666669,273.66666666666669,439.66666666666669,358,2236.6666666666665,963,104.33333333333333,129.66666666666666,635.66666666666663,301.33333333333331,22.666666666666668,66.666666666666671,1205,158.66666666666666,26.666666666666668,5705.333333333333,197,631.33333333333337,6.666666666666667,14.666666666666666,176,33,26,182.33333333333334,132,1183.3333333333333,27,1449.6666666666667,3700,147.66666666666666,7742.333333333333,282,83.333333333333329,4773.666666666667,174,1200.6666666666667,12,922.33333333333337,1054.6666666666667,75.333333333333329,95,5625.666666666667,190.66666666666666,0,220.66666666666666,84,313.66666666666669]
[null,null,null,null,null,null,null,null,null,null,null,null,null,null,null,null,null,null,null,null,null,null,null,null,null,null,null,null,null,null,null,null,null,null,null,null,null,null,null,null,null,null,null,null,null,null,null,null,null,null,null,null,null,null,null,null,"Wisconsin",552,798,1854,518,4506,1890,359,351,98,4492,1656,550,902,20299,2563,2300,752,287,331,448,1088,992,6317,16741,810,1716,154,853,1049,69,632,123,1291,1817,497,1674,89,1444,2211,0,1142,235,856,3039,476,75,771,1013,256,0,129,521,708,432,4045,335,6637,2592,993,219,123,4338,1745,1108,566,25521,4017,3306,418,1040,850,12,147,733,5623,17927,983,2090,143,483,663,480,378,714,2213,2120,1383,1358,118,1057,1294,368,377,590,744,1984,890,342,2573,1555,1090,0,14,728,323,236,3257,253,5347,1600,657,296,15,4937,970,333,360,22285,2480,4161,1160,635,598,233,1306,489,3917,18965,238,1263,784,324,1163,3,606,526,2033,2939,284,2610,289,945,1563,144,1053,329,1051,2765,900,62,1267,1208,0,0,30,975,527.66666666666663,488.66666666666669,3052,368.66666666666669,5496.666666666667,2027.3333333333333,669.66666666666663,288.66666666666669,78.666666666666671,4589,1457,663.66666666666663,609.33333333333337,22701.666666666668,3020,3255.6666666666665,776.66666666666663,654,593,231,847,738,5285.666666666667,17877.666666666668,677,1689.6666666666667,360.33333333333331,553.33333333333337,958.33333333333337,184,538.66666666666663,454.33333333333331,1845.6666666666667,2292,721.33333333333337,1880.6666666666667,165.33333333333334,1148.6666666666667,1689.3333333333333,170.66666666666666,857.33333333333337,384.66666666666669,883.66666666666663,2596,755.33333333333337,159.66666666666666,1537,1258.6666666666667,448.66666666666669,0,57.666666666666664,741.33333333333337]
[null,null,null,null,null,null,null,null,null,null,null,null,null,null,null,null,null,null,null,null,null,null,null,null,null,null,null,null,null,null,null,null,null,null,null,null,null,null,null,null,null,null,null,null,null,null,null,null,null,null,null,null,null,null,null,null,"Wyoming",172,0,1511,0,2784,4390,0,0,0,396,745,25,942,415,132,462,532,519,107,0,51,252,570,218,0,421,2528,1711,416,0,0,707,146,34,233,56,62,14,95,0,220,258,495,1990,3226,75,580,556,0,0,0,0,51,761,369,174,2539,6905,11,0,0,1525,46,0,2140,450,6,342,286,83,114,0,0,152,849,357,70,241,1105,1784,427,0,7,76,113,395,237,22,462,960,284,13,219,1043,69,1398,2140,4,451,1803,0,168,0,0,260,590,2014,244,2035,5599,0,0,0,733,166,0,745,905,179,259,539,4,88,0,294,548,965,290,136,244,1901,1216,355,0,121,604,231,459,338,819,964,893,230,0,122,1175,4,1427,1710,0,138,1323,0,282,0,16,161,450.33333333333331,1298,139.33333333333334,2452.6666666666665,5631.333333333333,3.6666666666666665,0,0,884.66666666666663,319,8.3333333333333339,1275.6666666666667,590,105.66666666666667,354.33333333333331,452.33333333333331,202,103,0,115,317.33333333333331,794.66666666666663,288.33333333333331,68.666666666666671,302,1844.6666666666667,1570.3333333333333,399.33333333333331,0,42.666666666666664,462.33333333333331,163.33333333333334,296,269.33333333333331,299,496,622.33333333333337,203,4.333333333333333,187,825.33333333333337,189.33333333333334,1605,2358.6666666666665,26.333333333333332,389.66666666666669,1227.3333333333333,0,150,0,5.333333333333333]
[]
[]
[]
[]
["pvtState2ChangedResidence"]
["Sum of Changed Residence Last Yr"]
[null,"Pennsylvania"]
["2010-01-01",1239199]
["2011-01-01",1224564]
["2012-01-01",1252378]