{"text_format":"1","workbook":"xlsx","n_sheets":7,"sheets":["RawData2012","RawData2011","RawData2010","TransData","Ctrl","ChartData","Dashboard"],"not_rendered":{"charts":9,"images":2,"macros":1,"external_links":0,"defined_names":9,"comments":0,"pivot_tables":0},"unopened":[],"bounds":{"document_bytes":16777216,"sheet_cells":100000,"rows_first":2000,"rows_last":500,"rows_between":2000,"halvings":0,"cell_chars":16384,"cell_head_chars":4096},"cells_cut":0,"cells_raw":0,"read":"whole","date_system":"1900"}

{"sheet":"RawData2012","index":0,"n_rows":54,"n_cols":57,"rows_kept":54,"cut":false,"hidden":true,"merged":[]}
["Current residence in --","Population","Same residence","Different residence, same state","Alabama","Alaska","Arizona","Arkansas","California","Colorado","Connecticut","Delaware","District of Columbia ","Florida","Georgia","Hawaii","Idaho","Illinois","Indiana","Iowa","Kansas","Kentucky","Louisiana","Maine","Maryland","Massachusetts","Michigan","Minnesota","Mississippi","Missouri","Montana","Nebraska","Nevada","New Hampshire","New Jersey","New Mexico","New York","North Carolina","North Dakota","Ohio","Oklahoma","Oregon","Pennsylvania","Rhode Island","South Carolina","South Dakota","Tennessee","Texas","Utah","Vermont","Virginia","Washington","West Virginia","Wisconsin","Wyoming","Puerto Rico","TOTAL"]
["United States",310212755,263612596,37696597,109210,84068,206842,64967,566986,161530,87023,25149,59513,428325,252262,61509,55191,277953,144597,73325,93134,103004,95956,38574,157664,158156,175733,115946,66947,142754,33832,48816,98882,38696,219202,63921,405864,238663,23959,199202,102572,108182,237156,30498,127418,22534,163843,402187,82165,20056,238540,180462,47425,97724,32228,74500,7070345]
["Alabama",4764428,4054260,590326,"N/A",1004,962,660,3077,1386,284,42,162,11244,19920,627,493,2722,1347,345,865,2495,3104,67,1513,334,2298,752,4952,1555,101,151,1009,161,1702,459,2709,5133,228,1411,194,200,1837,0,2811,518,10539,7468,579,0,3170,1034,128,760,88,619,104600]
["Alaska",721186,592551,90613,1097,"N/A",1520,196,3494,556,0,0,356,1991,928,1376,538,58,260,13,221,161,120,66,508,297,563,192,56,819,371,1195,803,118,116,263,736,920,264,1316,335,3174,255,0,384,99,451,1488,330,79,1265,3725,0,206,136,25,33415]
["Arizona",6468907,5242674,953789,1331,3717,"N/A",1214,44889,13790,417,246,36,5553,2263,2491,2934,10744,2930,2702,2498,1328,724,616,3007,1961,9598,8570,293,2595,1118,2293,6712,510,2564,6946,7402,2721,877,7906,1626,8587,4280,614,1070,1472,5075,14788,5916,207,2763,13247,765,3765,2786,1791,232457]
["Arkansas",2912680,2453347,373046,374,855,1677,"N/A",3525,603,185,0,205,2682,1525,0,0,3576,1172,409,1033,1310,3953,17,169,254,1283,295,3689,9105,258,166,121,0,157,547,2262,3057,0,1135,9938,193,516,59,52,673,4195,11767,269,0,1159,251,84,695,1498,0,76948]
["California",37572738,31777868,5046618,2509,6995,38916,3472,"N/A",15150,6764,474,3199,21004,10790,11906,5331,21251,5891,2284,2790,3763,5180,1256,7902,14356,8921,8539,2556,6729,3060,3302,27968,1327,12057,5921,31261,11195,1827,10653,6671,22724,10466,1648,4110,826,5802,43005,12172,544,15625,34569,1413,5681,1886,2323,493641]
["Colorado",5123944,4131357,751921,3108,3457,10589,1043,22152,"N/A",1317,70,488,8615,5834,2536,2660,6374,4336,2776,5283,2500,5048,20,2844,5939,3343,2992,835,3771,2021,4472,3789,679,2464,6520,7250,4378,1918,4533,4582,2419,3950,137,2383,756,2535,17355,6398,503,3796,4853,837,3000,5602,1144,205060]
["Connecticut",3555319,3114940,334918,46,439,3167,200,3161,367,"N/A",22,288,6578,1702,408,97,912,53,0,0,124,909,1224,1752,8743,753,605,276,358,50,45,172,1009,5665,444,23310,3379,0,287,415,35,2214,1558,940,0,260,3279,45,709,1729,1593,174,711,104,3228,80311]
["Delaware",906576,782216,86003,119,692,188,0,2221,0,1489,"N/A",11,715,179,0,32,567,62,30,113,0,178,0,5649,157,227,351,58,80,0,91,572,99,5846,85,3566,1349,0,191,0,0,6828,135,298,0,344,133,166,0,1746,29,161,0,0,56,34757]
["District of Columbia ",624847,500267,61992,79,1247,902,35,4999,677,618,78,"N/A",1705,1079,38,46,795,469,133,164,112,283,194,14120,1524,944,393,44,337,0,172,42,197,1451,116,3085,985,0,651,0,157,1494,635,150,0,577,1473,116,267,9537,481,293,721,215,0,53830]
["Florida",19114620,16032617,2380288,18599,10704,6473,3321,20386,8766,8975,1099,780,"N/A",42754,3177,1268,22565,13803,3864,5661,6912,5550,7348,10442,15159,23400,5460,5490,10666,1758,945,1241,2362,27606,2853,53009,23133,239,22927,3142,2919,25659,3050,11366,1070,16275,28564,2499,2747,25697,4943,3533,6216,773,21638,537148]
["Georgia",9796547,8231384,1236302,13864,2654,6657,1041,14174,4710,1829,226,1352,42870,"N/A",1409,936,7143,5972,1687,1497,6172,4100,222,3619,4153,9949,2237,3280,3377,251,1283,3783,15,4920,915,13957,16009,207,7501,3299,453,9076,440,18611,257,17606,16198,20,84,10702,1965,1237,3441,106,1730,277466]
["Hawaii",1374852,1164145,134827,608,1417,1865,24,9756,1216,191,278,230,2780,1448,"N/A",404,318,292,84,1135,485,207,91,2491,1266,321,192,44,944,131,75,760,85,410,284,2382,2241,0,884,1095,1763,1087,106,644,459,1314,3300,2183,0,1393,5920,197,295,50,336,55145]
["Idaho",1573036,1296975,210151,575,1198,2424,291,10280,1186,44,120,116,2014,583,206,"N/A",532,283,90,63,83,54,0,107,338,683,637,87,214,3800,35,2535,0,214,675,938,817,0,1018,93,4963,169,0,205,118,1957,1352,6617,0,269,10398,0,225,677,136,59283]
{"$rows_left_out":40}
{"sheet":"RawData2011","index":1,"n_rows":54,"n_cols":57,"rows_kept":54,"cut":false,"hidden":true,"merged":[]}
["Current residence in --","Population","Same residence","Different residence, same state","Alabama","Alaska","Arizona","Arkansas","California","Colorado","Connecticut","Delaware","District of Columbia ","Florida","Georgia","Hawaii","Idaho","Illinois","Indiana","Iowa","Kansas","Kentucky","Louisiana","Maine","Maryland","Massachusetts","Michigan","Minnesota","Mississippi","Missouri","Montana","Nebraska","Nevada","New Hampshire","New Jersey","New Mexico","New York","North Carolina","North Dakota","Ohio","Oklahoma","Oregon","Pennsylvania","Rhode Island","South Carolina","South Dakota","Tennessee","Texas","Utah","Vermont","Virginia","Washington","West Virginia","Wisconsin","Wyoming","Puerto Rico","TOTAL"]
["United States",307900319,261087925,37998701,106806,88850,211816,77226,562343,160623,91295,26631,49732,437202,248892,61940,57831,269008,143228,74516,94180,99256,86593,33729,165041,145869,186505,103253,68597,138404,31204,52809,115943,43277,216369,61431,377800,225147,26563,206049,81009,109795,215127,31065,121426,29383,154243,404839,73211,18172,229227,190644,45956,105370,31991,76218,6987416]
["Alabama",4745278,4024442,588293,"N/A",1771,1677,1642,3389,348,2921,232,399,20063,19346,1259,137,6991,1434,30,842,2686,2413,626,1606,112,2797,327,3945,1086,317,770,257,64,1996,119,1108,2697,284,2596,973,169,1075,0,2036,90,8710,7973,300,66,4935,2621,65,417,9,569,117726]
["Alaska",711962,571857,100280,93,"N/A",2467,190,3098,1583,138,11,140,1188,556,1366,475,985,181,319,750,237,1077,0,216,141,771,593,554,921,248,5,532,520,128,226,940,470,0,319,616,2161,378,0,186,301,388,2492,662,68,1488,4548,89,23,246,1044,35084]
["Arizona",6402301,5107496,1028366,833,5001,"N/A",1066,49635,10189,1875,0,389,3732,2206,2199,2190,10035,5855,4526,1708,2134,844,0,1918,743,9396,3297,1226,3872,2431,1393,8756,228,3379,4610,3880,2548,1159,4682,3219,4613,3436,72,1774,1657,1680,12688,10577,0,2233,13940,70,6473,2510,871,222877]
["Arkansas",2906632,2421746,405831,691,560,439,"N/A",4077,746,519,79,0,3067,1446,13,179,3684,1362,851,2008,213,2120,30,133,781,1881,232,1731,7314,713,332,641,52,341,775,674,1664,214,174,3761,632,567,0,235,0,6462,14767,0,0,1245,1477,24,687,252,529,69845]
["California",37222678,31213310,5271168,2087,7358,35650,2648,"N/A",21245,3073,1302,3240,22094,13303,9864,4796,20834,4673,3324,2810,1201,3600,1658,7793,10244,12069,5687,2092,7677,2599,1955,36159,1222,8053,5904,25629,8708,1392,10474,5113,18165,8550,1103,5758,1004,8761,37087,8944,745,15753,36481,832,5668,2047,1344,468428]
["Colorado",5048443,4048042,763233,2340,3191,12338,1615,23234,"N/A",1567,501,298,8075,3250,1852,1578,6027,2116,3510,3718,1361,908,1358,3303,2157,3225,3055,879,4552,4079,4582,4061,489,2863,8797,3998,4756,2249,5527,3824,5543,3348,435,718,1340,3193,22390,3856,914,6281,5524,412,3995,2942,476,202124]
["Connecticut",3548667,3139496,316883,101,180,1387,84,3699,1502,"N/A",62,607,4771,2000,587,133,1843,168,67,16,0,315,259,1267,8691,692,76,69,365,206,62,160,1221,3809,265,20015,1029,0,1383,217,117,3668,1488,997,0,123,1214,398,608,2555,2255,46,660,65,2105,71502]
["Delaware",897187,775414,83156,81,329,541,0,699,169,66,"N/A",154,810,639,201,441,34,210,0,7,305,0,0,4238,806,43,201,0,713,0,12,0,0,6297,0,3141,388,0,664,27,0,8571,131,153,0,221,883,475,0,1064,482,198,55,463,1008,33912]
["District of Columbia ",611608,489659,66519,13,135,43,81,3797,452,981,128,"N/A",1254,937,372,68,1397,128,241,6,297,0,0,14129,2048,1108,409,83,112,38,79,238,145,1035,0,2313,1716,285,306,0,51,1589,50,357,104,421,1083,75,445,7975,476,120,946,0,0,48066]
["Florida",18863948,15742168,2454255,12635,7405,8451,3025,22420,9383,11704,1264,891,"N/A",38658,3639,312,19152,11472,1846,2661,5441,6094,4689,15410,13701,19640,4663,5175,7114,559,3857,3527,4324,25206,1376,59288,23983,514,18191,2600,3315,20821,5002,11953,716,10451,25532,2343,2019,16614,6339,4964,7412,846,21611,498597]
["Georgia",9699859,8095407,1289450,18799,1079,4292,2112,14949,2325,709,619,364,42666,"N/A",1006,126,6080,2442,950,4513,3686,6541,408,3708,4436,6992,1808,5380,2514,246,4144,774,132,8371,791,14454,19138,201,6863,1632,727,5791,337,16914,536,16898,15760,793,361,9438,3701,1340,2727,504,1635,271077]
["Hawaii",1357806,1160948,122727,1268,844,2900,242,10173,950,731,784,222,3160,2519,"N/A",112,1884,402,478,125,18,179,106,341,92,1303,933,371,308,85,91,1548,107,564,354,4246,2307,32,970,685,2030,870,58,1681,0,636,3007,1040,0,2523,3790,312,147,14,238,57542]
["Idaho",1559637,1284530,208434,263,4510,3543,224,9021,1813,0,0,0,1733,275,254,"N/A",390,296,318,479,120,51,0,0,396,615,566,62,384,1602,439,3581,129,84,141,419,263,1201,260,288,7170,343,0,55,842,296,1303,6059,0,905,8991,0,165,487,249,60336]
{"$rows_left_out":40}
{"sheet":"RawData2010","index":2,"n_rows":54,"n_cols":57,"rows_kept":54,"cut":false,"hidden":true,"merged":[]}
["Current residence in --","Population","Same residence","Different residence, same state","Alabama","Alaska","Arizona","Arkansas","California","Colorado","Connecticut","Delaware","District of Columbia ","Florida","Georgia","Hawaii","Idaho","Illinois","Indiana","Iowa","Kansas","Kentucky","Louisiana","Maine","Maryland","Massachusetts","Michigan","Minnesota","Mississippi","Missouri","Montana","Nebraska","Nevada","New Hampshire","New Jersey","New Mexico","New York","North Carolina","North Dakota","Ohio","Oklahoma","Oregon","Pennsylvania","Rhode Island","South Carolina","South Dakota","Tennessee","Texas","Utah","Vermont","Virginia","Washington","West Virginia","Wisconsin","Wyoming","Puerto Rico","TOTAL"]
["United States",305628607,258552348,38582885,99221,94692,176768,64264,573988,140620,89360,30055,56052,427853,244992,49218,53122,277579,130170,66922,90681,92999,88131,32209,159866,144152,178207,104765,68363,148055,35870,43531,109409,38399,193972,50438,363139,207025,24450,188013,90616,100185,209810,24948,117569,27915,143135,411641,75541,18380,232002,166162,49349,111240,28186,59885,6743229]
["Alabama",4729509,3987155,620465,"N/A",3013,676,1481,3827,1278,454,811,211,15062,21644,267,304,2503,3945,669,649,1967,1901,97,716,435,2334,386,7233,1373,229,169,265,0,356,650,3686,2371,169,2222,880,485,1477,0,2368,31,7409,6500,1336,0,2490,1171,41,1155,27,228,108723]
["Alaska",702974,565031,95878,477,"N/A",1354,47,3906,1930,0,0,14,2315,1251,1705,895,388,9,262,106,1440,100,574,704,107,923,530,263,0,616,215,240,316,413,421,255,698,69,156,1455,1793,126,0,121,531,477,4123,1274,353,714,2421,0,158,81,19,36326]
["Arizona",6332786,5069002,1001991,416,3109,"N/A",689,47164,7687,479,738,0,7712,4261,1966,2147,12250,2690,3008,1935,1705,2014,241,1284,1449,6354,5421,272,4567,1343,1750,10342,64,1782,4419,6618,4463,826,5225,2910,5430,5535,403,2310,1351,3061,14705,7164,664,3413,12645,595,5556,593,599,222725]
["Arkansas",2888304,2387806,412997,1405,934,777,"N/A",4457,2535,451,0,154,3578,3921,129,618,3221,722,85,3611,2540,4012,0,306,190,1506,222,2764,7320,85,394,67,0,77,0,289,1561,0,1137,8607,239,731,0,1496,243,2653,13707,361,0,494,264,0,821,443,87,79127]
["California",36907897,30790221,5413287,3364,9579,33854,4172,"N/A",15662,4631,643,3683,20362,8820,9528,5719,16482,6550,3163,3857,3394,2989,1796,10626,11969,10435,5095,2757,6921,3009,3062,27724,1614,10108,4632,20981,9593,392,8170,5708,20913,9948,526,5016,1604,4349,36582,10653,525,14232,30544,1446,6031,1336,1223,444749]
["Colorado",4988190,4042039,725413,954,2225,12287,1034,26089,"N/A",459,486,479,8849,6445,2355,839,6950,3296,2140,4308,1961,968,532,1532,2242,4587,2878,1277,1978,2042,4065,4131,791,1259,3921,4594,2940,802,2838,3464,4330,3928,192,1231,1847,1628,22253,4748,350,2739,7583,623,2499,4418,874,186366]
["Connecticut",3541146,3100742,342904,896,0,664,334,4479,547,"N/A",149,331,9207,748,182,147,3391,1074,108,0,400,0,528,1531,8510,770,934,67,42,0,0,507,1049,3475,112,20727,1345,0,1296,145,640,1955,1728,1140,0,430,1887,0,458,1735,2084,442,1092,47,2027,77333]
["Delaware",889812,764640,90001,128,68,60,0,353,178,714,"N/A",432,2362,585,0,0,612,0,0,28,163,0,294,4969,689,61,55,0,539,73,0,106,139,3678,59,4251,424,0,325,0,0,7318,149,195,0,146,178,0,0,1051,377,0,0,0,954,30759]
["District of Columbia ",596747,474676,63766,360,591,662,155,4205,656,926,0,"N/A",1100,1597,0,0,615,711,392,83,94,0,76,13503,1376,126,87,0,272,0,62,0,137,1924,61,3852,1897,98,598,0,601,2378,249,380,0,591,1180,0,199,7915,284,860,391,0,0,51244]
["Florida",18647600,15554008,2459530,15830,5887,3907,3611,22130,6428,11183,3099,1110,"N/A",35615,2021,884,17432,9030,2921,4136,6321,7232,5497,13241,13900,21359,5439,7929,7984,338,1544,7050,3645,22344,900,55011,19108,794,21047,3466,1655,19935,1982,10759,430,12882,24039,2833,1442,20080,3573,5634,8081,191,12968,482889]
["Georgia",9587237,8015409,1278548,13840,3645,2554,599,8909,3224,2619,837,1708,49901,"N/A",1040,414,9736,2649,1096,1355,6525,3645,0,5382,3910,6857,1169,2380,3072,52,148,1155,162,4151,826,12472,15361,0,9323,2070,843,6294,43,15562,557,14445,11424,380,361,8393,4495,358,3416,102,1010,249459]
["Hawaii",1346274,1140572,134315,749,743,1398,0,12677,1073,307,0,0,4599,2013,"N/A",42,715,192,68,387,95,88,89,990,1283,627,476,234,170,150,0,1925,496,443,11,1339,1510,69,625,57,1834,553,644,322,267,142,6694,467,0,2644,2705,483,1168,18,0,53581]
["Idaho",1550967,1279856,209272,376,3264,3086,45,8932,1372,0,0,144,612,313,123,"N/A",169,132,773,422,315,59,202,44,115,427,465,37,425,1509,0,2110,109,97,694,155,134,96,325,711,3202,172,0,0,296,1153,1746,8014,0,611,10876,133,233,1410,233,55638]
{"$rows_left_out":40}
{"sheet":"TransData","index":3,"n_rows":8269,"n_cols":10,"rows_kept":8269,"cut":false,"hidden":true,"merged":[]}
["Year","From_long","To_long","New Residence","New State","Count","From_State","To_State","From_Region","To_Region"]
[2012,"Alabama","Alabama","Same",{"$f":"IF(B2<>C2,1,0)","v":0},4054260,"AL","AL","SE","SE"]
[2012,"Alabama","Alabama","Different",{"$f":"IF(B3<>C3,1,0)","v":0},590326,"AL","AL","SE","SE"]
[2012,"Alabama","Alaska","Different",1,1097,"AL","AK","SE","W"]
[2012,"Alabama","Arizona","Different",1,1331,"AL","AZ","SE","SW"]
[2012,"Alabama","Arkansas","Different",1,374,"AL","AR","SE","SE"]
[2012,"Alabama","California","Different",1,2509,"AL","CA","SE","W"]
[2012,"Alabama","Colorado","Different",1,3108,"AL","CO","SE","W"]
[2012,"Alabama","Connecticut","Different",1,46,"AL","CT","SE","NE"]
[2012,"Alabama","Delaware","Different",1,119,"AL","DE","SE","SE"]
[2012,"Alabama","District of Columbia ","Different",1,79,"AL","DC","SE","SE"]
[2012,"Alabama","Florida","Different",1,18599,"AL","FL","SE","SE"]
[2012,"Alabama","Georgia","Different",1,13864,"AL","GA","SE","SE"]
[2012,"Alabama","Hawaii","Different",1,608,"AL","HI","SE","W"]
[2012,"Alabama","Idaho","Different",1,575,"AL","ID","SE","W"]
{"$rows_left_out":8255}
{"sheet":"Ctrl","index":4,"n_rows":52,"n_cols":13,"rows_kept":52,"cut":false,"hidden":true,"merged":[]}
["Alabama","AL","SE",43464.213796362958,"62.68",425,null,null,null,null,null,null,2012]
["Alaska","AK","W",63647.970002527043,"32.03",688,null,null,null,null,null,null,2011]
["Arizona","AZ","SW",47043.730351641541,"65.97",501,null,null,null,null,null,null,2010]
["Arkansas","AR","SE",39018.207243712,"60.09",552]
["California","CA","W",57019.52251805937,"61.17",533]
["Colorado","CO","W",57254.883867801924,"46.26",392]
["Connecticut","CT","NE",64247.280660311095,"48.60",281]
["Delaware","DE","SE",48971.892922469386,"54.48",682]
["District of Columbia","DC","SE",65246.199983535618,"54.73",1508]
["Florida","FL","SE",46071.019121208548,"71.80",712]
["Georgia","GA","SE",48120.925167220128,"62.30",471]
["Hawaii","HI","W",56262.527037207386,"72.95",281]
["Idaho","ID","W",47921.740356330658,"46.32",247]
["Illinois","IL","MW",51737.543434969644,"51.37",542]
["Indiana","IN","MW",46158.025716154771,"51.81",315]
{"$rows_left_out":38}
{"sheet":"ChartData","index":5,"n_rows":54,"n_cols":28,"rows_kept":54,"cut":false,"hidden":true,"merged":[]}
["State","Inflow","Outflow","Static","Net Inflow","%Inflow","%Outflow","%Net Inflow","Short","Region",null,"Year",2012,null,"SelState","California",{"$f":"VLOOKUP(P1,Ctrl!$A$1:$G$52,2,0)","v":"CA"},{"$f":"VLOOKUP(Q1,Ctrl!$B$1:$F$52,3,0)","v":57019.52251805937},{"$f":"VLOOKUP(Q1,Ctrl!$B$1:$F$52,4,0)*1","v":61.17},{"$f":"VLOOKUP(Q1,Ctrl!$B$1:$F$52,5,0)","v":533}]
["Alabama",{"$f":"SUMIFS(C_VAL,C_TO_STL,$A2,C_NS,1,C_YEAR,$M$1)","v":105219},{"$f":"SUMIFS(C_VAL,C_FROM_STL,$A2,C_NS,1,C_YEAR,$M$1)","v":109218},{"$f":"SUMIFS(C_VAL,C_FROM_STL,$A2,C_NS,0,C_YEAR,$M$1)","v":4644586},{"$f":"B2-C2","v":-3999},{"$f":"B2/D2","v":2.2654118149604722E-2},{"$f":"C2/D2","v":2.3515120615701809E-2},{"$f":"F2-G2","v":-8.6100246609708761E-4},"AL","SE",null,null,null,null,null,null,null,"Inflow",null,null,null,null,null,"Outflow","Same"]
["Alaska",33440,84125,683164,-50685,4.8948715096228723E-2,0.12314027085736368,-7.4191555761134953E-2,"AK","W",null,"Inflow Avg",{"$f":"AVERAGE($B$2:$B$53)","v":137786.32692307694},null,null,null,"TX",43005,0,{"$f":"VLOOKUP(Q3,Ctrl!$B$1:$F$52,3,0)","v":51926.140987412437},{"$f":"VLOOKUP(Q3,Ctrl!$B$1:$F$52,4,0)*1","v":65.97},{"$f":"VLOOKUP(Q3,Ctrl!$B$1:$F$52,5,0)","v":516},"TX",62702,0,{"$f":"VLOOKUP(W3,Ctrl!$B$1:$F$52,3,0)","v":51926.140987412437},{"$f":"VLOOKUP(W3,Ctrl!$B$1:$F$52,4,0)*1","v":65.97},{"$f":"VLOOKUP(W3,Ctrl!$B$1:$F$52,5,0)","v":516}]
["Arizona",234248,206896,6196463,27352,3.7803501771897938E-2,3.3389370678078768E-2,4.4141310938191694E-3,"AZ","SW",null,"Outflow Avg",{"$f":"AVERAGE($C$2:$C$53)","v":137786.32692307694},null,null,null,"AZ",38916,0,{"$f":"VLOOKUP(Q4,Ctrl!$B$1:$F$52,3,0)","v":47043.730351641541},{"$f":"VLOOKUP(Q4,Ctrl!$B$1:$F$52,4,0)*1","v":65.97},{"$f":"VLOOKUP(Q4,Ctrl!$B$1:$F$52,5,0)","v":501},"NV",49978,0,{"$f":"VLOOKUP(W4,Ctrl!$B$1:$F$52,3,0)","v":47333.251422657573},{"$f":"VLOOKUP(W4,Ctrl!$B$1:$F$52,4,0)*1","v":57.3},{"$f":"VLOOKUP(W4,Ctrl!$B$1:$F$52,5,0)","v":742}]
["Arkansas",76948,65060,2826393,11888,2.7224805609127958E-2,2.3018738016970748E-2,4.2060675921572095E-3,"AR","SE",null,"Inflow Stdev",{"$f":"STDEV($B$2:$B$53)","v":121292.73900818099},null,null,null,"WA",34569,0,{"$f":"VLOOKUP(Q5,Ctrl!$B$1:$F$52,3,0)","v":62186.634090030901},{"$f":"VLOOKUP(Q5,Ctrl!$B$1:$F$52,4,0)*1","v":50.47},{"$f":"VLOOKUP(Q5,Ctrl!$B$1:$F$52,5,0)","v":346},"WA",45597,0,{"$f":"VLOOKUP(W5,Ctrl!$B$1:$F$52,3,0)","v":62186.634090030901},{"$f":"VLOOKUP(W5,Ctrl!$B$1:$F$52,4,0)*1","v":50.47},{"$f":"VLOOKUP(W5,Ctrl!$B$1:$F$52,5,0)","v":346}]
["California",495964,567505,36824486,-71541,1.3468321051378695E-2,1.5411077292429826E-2,-1.9427562410511308E-3,"CA","W",null,"Outflow Stdev",{"$f":"STDEV($C$2:$C$53)","v":115838.2926957046},null,null,null,"NY",31261,0,{"$f":"VLOOKUP(Q6,Ctrl!$B$1:$F$52,3,0)","v":47680.251231079856},{"$f":"VLOOKUP(Q6,Ctrl!$B$1:$F$52,4,0)*1","v":48.17},{"$f":"VLOOKUP(Q6,Ctrl!$B$1:$F$52,5,0)","v":435},"AZ",44889,0,{"$f":"VLOOKUP(W6,Ctrl!$B$1:$F$52,3,0)","v":47043.730351641541},{"$f":"VLOOKUP(W6,Ctrl!$B$1:$F$52,4,0)*1","v":65.97},{"$f":"VLOOKUP(W6,Ctrl!$B$1:$F$52,5,0)","v":501}]
["Colorado",206204,161530,4883278,44674,4.2226553556852592E-2,3.3078190510554592E-2,9.1483630462979998E-3,"CO","W",null,null,null,null,null,null,"NV",27968,0,{"$f":"VLOOKUP(Q7,Ctrl!$B$1:$F$52,3,0)","v":47333.251422657573},{"$f":"VLOOKUP(Q7,Ctrl!$B$1:$F$52,4,0)*1","v":57.3},{"$f":"VLOOKUP(Q7,Ctrl!$B$1:$F$52,5,0)","v":742},"OR",31862,0,{"$f":"VLOOKUP(W7,Ctrl!$B$1:$F$52,3,0)","v":51775.45884134098},{"$f":"VLOOKUP(W7,Ctrl!$B$1:$F$52,4,0)*1","v":51.27},{"$f":"VLOOKUP(W7,Ctrl!$B$1:$F$52,5,0)","v":280}]
["Connecticut",83539,87393,3449858,-3854,2.4215199582127728E-2,2.5332347012543704E-2,-1.1171474304159761E-3,"CT","NE",null,"Net Inflow Avg",{"$f":"AVERAGE(E2:E53)","v":0},null,null,null,"OR",22724,0,{"$f":"VLOOKUP(Q8,Ctrl!$B$1:$F$52,3,0)","v":51775.45884134098},{"$f":"VLOOKUP(Q8,Ctrl!$B$1:$F$52,4,0)*1","v":51.27},{"$f":"VLOOKUP(Q8,Ctrl!$B$1:$F$52,5,0)","v":280},"NY",24623,0,{"$f":"VLOOKUP(W8,Ctrl!$B$1:$F$52,3,0)","v":47680.251231079856},{"$f":"VLOOKUP(W8,Ctrl!$B$1:$F$52,4,0)*1","v":48.17},{"$f":"VLOOKUP(W8,Ctrl!$B$1:$F$52,5,0)","v":435}]
["Delaware",34813,25149,868219,9664,4.0097026211128761E-2,2.8966194013261632E-2,1.1130832197867129E-2,"DE","SE",null,"Net Inflow Stdev",{"$f":"STDEV(E2:E53)","v":39717.286661169215},null,null,null,"IL",21251,0,{"$f":"VLOOKUP(Q9,Ctrl!$B$1:$F$52,3,0)","v":51737.543434969644},{"$f":"VLOOKUP(Q9,Ctrl!$B$1:$F$52,4,0)*1","v":51.37},{"$f":"VLOOKUP(Q9,Ctrl!$B$1:$F$52,5,0)","v":542},"CO",22152,0,{"$f":"VLOOKUP(W9,Ctrl!$B$1:$F$52,3,0)","v":57254.883867801924},{"$f":"VLOOKUP(W9,Ctrl!$B$1:$F$52,4,0)*1","v":46.26},{"$f":"VLOOKUP(W9,Ctrl!$B$1:$F$52,5,0)","v":392}]
["District of Columbia ",53830,59513,562259,-5683,9.5738796533270248E-2,0.10584623812157742,-1.0107441588307176E-2,"DC","SE",null,null,null,null,null,null,"FL",21004,0,{"$f":"VLOOKUP(Q10,Ctrl!$B$1:$F$52,3,0)","v":46071.019121208548},{"$f":"VLOOKUP(Q10,Ctrl!$B$1:$F$52,4,0)*1","v":71.8},{"$f":"VLOOKUP(Q10,Ctrl!$B$1:$F$52,5,0)","v":712},"FL",20386,0,{"$f":"VLOOKUP(W10,Ctrl!$B$1:$F$52,3,0)","v":46071.019121208548},{"$f":"VLOOKUP(W10,Ctrl!$B$1:$F$52,4,0)*1","v":71.8},{"$f":"VLOOKUP(W10,Ctrl!$B$1:$F$52,5,0)","v":712}]
["Florida",558786,432517,18412905,126269,3.034751985088719E-2,2.3489883861346161E-2,6.8576359895410298E-3,"FL","SE",null,"Net +ve",{"$f":"COUNTIF($E$2:$E$53,\">0\")","v":28},null,null,null,"VA",15625,0,{"$f":"VLOOKUP(Q11,Ctrl!$B$1:$F$52,3,0)","v":64631.517699225114},{"$f":"VLOOKUP(Q11,Ctrl!$B$1:$F$52,4,0)*1","v":55.54},{"$f":"VLOOKUP(Q11,Ctrl!$B$1:$F$52,5,0)","v":282},"UT",15286,0,{"$f":"VLOOKUP(W11,Ctrl!$B$1:$F$52,3,0)","v":58341.014548129671},{"$f":"VLOOKUP(W11,Ctrl!$B$1:$F$52,4,0)*1","v":49.55},{"$f":"VLOOKUP(W11,Ctrl!$B$1:$F$52,5,0)","v":224}]
["Georgia",279196,252494,9467686,26702,2.9489359913288209E-2,2.6669029792496288E-2,2.820330120791921E-3,"GA","SE",null,"Net -ve",{"$f":"COUNTIF(E2:E53,\"<=0\")","v":24},null,null,null,"CO",15150,0,{"$f":"VLOOKUP(Q12,Ctrl!$B$1:$F$52,3,0)","v":57254.883867801924},{"$f":"VLOOKUP(Q12,Ctrl!$B$1:$F$52,4,0)*1","v":46.26},{"$f":"VLOOKUP(Q12,Ctrl!$B$1:$F$52,5,0)","v":392},"IL",14940,0,{"$f":"VLOOKUP(W12,Ctrl!$B$1:$F$52,3,0)","v":51737.543434969644},{"$f":"VLOOKUP(W12,Ctrl!$B$1:$F$52,4,0)*1","v":51.37},{"$f":"VLOOKUP(W12,Ctrl!$B$1:$F$52,5,0)","v":542}]
["Hawaii",55481,61619,1298972,-6138,4.2711467221772291E-2,4.7436742285438024E-2,-4.7252750636657334E-3,"HI","W",null,null,null,null,null,null,"MA",14356,0,{"$f":"VLOOKUP(Q13,Ctrl!$B$1:$F$52,3,0)","v":63655.897167099407},{"$f":"VLOOKUP(Q13,Ctrl!$B$1:$F$52,4,0)*1","v":48.14},{"$f":"VLOOKUP(Q13,Ctrl!$B$1:$F$52,5,0)","v":447},"VA",14780,0,{"$f":"VLOOKUP(W13,Ctrl!$B$1:$F$52,3,0)","v":64631.517699225114},{"$f":"VLOOKUP(W13,Ctrl!$B$1:$F$52,4,0)*1","v":55.54},{"$f":"VLOOKUP(W13,Ctrl!$B$1:$F$52,5,0)","v":282}]
["Idaho",59419,55191,1507126,4228,3.9425369876174919E-2,3.6620030442046647E-2,2.805339434128272E-3,"ID","W",null,null,{"$f":"\"Net Inflow: \"&TEXT(VLOOKUP(ChartData!P1,ChartData!$A$2:$J$53,5,0),\"#,##0.0,K\")","v":"Net Inflow: -71.5K"},null,null,null,"UT",12172,0,{"$f":"VLOOKUP(Q14,Ctrl!$B$1:$F$52,3,0)","v":58341.014548129671},{"$f":"VLOOKUP(Q14,Ctrl!$B$1:$F$52,4,0)*1","v":49.55},{"$f":"VLOOKUP(Q14,Ctrl!$B$1:$F$52,5,0)","v":224},"GA",14174,0,{"$f":"VLOOKUP(W14,Ctrl!$B$1:$F$52,3,0)","v":48120.925167220128},{"$f":"VLOOKUP(W14,Ctrl!$B$1:$F$52,4,0)*1","v":62.3},{"$f":"VLOOKUP(W14,Ctrl!$B$1:$F$52,5,0)","v":471}]
["Illinois",210804,278974,12450512,-68170,1.6931351899423894E-2,2.2406628739444611E-2,-5.4752768400207173E-3,"IL","MW",null,null,{"$f":"VLOOKUP(ChartData!P1,ChartData!$A$2:$J$53,5,0)","v":-71541},null,null,null,"NJ",12057,0,{"$f":"VLOOKUP(Q15,Ctrl!$B$1:$F$52,3,0)","v":66692.485315596103},{"$f":"VLOOKUP(Q15,Ctrl!$B$1:$F$52,4,0)*1","v":51.93},{"$f":"VLOOKUP(Q15,Ctrl!$B$1:$F$52,5,0)","v":352},"NC",13883,0,{"$f":"VLOOKUP(W15,Ctrl!$B$1:$F$52,3,0)","v":41553.373711401036},{"$f":"VLOOKUP(W15,Ctrl!$B$1:$F$52,4,0)*1","v":58.7},{"$f":"VLOOKUP(W15,Ctrl!$B$1:$F$52,5,0)","v":476}]
{"$rows_left_out":40}
{"sheet":"Dashboard","index":6,"n_rows":0,"n_cols":0,"rows_kept":0,"cut":false,"hidden":false,"merged":[]}