{"text_format":"1","workbook":"xlsx","n_sheets":7,"sheets":["Map","Model","Map_Data","Sample_Palette","Raw_Data-1","Raw_Data-2","Help"],"not_rendered":{"charts":6,"images":24,"macros":1,"external_links":0,"defined_names":21,"comments":3,"pivot_tables":0},"unopened":[],"bounds":{"document_bytes":16777216,"sheet_cells":100000,"rows_first":2000,"rows_last":500,"rows_between":2000,"halvings":0,"cell_chars":16384,"cell_head_chars":4096},"cells_cut":0,"cells_raw":0,"read":"whole","date_system":"1900"}

{"sheet":"Map","index":0,"n_rows":58,"n_cols":63,"rows_kept":58,"cut":false,"hidden":false,"merged":[[54,20,54,23],[54,34,54,37],[5,44,5,51],[2,9,2,10],[54,6,54,9],[57,6,57,9],[56,54,57,54],[53,10,54,15],[53,24,54,29],[53,38,54,43],[56,10,57,15],[56,24,57,29],[54,16,54,19],[54,30,54,33],[54,44,54,47],[57,16,57,19],[57,30,57,33],[57,20,57,23]]}
[]
[null,"US Migration Data by State (2010 - 2012)",null,null,null,null,null,null,null,null,null,null,null,null,null,null,null,null,null,null,null,null,null,null,null,null,null,null,null,null,null,null,null,null,null,null,null,null,null,null,null,null,null,null,null,null,null,null,null,null,null,null,null,null,null,{"$f":"Model!C4","v":"Migration in 2011"},null,"n  Influx","Gross State Product"]
[null,null,null,null,null,null,null,null,null,"to",null,null,null,null,null,null,null,null,null,null,null,null,null,null,null,null,null,null,null,null,null,null,null,null,null,null,null,null,null,null,null,null,null,null,null,null,null,null,null,null,null,null,null,null,null,"by State (Thousands)",null,"u Outflow","($ Billion)",null,null,null,"HELP"]
[]
[null,null,null,null,null,null,null,null,null,null,null,null,null,null,null,null,null,null,null,null,null,null,null,null,null,null,null,null,"Click a state to ",null,null,null,null,null,null,null,null,null,null,null,null,null,null,null,null,null,null,null,null,null,null,{"$f":"\"US Population \" & RIGHT(Model!$C$4,4)","v":"US Population 2011"},null,null,1,null,null,null,null,null,1,null,"Please go to the 'Help' worksheet for more information "]
[null,null,null,null,null,null,null,null,null,null,null,null,null,null,null,null,null,null,null,null,null,null,null,null,null,null,null,null,"highlight below",null,null,null,null,null,null,null,null,null,null,null,null,null,null,null,{"$f":"OFFSET(Model!$AM$11,0,Model!$B$4,1,1)","v":307900319},null,null,null,null,null,null,null,null,null,2,null,null,null,null,null,2,null,"on using this workbook."]
[null,null,null,null,null,null,null,null,null,null,null,null,null,null,null,null,null,null,null,null,null,null,null,null,null,null,null,null,null,null,null,null,null,null,null,null,null,null,null,null,null,null,null,null,null,null,null,null,null,null,null,null,null,null,3,null,null,null,null,null,3]
[null,null,null,null,null,null,null,null,null,null,null,null,null,null,null,null,null,null,null,null,null,null,null,null,null,null,null,null,null,null,null,null,null,null,null,null,null,null,null,null,null,null,null,null,null,null,null,null,null,null,null,"Mouse over ",null,null,4,null,null,null,null,null,4]
[null,null,null,null,null,null,null,null,null,null,null,null,null,null,null,null,null,null,null,null,null,null,null,null,null,null,null,null,null,null,null,null,null,null,null,null,null,null,null,null,null,null,null,null,null,null,null,null,null,null,null,"for State Codes ",null,null,5,null,null,null,null,null,5]
[null,null,null,null,null,null,null,null,null,null,null,null,null,null,null,null,null,null,null,null,null,null,null,null,null,null,null,null,null,null,null,null,null,null,null,null,null,null,null,null,null,null,null,null,null,null,null,null,null,null,null,null,null,null,6,null,null,null,null,null,6]
[null,null,null,null,null,null,null,null,null,null,null,null,null,null,null,null,null,null,null,null,null,null,null,null,null,null,null,null,null,null,null,null,null,null,null,null,null,null,null,null,null,null,null,null,null,null,null,null,null,null,null,null,null,null,7,null,null,null,null,null,7]
[null,null,null,null,null,null,null,null,null,null,null,null,null,null,null,null,null,null,null,null,null,null,null,null,null,null,null,null,null,null,null,null,null,null,null,null,null,null,null,null,null,null,null,null,null,null,null,null,null,null,null,null,null,null,8,null,null,null,null,null,8]
[null,null,null,null,null,null,null,null,null,null,null,null,null,null,null,null,null,null,null,null,null,null,null,null,null,null,null,null,null,null,null,null,null,null,null,null,null,null,null,null,null,null,null,null,null,null,null,null,null,null,null,null,null,null,9,null,null,null,null,null,9]
[null,null,null,null,null,null,null,null,null,null,null,null,null,null,null,null,null,null,null,null,null,null,null,null,null,null,null,null,null,null,null,null,null,null,null,null,null,null,null,null,null,null,"Scale",null,null,null,null,null,null,null,null,null,null,null,10,null,null,null,null,null,10]
[null,null,null,null,null,null,null,null,null,null,null,null,null,null,null,null,null,null,null,null,null,null,null,null,null,null,null,null,null,null,null,null,null,null,null,null,null,null,null,null,null,null,null,null,null,null,null,null,null,null,null,null,null,null,11,null,null,null,null,null,11]
[null,null,null,null,null,null,null,null,null,null,null,null,null,null,null,null,null,null,null,null,null,null,null,null,null,null,null,null,null,null,null,null,null,null,null,null,null,null,null,null,null,null,null,null,null,null,null,null,null,null,null,null,null,null,12,null,null,null,null,null,12]
[null,null,null,null,null,null,null,null,null,null,null,"Scale",null,null,null,null,null,null,null,null,null,null,null,null,null,null,null,null,null,null,null,null,null,null,null,null,null,null,null,null,null,null,null,null,null,null,null,null,null,null,null,null,null,null,13,null,null,null,null,null,13]
[null,null,null,null,null,null,null,null,null,null,null,null,null,null,null,null,null,null,null,null,null,null,null,null,null,null,null,null,null,null,null,null,null,null,null,null,null,null,null,null,null,null,null,null,null,null,null,null,null,null,null,null,null,null,14,null,null,null,null,null,14]
[null,null,null,null,null,null,null,null,null,null,null,null,null,null,null,null,null,null,null,null,null,null,null,null,null,null,null,null,null,null,null,null,null,null,null,null,null,null,null,null,null,null,null,null,null,null,null,null,null,null,null,null,null,null,15,null,null,null,null,null,15]
[null,null,null,null,null,null,null,null,null,null,null,null,null,null,null,null,null,null,null,null,null,null,null,null,null,null,null,null,null,null,null,null,null,null,null,null,null,null,null,null,null,null,null,null,null,null,null,null,null,null,null,null,null,null,16,null,null,null,null,null,16]
[null,null,null,null,null,null,null,null,null,null,null,null,null,null,null,null,null,null,null,null,null,null,null,null,null,null,null,null,null,null,null,null,null,null,null,null,null,null,null,null,null,null,null,null,null,null,null,null,null,null,null,null,null,null,17,null,null,null,null,null,17]
[null,null,null,null,null,null,null,null,null,null,null,null,null,null,null,null,null,null,null,null,null,null,null,null,null,null,null,null,null,null,null,null,null,null,null,null,null,null,null,null,null,null,null,null,null,null,null,null,null,null,null,null,null,null,18,null,null,null,null,null,18]
[null,null,null,null,null,null,null,null,null,null,null,null,null,null,null,null,null,null,null,null,null,null,null,null,null,null,null,null,null,null,null,null,null,null,null,null,null,null,null,null,null,null,null,null,null,null,null,null,null,null,null,null,null,null,19,null,null,null,null,null,19]
[null,null,null,null,null,null,null,null,null,null,null,null,null,null,null,null,null,null,null,null,null,null,null,null,null,null,null,null,null,null,null,null,null,null,null,null,null,null,null,null,null,null,null,null,null,null,null,null,null,null,null,null,null,null,20,null,null,null,null,null,20]
[null,null,null,null,null,null,null,null,null,null,null,null,null,null,null,null,null,null,null,null,null,null,null,null,null,null,null,null,null,null,null,null,null,null,null,null,null,null,null,null,null,null,null,null,null,null,null,null,null,null,null,null,null,null,21,null,null,null,null,null,21]
[null,null,null,null,null,null,null,null,null,null,null,null,null,null,null,null,null,null,null,null,null,null,null,null,null,null,null,null,null,null,null,null,null,null,null,null,null,null,null,null,null,null,null,null,null,null,null,null,null,null,null,null,null,null,22,null,null,null,null,null,22]
[null,null,null,null,null,null,null,null,null,null,null,null,null,null,null,null,null,null,null,null,null,null,null,null,null,null,null,null,null,null,null,null,null,null,null,null,null,null,null,null,null,null,null,null,null,null,null,null,null,null,null,null,null,null,23,null,null,null,null,null,23]
[null,null,null,null,null,null,null,null,null,null,null,null,null,null,null,null,null,null,null,null,null,null,null,null,null,null,null,null,null,null,null,null,null,null,null,null,null,null,null,null,null,null,null,null,null,null,null,null,null,null,null,null,null,null,24,null,null,null,null,null,24]
[null,null,null,null,null,null,null,null,null,null,null,null,null,null,null,null,null,null,null,null,null,null,null,null,null,null,null,null,null,null,null,null,null,null,null,null,null,null,null,null,null,null,null,null,null,null,null,null,null,null,null,null,null,null,25,null,null,null,null,null,25]
[null,null,null,null,null,null,null,null,null,null,null,null,null,null,null,null,null,null,null,null,null,null,null,null,null,null,null,null,null,null,null,null,null,null,null,null,null,null,null,null,null,null,null,null,null,null,null,null,null,null,null,null,null,null,26,null,null,null,null,null,26]
[null,null,null,null,null,null,null,null,null,null,null,null,null,null,null,null,null,null,null,null,null,null,null,null,null,null,null,null,null,null,null,null,null,null,null,null,null,null,null,null,null,null,null,null,null,null,null,null,null,null,null,null,null,null,27,null,null,null,null,null,27]
[null,null,null,null,null,null,null,null,null,null,null,null,null,null,null,null,null,null,null,null,null,null,null,null,null,null,null,null,null,null,null,null,null,null,null,null,null,null,null,null,null,null,null,null,null,null,null,null,null,null,null,null,null,null,28,null,null,null,null,null,28]
[null,null,null,null,null,null,null,null,null,null,null,null,null,null,null,null,null,null,null,null,null,null,null,null,null,null,null,null,null,null,null,null,null,null,null,null,null,null,null,null,null,null,null,null,null,null,null,null,null,null,null,null,null,null,29,null,null,null,null,null,29]
[null,null,null,null,null,null,null,null,null,null,null,null,null,null,null,null,null,null,null,null,null,null,null,null,null,null,null,null,null,null,null,null,null,null,null,null,null,null,null,null,null,null,null,null,null,null,null,null,null,null,null,null,{"$f":"OFFSET(Map_Data!$D$1,MATCH(MouseClick,Map_Data!$E$2:$E$54,0),0,1)","v":"Illinois"},null,30,null,null,null,null,null,30]
[null,null,null,null,null,null,null,null,null,null,null,null,null,null,null,null,null,null,null,null,null,null,null,null,null,null,null,null,null,null,null,null,null,null,null,null,null,null,null,null,null,null,null,null,null,null,null,null,null,null,null,null,"IL",null,31,null,null,null,null,null,31]
[null,null,null,null,null,null,null,null,null,null,null,null,null,null,null,null,null,null,null,null,null,null,null,null,null,null,null,null,null,null,null,null,null,null,null,null,null,null,null,null,null,null,null,null,null,null,null,null,null,null,null,null,null,null,32,null,null,null,null,null,32]
[null,null,null,null,null,null,null,null,null,null,null,null,null,null,null,null,null,null,null,null,null,null,null,null,null,null,null,null,null,null,null,null,null,null,null,null,null,null,null,null,null,null,null,null,null,null,null,null,null,null,null,null,null,null,33,null,null,null,null,null,33]
[null,null,null,null,null,null,null,null,null,null,null,null,null,null,null,null,null,null,null,null,null,null,null,null,null,null,null,null,null,null,null,null,null,null,null,null,null,null,null,null,null,null,null,null,null,null,null,null,null,null,null,null,null,null,34,null,null,null,null,null,34]
[null,null,null,null,null,null,null,null,null,null,null,null,null,null,null,null,null,null,null,null,null,null,null,null,null,null,null,null,null,null,null,null,null,null,null,null,null,null,null,null,null,null,null,null,null,null,null,null,null,null,null,null,null,null,35,null,null,null,null,null,35]
[null,null,null,null,null,null,null,null,null,null,null,null,null,null,null,null,null,null,null,null,null,null,null,null,null,null,null,null,null,null,null,null,null,null,null,null,null,null,null,null,null,null,null,null,null,null,null,null,null,null,null,null,null,null,36,null,null,null,null,null,36]
[null,null,null,null,null,null,null,null,null,null,null,null,null,null,null,null,null,null,null,null,null,null,null,null,null,null,null,null,null,null,null,null,null,null,null,null,null,null,null,null,null,null,null,null,null,null,null,null,null,null,null,null,null,null,37,null,null,null,null,null,37]
[null,null,null,null,null,null,null,null,null,null,null,null,null,null,null,null,null,null,null,null,null,null,null,null,null,null,null,null,null,null,null,null,null,null,null,null,null,null,null,null,null,null,null,null,null,null,null,null,null,null,null,null,null,null,38,null,null,null,null,null,38]
[null,null,null,null,null,null,null,null,null,null,null,null,null,null,null,null,null,null,null,null,null,null,null,null,null,null,null,null,null,null,null,null,null,null,null,null,null,null,null,null,null,null,null,null,null,null,null,null,null,null,null,null,null,null,39,null,null,null,null,null,39]
[null,{"$f":"Model!$C$4 & \" to \" & Model!$C$5 & \" by State\"","v":"Migration in 2011 to Ohio by State"},null,null,null,null,null,null,null,null,null,null,null,null,null,null,null,null,null,null,null,null,null,null,null,null,null,null,null,null,null,null,null,null,null,null,null,null,null,null,null,null,null,null,null,null,null,null,null,null,null,null,null,null,40,null,null,null,null,null,40]
[null,null,null,null,null,null,null,null,null,null,null,null,null,null,null,null,null,null,null,null,null,null,null,null,null,null,null,null,null,null,null,null,null,null,null,null,null,null,null,null,null,null,null,null,null,null,null,null,null,null,null,null,null,null,41,null,null,null,null,null,41]
[null,null,null,null,null,null,null,null,null,null,null,null,null,null,null,null,null,null,null,null,null,null,null,null,null,null,null,null,null,null,null,null,null,null,null,null,null,null,null,null,null,null,null,null,null,null,null,null,null,null,null,null,null,null,42,null,null,null,null,null,42]
[null,null,null,null,null,null,null,null,null,null,null,null,null,null,null,null,null,null,null,null,null,null,null,null,null,null,null,null,null,null,null,null,null,null,null,null,null,null,null,null,null,null,null,null,null,null,null,null,null,null,null,null,null,null,43,null,null,null,null,null,43]
[null,null,null,null,null,null,null,null,null,null,null,null,null,null,null,null,null,null,null,null,null,null,null,null,null,null,null,null,null,null,null,null,null,null,null,null,null,null,null,null,null,null,null,null,null,null,null,null,null,null,null,null,null,null,44,null,null,null,null,null,44]
[null,null,null,null,null,null,null,null,null,null,null,null,null,null,null,null,null,null,null,null,null,null,null,null,null,null,null,null,null,null,null,null,null,null,null,null,null,null,null,null,null,null,null,null,null,null,null,null,null,null,null,null,null,null,45,null,null,null,null,null,45]
[null,null,null,null,null,null,null,null,null,null,null,null,null,null,null,null,null,null,null,null,null,null,null,null,null,null,null,null,null,null,null,null,null,null,null,null,null,null,null,null,null,null,null,null,null,null,null,null,null,null,null,null,null,null,46,null,null,null,null,null,46]
[null,null,null,null,null,null,null,null,null,null,null,null,null,null,null,null,null,null,null,null,null,null,null,null,null,null,null,null,null,null,null,null,null,null,null,null,null,null,null,null,null,null,null,null,null,null,null,null,null,null,null,null,null,null,47,null,null,null,null,null,47]
[null,"Seasonally Adjusted Unemployment Rate (%)",null,null,null,null,null,null,null,null,null,null,null,null,null,null,null,null,null,null,null,null,null,null,null,null,null,null,null,null,null,31,32,33,34,35,36,37,38,39,40,41,42,43,44,45,46,47,48,49,50,51,52,null,48,null,null,null,null,null,48]
[null,null,null,null,null,null,null,null,null,null,null,null,null,null,null,null,null,null,null,null,null,null,null,null,null,null,null,null,null,null,null,null,null,null,null,null,null,null,null,null,null,null,null,null,null,null,null,null,null,null,null,null,null,null,49,null,null,null,null,null,49]
[null,null,null,null,null,null,null,null,null,"Influx",null,null,null,null,null,null,null,null,null,null,null,null,null,"State Pop.(M)",null,null,null,null,null,null,null,null,null,null,null,null,null,"GSP ($ Bn)",null,null,null,null,null,null,null,null,null,null,null,null,null,null,null,null,50,null,null,null,null,null,50]
[null,null,null,null,null,null,{"$f":"Model!AN6","v":172633},null,null,null,null,null,null,null,null,null,{"$f":"Model!AP6","v":196391},null,null,null,{"$f":"Model!AN8/1000000","v":11.405101},null,null,null,null,null,null,null,null,null,{"$f":"Model!AP8/1000000","v":11.414635000000001},null,null,null,{"$f":"Model!AN5/1000000000","v":465.67899999999997},null,null,null,null,null,null,null,null,null,{"$f":"Model!AP5/1000000000","v":509.39299999999997},null,null,null,null,null,null,null,null,null,51,null,null,null,null,null,51]
[null,"State Trends",null,null,null,null,null,null,null,null,null,null,null,null,null,null,null,null,null,null,null,null,null,null,null,null,null,null,null,null,null,null,null,null,null,null,null,null,null,null,null,null,null,null,null,null,null,null,null,null,null,null,null,null,52,null,null,null,null,null,52]
[null,null,null,null,null,null,null,null,null,"Outflow",null,null,null,null,null,null,null,null,null,null,null,null,null,"Int. Migration %",null,null,null,null,null,null,null,null,null,null,null,null,null,null,"All trend-line ranges:"]
[null,null,null,null,null,null,{"$f":"Model!AN7","v":188013},null,null,null,null,null,null,null,null,null,{"$f":"Model!AP7","v":199202},null,null,null,{"$f":"Model!AN9","v":12.743429453189412},null,null,null,null,null,null,null,null,null,{"$f":"Model!AP9","v":12.622523628657421},null,null,null,null,null,null,null,"2010 - 2012"]

{"sheet":"Model","index":1,"n_rows":56,"n_cols":42,"rows_kept":56,"cut":false,"hidden":false,"merged":[]}
[]
[]
[null,"Selected Dataset",null,null,null,true,null,null,null,null,null,"Scale Options",null,null,null,null,"Palette",null,null,null,"Selected Data",null,null,null,null,null,null,null,null,"Chart Data",null,null,null,null,null,null,null,null,"Sparkline & Table Data"]
[null,{"$f":"IFERROR(MATCH($C$4,MapDatasetNames,0),0)","v":2},"Migration in 2011",null,null,null,null,null,null,null,null,null,"Freq","Class Name","Freq.",null,"Colors",null,null,null,"#","Data","Sort Order","State Code","Data 2","State Code","Data 2","ER %",null,"#","Bullet Index","Influx","Sort Order","State","Sorted Data","Outflow ","GSP $",null,null,2010,2011,2012]
[null,{"$f":"IFERROR(MATCH($C$5,State_Names,0),0)","v":36},"Ohio",null,{"$f":"OFFSET(Map_Data!E1,MATCH(Model!C5,State_Names,0),0,1,1)","v":"OH"},null,null,null,null,null,null,null,{"$f":"FREQUENCY(ActiveDataSet,ClassEnd)","v":30},{"$f":"E16:E24","v":"Class1"},{"$f":"IF(ISERROR(M5),\"\",M5)","v":30},null,null,"GnBu",null,null,1,{"$f":"ActiveDataSet","v":1567},{"$f":"RANK(V5,$V$5:$V$56,0)+COUNTIF($V$5:V5,V5)-1","v":32},{"$f":"OFFSET(Map_Data!$E$1,MATCH(Model!U5,Model!$W$5:$W$56,0),0,1,1)","v":"FL"},{"$f":"LARGE(ActiveDataSet,U5)","v":16492},null,null,{"$f":"OFFSET(Map_Data!$U$1,MATCH(X5,Map_Data!$E$2:$E$53,0),$B$4,1,1)","v":9.5},null,1,0.5,{"$f":"Influx","v":117726},{"$f":"RANK(AF5,$AF$5:$AF$56,0)+COUNTIF($AF$5:AF5,AF5)-1","v":23},{"$f":"OFFSET(Map_Data!$D$1,MATCH(Model!AD5,Model!$AG$5:$AG$56,0),0,1,1)","v":"Texas"},{"$f":"LARGE($AF$5:$AF$56,AD5)","v":514726},{"$f":"OFFSET(Map_Data!$N$1,MATCH(AH5,Map_Data!$D$2:$D$53,0),Model!$B$4,1,1)","v":404839},{"$f":"OFFSET(Map_Data!$H$1,MATCH(AH5,Map_Data!$D$2:$D$53,0),Model!$B$4,1,1)","v":1321005000000},null,"GSP $",{"$f":"OFFSET(Map_Data!$E$1,MATCH(Model!$C$5,State_Names,0),4,1,3)","v":465679000000},490265000000,509393000000]
[null,null,null,null,null,null,null,null,null,null,null,null,6,"Class2",6,null,null,"BuGn",null,null,2,1637,{"$f":"RANK(V6,$V$5:$V$56,0)+COUNTIF($V$5:V6,V6)-1","v":30},{"$f":"OFFSET(Map_Data!$E$1,MATCH(Model!U6,Model!$W$5:$W$56,0),0,1,1)","v":"MI"},{"$f":"LARGE(ActiveDataSet,U6)","v":14330},null,null,{"$f":"OFFSET(Map_Data!$U$1,MATCH(X6,Map_Data!$E$2:$E$53,0),$B$4,1,1)","v":9.4},null,2,1.5,35084,{"$f":"RANK(AF6,$AF$5:$AF$56,0)+COUNTIF($AF$5:AF6,AF6)-1","v":43},{"$f":"OFFSET(Map_Data!$D$1,MATCH(Model!AD6,Model!$AG$5:$AG$56,0),0,1,1)","v":"Florida"},{"$f":"LARGE($AF$5:$AF$56,AD6)","v":498597},{"$f":"OFFSET(Map_Data!$N$1,MATCH(AH6,Map_Data!$D$2:$D$53,0),Model!$B$4,1,1)","v":437202},{"$f":"OFFSET(Map_Data!$H$1,MATCH(AH6,Map_Data!$D$2:$D$53,0),Model!$B$4,1,1)","v":746439000000},null,"Influx",{"$f":"OFFSET(Map_Data!$E$1,MATCH(Model!$C$5,State_Names,0),7,1,3)","v":172633},191778,196391]
[null,"Map Data Summary",null,null,null,null,null,null,null,null,null,null,4,"Class3",4,null,null,"YlOrRd",null,null,3,6763,{"$f":"RANK(V7,$V$5:$V$56,0)+COUNTIF($V$5:V7,V7)-1","v":11},{"$f":"OFFSET(Map_Data!$E$1,MATCH(Model!U7,Model!$W$5:$W$56,0),0,1,1)","v":"PA"},14292,null,null,{"$f":"OFFSET(Map_Data!$U$1,MATCH(X7,Map_Data!$E$2:$E$53,0),$B$4,1,1)","v":7.8},null,3,2.5,222877,{"$f":"RANK(AF7,$AF$5:$AF$56,0)+COUNTIF($AF$5:AF7,AF7)-1","v":9},{"$f":"OFFSET(Map_Data!$D$1,MATCH(Model!AD7,Model!$AG$5:$AG$56,0),0,1,1)","v":"California"},468428,{"$f":"OFFSET(Map_Data!$N$1,MATCH(AH7,Map_Data!$D$2:$D$53,0),Model!$B$4,1,1)","v":562343},{"$f":"OFFSET(Map_Data!$H$1,MATCH(AH7,Map_Data!$D$2:$D$53,0),Model!$B$4,1,1)","v":1908985000000},null,"Outflow",{"$f":"OFFSET(Map_Data!$E$1,MATCH(Model!$C$5,State_Names,0),10,1,3)","v":188013},206049,199202]
[null,null,null,"Minimum Value",{"$f":"IFERROR(MIN(ActiveDataSet),\"\")","v":0},{"$f":"OFFSET(Map_Data!E1,0,Model!B4,1,1)","v":2011},null,null,null,null,null,null,4,"Class4",4,null,null,null,null,null,4,1952,{"$f":"RANK(V8,$V$5:$V$56,0)+COUNTIF($V$5:V8,V8)-1","v":26},{"$f":"OFFSET(Map_Data!$E$1,MATCH(Model!U8,Model!$W$5:$W$56,0),0,1,1)","v":"KY"},12744,null,null,{"$f":"OFFSET(Map_Data!$U$1,MATCH(X8,Map_Data!$E$2:$E$53,0),$B$4,1,1)","v":8.6999999999999993},null,4,3.5,69845,{"$f":"RANK(AF8,$AF$5:$AF$56,0)+COUNTIF($AF$5:AF8,AF8)-1","v":34},{"$f":"OFFSET(Map_Data!$D$1,MATCH(Model!AD8,Model!$AG$5:$AG$56,0),0,1,1)","v":"New York"},282209,{"$f":"OFFSET(Map_Data!$N$1,MATCH(AH8,Map_Data!$D$2:$D$53,0),Model!$B$4,1,1)","v":377800},{"$f":"OFFSET(Map_Data!$H$1,MATCH(AH8,Map_Data!$D$2:$D$53,0),Model!$B$4,1,1)","v":1169436000000},null,"State Pop",{"$f":"OFFSET('Raw_Data-1'!$D$3,MATCH(Model!$C$5,'Raw_Data-1'!C4:C55,0),0,1,1)","v":11405101},{"$f":"OFFSET('Raw_Data-1'!$A$55,MATCH(Model!$C$5,'Raw_Data-1'!C4:C55,0),3,1,1)","v":11418944},{"$f":"OFFSET('Raw_Data-1'!$A$107,MATCH(Model!$C$5,'Raw_Data-1'!C4:C55,0),3,1,1)","v":11414635}]
[null,null,null,"Maximum Value",{"$f":"IFERROR(MAX(ActiveDataSet),\"\")","v":16492},{"$f":"OFFSET(Map_Data!E1,0,Model!B4,1,1)","v":2011},null,null,null,null,null,null,2,"Class5",2,null,"YlOrRd",{"$f":"MATCH(Q9,R5:R7,0)","v":3},null,null,5,9032,{"$f":"RANK(V9,$V$5:$V$56,0)+COUNTIF($V$5:V9,V9)-1","v":7},{"$f":"OFFSET(Map_Data!$E$1,MATCH(Model!U9,Model!$W$5:$W$56,0),0,1,1)","v":"TX"},11987,null,null,{"$f":"OFFSET(Map_Data!$U$1,MATCH(X9,Map_Data!$E$2:$E$53,0),$B$4,1,1)","v":7.4},null,5,4.5,468428,{"$f":"RANK(AF9,$AF$5:$AF$56,0)+COUNTIF($AF$5:AF9,AF9)-1","v":3},{"$f":"OFFSET(Map_Data!$D$1,MATCH(Model!AD9,Model!$AG$5:$AG$56,0),0,1,1)","v":"Georgia"},271077,{"$f":"OFFSET(Map_Data!$N$1,MATCH(AH9,Map_Data!$D$2:$D$53,0),Model!$B$4,1,1)","v":248892},{"$f":"OFFSET(Map_Data!$H$1,MATCH(AH9,Map_Data!$D$2:$D$53,0),Model!$B$4,1,1)","v":417438000000},null,"State Migration",{"$f":"OFFSET(Map_Data!$E$1,MATCH(Model!$C$5,State_Names,0),14,1,3)","v":12.743429453189412},12.485471511201036,12.622523628657421]
[null,null,null,"Median",{"$f":"IFERROR(MEDIAN(ActiveDataSet),\"\")","v":1912},{"$f":"OFFSET(Map_Data!E1,0,Model!B4,1,1)","v":2011},null,null,null,null,null,null,2,"Class6",2,null,null,null,null,null,6,2690,{"$f":"RANK(V10,$V$5:$V$56,0)+COUNTIF($V$5:V10,V10)-1","v":19},{"$f":"OFFSET(Map_Data!$E$1,MATCH(Model!U10,Model!$W$5:$W$56,0),0,1,1)","v":"IN"},11588,null,null,{"$f":"OFFSET(Map_Data!$U$1,MATCH(X10,Map_Data!$E$2:$E$53,0),$B$4,1,1)","v":8.5},null,6,5.5,202124,{"$f":"RANK(AF10,$AF$5:$AF$56,0)+COUNTIF($AF$5:AF10,AF10)-1","v":12},{"$f":"OFFSET(Map_Data!$D$1,MATCH(Model!AD10,Model!$AG$5:$AG$56,0),0,1,1)","v":"North Carolina"},265291,{"$f":"OFFSET(Map_Data!$N$1,MATCH(AH10,Map_Data!$D$2:$D$53,0),Model!$B$4,1,1)","v":225147},{"$f":"OFFSET(Map_Data!$H$1,MATCH(AH10,Map_Data!$D$2:$D$53,0),Model!$B$4,1,1)","v":436144000000},null,"US Migration",2.2063474575205588,2.2693760184119847,2.2791922272828531]
[null,null,null,"Average",{"$f":"IFERROR(AVERAGE(ActiveDataSet),\"\")","v":3718.9423076923076},{"$f":"OFFSET(Map_Data!E1,0,Model!B4,1,1)","v":2011},null,null,null,null,null,null,3,"Class7",3,null,null,null,null,null,7,1189,{"$f":"RANK(V11,$V$5:$V$56,0)+COUNTIF($V$5:V11,V11)-1","v":35},{"$f":"OFFSET(Map_Data!$E$1,MATCH(Model!U11,Model!$W$5:$W$56,0),0,1,1)","v":"CA"},9032,null,null,{"$f":"OFFSET(Map_Data!$U$1,MATCH(X11,Map_Data!$E$2:$E$53,0),$B$4,1,1)","v":11.2},null,7,6.5,71502,{"$f":"RANK(AF11,$AF$5:$AF$56,0)+COUNTIF($AF$5:AF11,AF11)-1","v":32},{"$f":"OFFSET(Map_Data!$D$1,MATCH(Model!AD11,Model!$AG$5:$AG$56,0),0,1,1)","v":"Virginia"},257130,{"$f":"OFFSET(Map_Data!$N$1,MATCH(AH11,Map_Data!$D$2:$D$53,0),Model!$B$4,1,1)","v":229227},{"$f":"OFFSET(Map_Data!$H$1,MATCH(AH11,Map_Data!$D$2:$D$53,0),Model!$B$4,1,1)","v":433611000000},null,"US Population",305628607,307900319,310212755]
[null,null,null,null,null,null,null,null,null,null,null,null,1,"Class8",1,null,null,null,null,null,8,263,{"$f":"RANK(V12,$V$5:$V$56,0)+COUNTIF($V$5:V12,V12)-1","v":45},{"$f":"OFFSET(Map_Data!$E$1,MATCH(Model!U12,Model!$W$5:$W$56,0),0,1,1)","v":"NY"},8784,null,null,{"$f":"OFFSET(Map_Data!$U$1,MATCH(X12,Map_Data!$E$2:$E$53,0),$B$4,1,1)","v":8.4},null,8,7.5,33912,{"$f":"RANK(AF12,$AF$5:$AF$56,0)+COUNTIF($AF$5:AF12,AF12)-1","v":44},{"$f":"OFFSET(Map_Data!$D$1,MATCH(Model!AD12,Model!$AG$5:$AG$56,0),0,1,1)","v":"Pennsylvania"},234291,{"$f":"OFFSET(Map_Data!$N$1,MATCH(AH12,Map_Data!$D$2:$D$53,0),Model!$B$4,1,1)","v":215127},{"$f":"OFFSET(Map_Data!$H$1,MATCH(AH12,Map_Data!$D$2:$D$53,0),Model!$B$4,1,1)","v":581256000000},null,"Unemployment",{"$f":"OFFSET(Map_Data!$E$1,MATCH(Model!$C$5,State_Names,0),17,1,3)","v":9.3000000000000007},7.9,7.3]
[null,null,null,null,null,null,null,null,null,null,null,null,0,"Class9",0,null,null,null,null,null,9,587,{"$f":"RANK(V13,$V$5:$V$56,0)+COUNTIF($V$5:V13,V13)-1","v":42},{"$f":"OFFSET(Map_Data!$E$1,MATCH(Model!U13,Model!$W$5:$W$56,0),0,1,1)","v":"WV"},7548,null,null,{"$f":"OFFSET(Map_Data!$U$1,MATCH(X13,Map_Data!$E$2:$E$53,0),$B$4,1,1)","v":7.3},null,9,8.5,48066,{"$f":"RANK(AF13,$AF$5:$AF$56,0)+COUNTIF($AF$5:AF13,AF13)-1","v":41},{"$f":"OFFSET(Map_Data!$D$1,MATCH(Model!AD13,Model!$AG$5:$AG$56,0),0,1,1)","v":"Arizona"},222877,{"$f":"OFFSET(Map_Data!$N$1,MATCH(AH13,Map_Data!$D$2:$D$53,0),Model!$B$4,1,1)","v":211816},{"$f":"OFFSET(Map_Data!$H$1,MATCH(AH13,Map_Data!$D$2:$D$53,0),Model!$B$4,1,1)","v":255989000000}]
[null,"Color Table",null,null,null,null,null,null,null,null,null,null,null,null,null,null,null,null,null,null,10,16492,{"$f":"RANK(V14,$V$5:$V$56,0)+COUNTIF($V$5:V14,V14)-1","v":1},{"$f":"OFFSET(Map_Data!$E$1,MATCH(Model!U14,Model!$W$5:$W$56,0),0,1,1)","v":"IL"},7027,"IL",7027,{"$f":"OFFSET(Map_Data!$U$1,MATCH(X14,Map_Data!$E$2:$E$53,0),$B$4,1,1)","v":9.4},null,10,9.5,498597,{"$f":"RANK(AF14,$AF$5:$AF$56,0)+COUNTIF($AF$5:AF14,AF14)-1","v":2},{"$f":"OFFSET(Map_Data!$D$1,MATCH(Model!AD14,Model!$AG$5:$AG$56,0),0,1,1)","v":"Illinois"},216204,{"$f":"OFFSET(Map_Data!$N$1,MATCH(AH14,Map_Data!$D$2:$D$53,0),Model!$B$4,1,1)","v":269008},{"$f":"OFFSET(Map_Data!$H$1,MATCH(AH14,Map_Data!$D$2:$D$53,0),Model!$B$4,1,1)","v":670247000000}]
[null,"Levels","Class Start","Class End","Class Name","Color","Class Range","Red","Green","Blue",null,null,null,null,null,null,null,null,null,null,11,4290,{"$f":"RANK(V15,$V$5:$V$56,0)+COUNTIF($V$5:V15,V15)-1","v":16},{"$f":"OFFSET(Map_Data!$E$1,MATCH(Model!U15,Model!$W$5:$W$56,0),0,1,1)","v":"AZ"},6763,null,null,{"$f":"OFFSET(Map_Data!$U$1,MATCH(X15,Map_Data!$E$2:$E$53,0),$B$4,1,1)","v":8.6999999999999993},null,11,10.5,271077,{"$f":"RANK(AF15,$AF$5:$AF$56,0)+COUNTIF($AF$5:AF15,AF15)-1","v":5},{"$f":"OFFSET(Map_Data!$D$1,MATCH(Model!AD15,Model!$AG$5:$AG$56,0),0,1,1)","v":"Washington"},208507,{"$f":"OFFSET(Map_Data!$N$1,MATCH(AH15,Map_Data!$D$2:$D$53,0),Model!$B$4,1,1)","v":190644},{"$f":"OFFSET(Map_Data!$H$1,MATCH(AH15,Map_Data!$D$2:$D$53,0),Model!$B$4,1,1)","v":357056000000}]
[null,{"$f":"ROW()-15","v":1},0,2061.5,{"$f":"IF(ColorTable[[#This Row],[Class Start]]<>\"\",\"Class\"&ColorTable[[#This Row],[Levels]],\"\")","v":"Class1"},null,{"$f":"IF(ColorTable[[#This Row],[Class Name]]<>\"\",TEXT(ColorTable[[#This Row],[Class Start]],\"0\")&\" - \"&TEXT(ColorTable[[#This Row],[Class End]],\"0\"),\"\")","v":"0 - 2062"},255,255,204,null,null,null,null,null,null,null,null,null,null,12,1044,{"$f":"RANK(V16,$V$5:$V$56,0)+COUNTIF($V$5:V16,V16)-1","v":38},{"$f":"OFFSET(Map_Data!$E$1,MATCH(Model!U16,Model!$W$5:$W$56,0),0,1,1)","v":"TN"},6468,null,null,{"$f":"OFFSET(Map_Data!$U$1,MATCH(X16,Map_Data!$E$2:$E$53,0),$B$4,1,1)","v":8.5},null,12,11.5,57542,{"$f":"RANK(AF16,$AF$5:$AF$56,0)+COUNTIF($AF$5:AF16,AF16)-1","v":38},{"$f":"OFFSET(Map_Data!$D$1,MATCH(Model!AD16,Model!$AG$5:$AG$56,0),0,1,1)","v":"Colorado"},202124,{"$f":"OFFSET(Map_Data!$N$1,MATCH(AH16,Map_Data!$D$2:$D$53,0),Model!$B$4,1,1)","v":160623},{"$f":"OFFSET(Map_Data!$H$1,MATCH(AH16,Map_Data!$D$2:$D$53,0),Model!$B$4,1,1)","v":264733000000}]
[null,2,2061.5,4123,{"$f":"IF(ColorTable[[#This Row],[Class Start]]<>\"\",\"Class\"&ColorTable[[#This Row],[Levels]],\"\")","v":"Class2"},null,{"$f":"IF(ColorTable[[#This Row],[Class Name]]<>\"\",TEXT(ColorTable[[#This Row],[Class Start]],\"0\")&\" - \"&TEXT(ColorTable[[#This Row],[Class End]],\"0\"),\"\")","v":"2062 - 4123"},255,237,160,null,null,null,null,null,null,null,null,null,null,13,312,{"$f":"RANK(V17,$V$5:$V$56,0)+COUNTIF($V$5:V17,V17)-1","v":44},{"$f":"OFFSET(Map_Data!$E$1,MATCH(Model!U17,Model!$W$5:$W$56,0),0,1,1)","v":"VA"},5425,null,null,{"$f":"OFFSET(Map_Data!$U$1,MATCH(X17,Map_Data!$E$2:$E$53,0),$B$4,1,1)","v":6.2},null,13,12.5,60336,{"$f":"RANK(AF17,$AF$5:$AF$56,0)+COUNTIF($AF$5:AF17,AF17)-1","v":37},{"$f":"OFFSET(Map_Data!$D$1,MATCH(Model!AD17,Model!$AG$5:$AG$56,0),0,1,1)","v":"Ohio"},191778,{"$f":"OFFSET(Map_Data!$N$1,MATCH(AH17,Map_Data!$D$2:$D$53,0),Model!$B$4,1,1)","v":206049},{"$f":"OFFSET(Map_Data!$H$1,MATCH(AH17,Map_Data!$D$2:$D$53,0),Model!$B$4,1,1)","v":490265000000}]
[null,3,4123,6184.5,{"$f":"IF(ColorTable[[#This Row],[Class Start]]<>\"\",\"Class\"&ColorTable[[#This Row],[Levels]],\"\")","v":"Class3"},null,{"$f":"IF(ColorTable[[#This Row],[Class Name]]<>\"\",TEXT(ColorTable[[#This Row],[Class Start]],\"0\")&\" - \"&TEXT(ColorTable[[#This Row],[Class End]],\"0\"),\"\")","v":"4123 - 6185"},254,217,118,null,null,null,null,null,null,null,null,null,null,14,7027,{"$f":"RANK(V18,$V$5:$V$56,0)+COUNTIF($V$5:V18,V18)-1","v":10},{"$f":"OFFSET(Map_Data!$E$1,MATCH(Model!U18,Model!$W$5:$W$56,0),0,1,1)","v":"MD"},4982,null,null,{"$f":"OFFSET(Map_Data!$U$1,MATCH(X18,Map_Data!$E$2:$E$53,0),$B$4,1,1)","v":7},null,14,13.5,216204,{"$f":"RANK(AF18,$AF$5:$AF$56,0)+COUNTIF($AF$5:AF18,AF18)-1","v":10},{"$f":"OFFSET(Map_Data!$D$1,MATCH(Model!AD18,Model!$AG$5:$AG$56,0),0,1,1)","v":"Tennessee"},170969,{"$f":"OFFSET(Map_Data!$N$1,MATCH(AH18,Map_Data!$D$2:$D$53,0),Model!$B$4,1,1)","v":154243},{"$f":"OFFSET(Map_Data!$H$1,MATCH(AH18,Map_Data!$D$2:$D$53,0),Model!$B$4,1,1)","v":263626000000}]
[null,4,6184.5,8246,{"$f":"IF(ColorTable[[#This Row],[Class Start]]<>\"\",\"Class\"&ColorTable[[#This Row],[Levels]],\"\")","v":"Class4"},null,{"$f":"IF(ColorTable[[#This Row],[Class Name]]<>\"\",TEXT(ColorTable[[#This Row],[Class Start]],\"0\")&\" - \"&TEXT(ColorTable[[#This Row],[Class End]],\"0\"),\"\")","v":"6185 - 8246"},254,178,76,null,null,null,null,null,null,null,null,null,null,15,11588,{"$f":"RANK(V19,$V$5:$V$56,0)+COUNTIF($V$5:V19,V19)-1","v":6},{"$f":"OFFSET(Map_Data!$E$1,MATCH(Model!U19,Model!$W$5:$W$56,0),0,1,1)","v":"NC"},4572,null,null,{"$f":"OFFSET(Map_Data!$U$1,MATCH(X19,Map_Data!$E$2:$E$53,0),$B$4,1,1)","v":9.6999999999999993},null,15,14.5,127874,{"$f":"RANK(AF19,$AF$5:$AF$56,0)+COUNTIF($AF$5:AF19,AF19)-1","v":22},{"$f":"OFFSET(Map_Data!$D$1,MATCH(Model!AD19,Model!$AG$5:$AG$56,0),0,1,1)","v":"South Carolina"},157644,{"$f":"OFFSET(Map_Data!$N$1,MATCH(AH19,Map_Data!$D$2:$D$53,0),Model!$B$4,1,1)","v":121426},{"$f":"OFFSET(Map_Data!$H$1,MATCH(AH19,Map_Data!$D$2:$D$53,0),Model!$B$4,1,1)","v":168716000000}]
[null,5,8246,10307.5,{"$f":"IF(ColorTable[[#This Row],[Class Start]]<>\"\",\"Class\"&ColorTable[[#This Row],[Levels]],\"\")","v":"Class5"},null,{"$f":"IF(ColorTable[[#This Row],[Class Name]]<>\"\",TEXT(ColorTable[[#This Row],[Class Start]],\"0\")&\" - \"&TEXT(ColorTable[[#This Row],[Class End]],\"0\"),\"\")","v":"8246 - 10308"},253,141,60,null,null,null,null,null,null,null,null,null,null,16,1146,{"$f":"RANK(V20,$V$5:$V$56,0)+COUNTIF($V$5:V20,V20)-1","v":37},{"$f":"OFFSET(Map_Data!$E$1,MATCH(Model!U20,Model!$W$5:$W$56,0),0,1,1)","v":"GA"},4290,null,null,{"$f":"OFFSET(Map_Data!$U$1,MATCH(X20,Map_Data!$E$2:$E$53,0),$B$4,1,1)","v":9.5},null,16,15.5,70405,{"$f":"RANK(AF20,$AF$5:$AF$56,0)+COUNTIF($AF$5:AF20,AF20)-1","v":33},{"$f":"OFFSET(Map_Data!$D$1,MATCH(Model!AD20,Model!$AG$5:$AG$56,0),0,1,1)","v":"Maryland"},153979,{"$f":"OFFSET(Map_Data!$N$1,MATCH(AH20,Map_Data!$D$2:$D$53,0),Model!$B$4,1,1)","v":165041},{"$f":"OFFSET(Map_Data!$H$1,MATCH(AH20,Map_Data!$D$2:$D$53,0),Model!$B$4,1,1)","v":305175000000}]
[null,6,10307.5,12369,{"$f":"IF(ColorTable[[#This Row],[Class Start]]<>\"\",\"Class\"&ColorTable[[#This Row],[Levels]],\"\")","v":"Class6"},null,{"$f":"IF(ColorTable[[#This Row],[Class Name]]<>\"\",TEXT(ColorTable[[#This Row],[Class Start]],\"0\")&\" - \"&TEXT(ColorTable[[#This Row],[Class End]],\"0\"),\"\")","v":"10308 - 12369"},252,78,42,null,null,null,null,null,null,null,null,null,null,17,657,{"$f":"RANK(V21,$V$5:$V$56,0)+COUNTIF($V$5:V21,V21)-1","v":41},{"$f":"OFFSET(Map_Data!$E$1,MATCH(Model!U21,Model!$W$5:$W$56,0),0,1,1)","v":"NJ"},3936,null,null,{"$f":"OFFSET(Map_Data!$U$1,MATCH(X21,Map_Data!$E$2:$E$53,0),$B$4,1,1)","v":9.1999999999999993},null,17,16.5,83640,{"$f":"RANK(AF21,$AF$5:$AF$56,0)+COUNTIF($AF$5:AF21,AF21)-1","v":31},{"$f":"OFFSET(Map_Data!$D$1,MATCH(Model!AD21,Model!$AG$5:$AG$56,0),0,1,1)","v":"Missouri"},149439,{"$f":"OFFSET(Map_Data!$N$1,MATCH(AH21,Map_Data!$D$2:$D$53,0),Model!$B$4,1,1)","v":138404},{"$f":"OFFSET(Map_Data!$H$1,MATCH(AH21,Map_Data!$D$2:$D$53,0),Model!$B$4,1,1)","v":249546000000}]
[null,7,12369,14430.5,{"$f":"IF(ColorTable[[#This Row],[Class Start]]<>\"\",\"Class\"&ColorTable[[#This Row],[Levels]],\"\")","v":"Class7"},null,{"$f":"IF(ColorTable[[#This Row],[Class Name]]<>\"\",TEXT(ColorTable[[#This Row],[Class Start]],\"0\")&\" - \"&TEXT(ColorTable[[#This Row],[Class End]],\"0\"),\"\")","v":"12369 - 14431"},227,26,28,null,null,null,null,null,null,null,null,null,null,18,12744,{"$f":"RANK(V22,$V$5:$V$56,0)+COUNTIF($V$5:V22,V22)-1","v":4},{"$f":"OFFSET(Map_Data!$E$1,MATCH(Model!U22,Model!$W$5:$W$56,0),0,1,1)","v":"SC"},3826,null,null,{"$f":"OFFSET(Map_Data!$U$1,MATCH(X22,Map_Data!$E$2:$E$53,0),$B$4,1,1)","v":9.6999999999999993},null,18,17.5,110031,{"$f":"RANK(AF22,$AF$5:$AF$56,0)+COUNTIF($AF$5:AF22,AF22)-1","v":25},{"$f":"OFFSET(Map_Data!$D$1,MATCH(Model!AD22,Model!$AG$5:$AG$56,0),0,1,1)","v":"New Jersey"},140194,{"$f":"OFFSET(Map_Data!$N$1,MATCH(AH22,Map_Data!$D$2:$D$53,0),Model!$B$4,1,1)","v":216369},{"$f":"OFFSET(Map_Data!$H$1,MATCH(AH22,Map_Data!$D$2:$D$53,0),Model!$B$4,1,1)","v":493175000000}]
[null,8,14430.5,16492,{"$f":"IF(ColorTable[[#This Row],[Class Start]]<>\"\",\"Class\"&ColorTable[[#This Row],[Levels]],\"\")","v":"Class8"},null,{"$f":"IF(ColorTable[[#This Row],[Class Name]]<>\"\",TEXT(ColorTable[[#This Row],[Class Start]],\"0\")&\" - \"&TEXT(ColorTable[[#This Row],[Class End]],\"0\"),\"\")","v":"14431 - 16492"},189,0,38,null,null,null,null,null,null,null,null,null,null,19,1872,{"$f":"RANK(V23,$V$5:$V$56,0)+COUNTIF($V$5:V23,V23)-1","v":27},{"$f":"OFFSET(Map_Data!$E$1,MATCH(Model!U23,Model!$W$5:$W$56,0),0,1,1)","v":"CO"},2690,null,null,{"$f":"OFFSET(Map_Data!$U$1,MATCH(X23,Map_Data!$E$2:$E$53,0),$B$4,1,1)","v":8.3000000000000007},null,19,18.5,99138,{"$f":"RANK(AF23,$AF$5:$AF$56,0)+COUNTIF($AF$5:AF23,AF23)-1","v":29},{"$f":"OFFSET(Map_Data!$D$1,MATCH(Model!AD23,Model!$AG$5:$AG$56,0),0,1,1)","v":"Massachusetts"},139830,{"$f":"OFFSET(Map_Data!$N$1,MATCH(AH23,Map_Data!$D$2:$D$53,0),Model!$B$4,1,1)","v":145869},{"$f":"OFFSET(Map_Data!$H$1,MATCH(AH23,Map_Data!$D$2:$D$53,0),Model!$B$4,1,1)","v":388575000000}]
[null,9,16492,null,{"$f":"IF(ColorTable[[#This Row],[Class Start]]<>\"\",\"Class\"&ColorTable[[#This Row],[Levels]],\"\")","v":"Class9"},null,{"$f":"IF(ColorTable[[#This Row],[Class Name]]<>\"\",TEXT(ColorTable[[#This Row],[Class Start]],\"0\")&\" - \"&TEXT(ColorTable[[#This Row],[Class End]],\"0\"),\"\")","v":"16492 - 0"},128,0,38,null,null,null,null,null,null,null,null,null,null,20,0,{"$f":"RANK(V24,$V$5:$V$56,0)+COUNTIF($V$5:V24,V24)-1","v":51},{"$f":"OFFSET(Map_Data!$E$1,MATCH(Model!U24,Model!$W$5:$W$56,0),0,1,1)","v":"WI"},2534,null,null,{"$f":"OFFSET(Map_Data!$U$1,MATCH(X24,Map_Data!$E$2:$E$53,0),$B$4,1,1)","v":7.1},null,20,19.5,33818,{"$f":"RANK(AF24,$AF$5:$AF$56,0)+COUNTIF($AF$5:AF24,AF24)-1","v":45},{"$f":"OFFSET(Map_Data!$D$1,MATCH(Model!AD24,Model!$AG$5:$AG$56,0),0,1,1)","v":"Michigan"},139158,{"$f":"OFFSET(Map_Data!$N$1,MATCH(AH24,Map_Data!$D$2:$D$53,0),Model!$B$4,1,1)","v":186505},{"$f":"OFFSET(Map_Data!$H$1,MATCH(AH24,Map_Data!$D$2:$D$53,0),Model!$B$4,1,1)","v":385123000000}]
[null,null,null,null,null,null,null,null,null,null,null,null,null,null,null,null,null,null,null,null,21,4982,{"$f":"RANK(V25,$V$5:$V$56,0)+COUNTIF($V$5:V25,V25)-1","v":14},{"$f":"OFFSET(Map_Data!$E$1,MATCH(Model!U25,Model!$W$5:$W$56,0),0,1,1)","v":"OK"},2333,null,null,{"$f":"OFFSET(Map_Data!$U$1,MATCH(X25,Map_Data!$E$2:$E$53,0),$B$4,1,1)","v":5.7},null,21,20.5,153979,{"$f":"RANK(AF25,$AF$5:$AF$56,0)+COUNTIF($AF$5:AF25,AF25)-1","v":16},{"$f":"OFFSET(Map_Data!$D$1,MATCH(Model!AD25,Model!$AG$5:$AG$56,0),0,1,1)","v":"Oregon"},127906,{"$f":"OFFSET(Map_Data!$N$1,MATCH(AH25,Map_Data!$D$2:$D$53,0),Model!$B$4,1,1)","v":109795},{"$f":"OFFSET(Map_Data!$H$1,MATCH(AH25,Map_Data!$D$2:$D$53,0),Model!$B$4,1,1)","v":188981000000}]
[null,null,null,null,null,null,null,null,null,null,null,null,null,null,null,null,null,null,null,null,22,2101,{"$f":"RANK(V26,$V$5:$V$56,0)+COUNTIF($V$5:V26,V26)-1","v":22},{"$f":"OFFSET(Map_Data!$E$1,MATCH(Model!U26,Model!$W$5:$W$56,0),0,1,1)","v":"MA"},2101,null,null,{"$f":"OFFSET(Map_Data!$U$1,MATCH(X26,Map_Data!$E$2:$E$53,0),$B$4,1,1)","v":6.9},null,22,21.5,139830,{"$f":"RANK(AF26,$AF$5:$AF$56,0)+COUNTIF($AF$5:AF26,AF26)-1","v":19},{"$f":"OFFSET(Map_Data!$D$1,MATCH(Model!AD26,Model!$AG$5:$AG$56,0),0,1,1)","v":"Indiana"},127874,{"$f":"OFFSET(Map_Data!$N$1,MATCH(AH26,Map_Data!$D$2:$D$53,0),Model!$B$4,1,1)","v":143228},{"$f":"OFFSET(Map_Data!$H$1,MATCH(AH26,Map_Data!$D$2:$D$53,0),Model!$B$4,1,1)","v":284344000000}]
[null,null,null,null,null,null,null,null,null,null,null,null,null,null,null,null,null,null,null,null,23,14330,{"$f":"RANK(V27,$V$5:$V$56,0)+COUNTIF($V$5:V27,V27)-1","v":2},{"$f":"OFFSET(Map_Data!$E$1,MATCH(Model!U27,Model!$W$5:$W$56,0),0,1,1)","v":"MO"},2003,null,null,{"$f":"OFFSET(Map_Data!$U$1,MATCH(X27,Map_Data!$E$2:$E$53,0),$B$4,1,1)","v":7.6},null,23,22.5,139158,{"$f":"RANK(AF27,$AF$5:$AF$56,0)+COUNTIF($AF$5:AF27,AF27)-1","v":20},{"$f":"OFFSET(Map_Data!$D$1,MATCH(Model!AD27,Model!$AG$5:$AG$56,0),0,1,1)","v":"Alabama"},117726,{"$f":"OFFSET(Map_Data!$N$1,MATCH(AH27,Map_Data!$D$2:$D$53,0),Model!$B$4,1,1)","v":106806},{"$f":"OFFSET(Map_Data!$H$1,MATCH(AH27,Map_Data!$D$2:$D$53,0),Model!$B$4,1,1)","v":178533000000}]
[null,null,null,null,null,null,null,null,null,null,null,null,null,null,null,null,null,null,null,null,24,1788,{"$f":"RANK(V28,$V$5:$V$56,0)+COUNTIF($V$5:V28,V28)-1","v":29},{"$f":"OFFSET(Map_Data!$E$1,MATCH(Model!U28,Model!$W$5:$W$56,0),0,1,1)","v":"NH"},1992,null,null,{"$f":"OFFSET(Map_Data!$U$1,MATCH(X28,Map_Data!$E$2:$E$53,0),$B$4,1,1)","v":5.4},null,24,23.5,101029,{"$f":"RANK(AF28,$AF$5:$AF$56,0)+COUNTIF($AF$5:AF28,AF28)-1","v":28},{"$f":"OFFSET(Map_Data!$D$1,MATCH(Model!AD28,Model!$AG$5:$AG$56,0),0,1,1)","v":"Nevada"},110345,{"$f":"OFFSET(Map_Data!$N$1,MATCH(AH28,Map_Data!$D$2:$D$53,0),Model!$B$4,1,1)","v":115943},{"$f":"OFFSET(Map_Data!$H$1,MATCH(AH28,Map_Data!$D$2:$D$53,0),Model!$B$4,1,1)","v":129421000000}]
[null,null,null,null,null,null,null,null,null,null,null,null,null,null,null,null,null,null,null,null,25,691,{"$f":"RANK(V29,$V$5:$V$56,0)+COUNTIF($V$5:V29,V29)-1","v":39},{"$f":"OFFSET(Map_Data!$E$1,MATCH(Model!U29,Model!$W$5:$W$56,0),0,1,1)","v":"WA"},1979,null,null,{"$f":"OFFSET(Map_Data!$U$1,MATCH(X29,Map_Data!$E$2:$E$53,0),$B$4,1,1)","v":8.6},null,25,24.5,68511,{"$f":"RANK(AF29,$AF$5:$AF$56,0)+COUNTIF($AF$5:AF29,AF29)-1","v":35},{"$f":"OFFSET(Map_Data!$D$1,MATCH(Model!AD29,Model!$AG$5:$AG$56,0),0,1,1)","v":"Kentucky"},110031,{"$f":"OFFSET(Map_Data!$N$1,MATCH(AH29,Map_Data!$D$2:$D$53,0),Model!$B$4,1,1)","v":99256},{"$f":"OFFSET(Map_Data!$H$1,MATCH(AH29,Map_Data!$D$2:$D$53,0),Model!$B$4,1,1)","v":168019000000}]
[null,null,null,null,null,null,null,null,null,null,null,null,null,null,null,null,null,null,null,null,26,2003,{"$f":"RANK(V30,$V$5:$V$56,0)+COUNTIF($V$5:V30,V30)-1","v":23},{"$f":"OFFSET(Map_Data!$E$1,MATCH(Model!U30,Model!$W$5:$W$56,0),0,1,1)","v":"AR"},1952,null,null,{"$f":"OFFSET(Map_Data!$U$1,MATCH(X30,Map_Data!$E$2:$E$53,0),$B$4,1,1)","v":7.6},null,26,25.5,149439,{"$f":"RANK(AF30,$AF$5:$AF$56,0)+COUNTIF($AF$5:AF30,AF30)-1","v":17},{"$f":"OFFSET(Map_Data!$D$1,MATCH(Model!AD30,Model!$AG$5:$AG$56,0),0,1,1)","v":"Wisconsin"},109439,{"$f":"OFFSET(Map_Data!$N$1,MATCH(AH30,Map_Data!$D$2:$D$53,0),Model!$B$4,1,1)","v":105370},{"$f":"OFFSET(Map_Data!$H$1,MATCH(AH30,Map_Data!$D$2:$D$53,0),Model!$B$4,1,1)","v":253349000000}]
[null,null,null,null,null,null,null,null,null,null,null,null,null,null,null,null,null,null,null,null,27,101,{"$f":"RANK(V31,$V$5:$V$56,0)+COUNTIF($V$5:V31,V31)-1","v":48},{"$f":"OFFSET(Map_Data!$E$1,MATCH(Model!U31,Model!$W$5:$W$56,0),0,1,1)","v":"LA"},1872,null,null,{"$f":"OFFSET(Map_Data!$U$1,MATCH(X31,Map_Data!$E$2:$E$53,0),$B$4,1,1)","v":7},null,27,26.5,33553,{"$f":"RANK(AF31,$AF$5:$AF$56,0)+COUNTIF($AF$5:AF31,AF31)-1","v":46},{"$f":"OFFSET(Map_Data!$D$1,MATCH(Model!AD31,Model!$AG$5:$AG$56,0),0,1,1)","v":"Oklahoma"},108878,{"$f":"OFFSET(Map_Data!$N$1,MATCH(AH31,Map_Data!$D$2:$D$53,0),Model!$B$4,1,1)","v":81009},{"$f":"OFFSET(Map_Data!$H$1,MATCH(AH31,Map_Data!$D$2:$D$53,0),Model!$B$4,1,1)","v":156058000000}]
[null,null,null,null,null,null,null,null,null,null,null,null,null,null,null,null,null,null,null,null,28,1176,{"$f":"RANK(V32,$V$5:$V$56,0)+COUNTIF($V$5:V32,V32)-1","v":36},{"$f":"OFFSET(Map_Data!$E$1,MATCH(Model!U32,Model!$W$5:$W$56,0),0,1,1)","v":"NV"},1851,null,null,{"$f":"OFFSET(Map_Data!$U$1,MATCH(X32,Map_Data!$E$2:$E$53,0),$B$4,1,1)","v":12.4},null,28,27.5,52070,{"$f":"RANK(AF32,$AF$5:$AF$56,0)+COUNTIF($AF$5:AF32,AF32)-1","v":39},{"$f":"OFFSET(Map_Data!$D$1,MATCH(Model!AD32,Model!$AG$5:$AG$56,0),0,1,1)","v":"Minnesota"},101029,{"$f":"OFFSET(Map_Data!$N$1,MATCH(AH32,Map_Data!$D$2:$D$53,0),Model!$B$4,1,1)","v":103253},{"$f":"OFFSET(Map_Data!$H$1,MATCH(AH32,Map_Data!$D$2:$D$53,0),Model!$B$4,1,1)","v":279987000000}]
[null,null,null,null,null,null,null,null,null,null,null,null,null,null,null,null,null,null,null,null,29,1851,{"$f":"RANK(V33,$V$5:$V$56,0)+COUNTIF($V$5:V33,V33)-1","v":28},{"$f":"OFFSET(Map_Data!$E$1,MATCH(Model!U33,Model!$W$5:$W$56,0),0,1,1)","v":"MN"},1788,null,null,{"$f":"OFFSET(Map_Data!$U$1,MATCH(X33,Map_Data!$E$2:$E$53,0),$B$4,1,1)","v":5.8},null,29,28.5,110345,{"$f":"RANK(AF33,$AF$5:$AF$56,0)+COUNTIF($AF$5:AF33,AF33)-1","v":24},{"$f":"OFFSET(Map_Data!$D$1,MATCH(Model!AD33,Model!$AG$5:$AG$56,0),0,1,1)","v":"Louisiana"},99138,{"$f":"OFFSET(Map_Data!$N$1,MATCH(AH33,Map_Data!$D$2:$D$53,0),Model!$B$4,1,1)","v":86593},{"$f":"OFFSET(Map_Data!$H$1,MATCH(AH33,Map_Data!$D$2:$D$53,0),Model!$B$4,1,1)","v":237389000000}]
[null,null,null,null,null,null,null,null,null,null,null,null,null,null,null,null,null,null,null,null,30,1992,{"$f":"RANK(V34,$V$5:$V$56,0)+COUNTIF($V$5:V34,V34)-1","v":24},{"$f":"OFFSET(Map_Data!$E$1,MATCH(Model!U34,Model!$W$5:$W$56,0),0,1,1)","v":"AK"},1637,null,null,{"$f":"OFFSET(Map_Data!$U$1,MATCH(X34,Map_Data!$E$2:$E$53,0),$B$4,1,1)","v":7.4},null,30,29.5,37000,{"$f":"RANK(AF34,$AF$5:$AF$56,0)+COUNTIF($AF$5:AF34,AF34)-1","v":42},{"$f":"OFFSET(Map_Data!$D$1,MATCH(Model!AD34,Model!$AG$5:$AG$56,0),0,1,1)","v":"Utah"},85217,{"$f":"OFFSET(Map_Data!$N$1,MATCH(AH34,Map_Data!$D$2:$D$53,0),Model!$B$4,1,1)","v":73211},{"$f":"OFFSET(Map_Data!$H$1,MATCH(AH34,Map_Data!$D$2:$D$53,0),Model!$B$4,1,1)","v":124454000000}]
[null,null,null,null,null,null,null,null,null,null,null,null,null,null,null,null,null,null,null,null,31,3936,{"$f":"RANK(V35,$V$5:$V$56,0)+COUNTIF($V$5:V35,V35)-1","v":17},{"$f":"OFFSET(Map_Data!$E$1,MATCH(Model!U35,Model!$W$5:$W$56,0),0,1,1)","v":"PR"},1607,null,null,{"$f":"OFFSET(Map_Data!$U$1,MATCH(X35,Map_Data!$E$2:$E$53,0),$B$4,1,1)","v":16.2},null,31,30.5,140194,{"$f":"RANK(AF35,$AF$5:$AF$56,0)+COUNTIF($AF$5:AF35,AF35)-1","v":18},{"$f":"OFFSET(Map_Data!$D$1,MATCH(Model!AD35,Model!$AG$5:$AG$56,0),0,1,1)","v":"Kansas"},83640,{"$f":"OFFSET(Map_Data!$N$1,MATCH(AH35,Map_Data!$D$2:$D$53,0),Model!$B$4,1,1)","v":94180},{"$f":"OFFSET(Map_Data!$H$1,MATCH(AH35,Map_Data!$D$2:$D$53,0),Model!$B$4,1,1)","v":134767000000}]
[null,null,null,null,null,null,null,null,null,null,null,null,null,null,null,null,null,null,null,null,32,255,{"$f":"RANK(V36,$V$5:$V$56,0)+COUNTIF($V$5:V36,V36)-1","v":46},{"$f":"OFFSET(Map_Data!$E$1,MATCH(Model!U36,Model!$W$5:$W$56,0),0,1,1)","v":"AL"},1567,null,null,{"$f":"OFFSET(Map_Data!$U$1,MATCH(X36,Map_Data!$E$2:$E$53,0),$B$4,1,1)","v":7.3},null,32,31.5,62130,{"$f":"RANK(AF36,$AF$5:$AF$56,0)+COUNTIF($AF$5:AF36,AF36)-1","v":36},{"$f":"OFFSET(Map_Data!$D$1,MATCH(Model!AD36,Model!$AG$5:$AG$56,0),0,1,1)","v":"Connecticut"},71502,{"$f":"OFFSET(Map_Data!$N$1,MATCH(AH36,Map_Data!$D$2:$D$53,0),Model!$B$4,1,1)","v":91295},{"$f":"OFFSET(Map_Data!$H$1,MATCH(AH36,Map_Data!$D$2:$D$53,0),Model!$B$4,1,1)","v":225409000000}]
[null,null,null,null,null,null,null,null,null,null,null,null,null,null,null,null,null,null,null,null,33,8784,{"$f":"RANK(V37,$V$5:$V$56,0)+COUNTIF($V$5:V37,V37)-1","v":8},{"$f":"OFFSET(Map_Data!$E$1,MATCH(Model!U37,Model!$W$5:$W$56,0),0,1,1)","v":"OR"},{"$f":"LARGE(ActiveDataSet,U37)","v":1326},null,null,{"$f":"OFFSET(Map_Data!$U$1,MATCH(X37,Map_Data!$E$2:$E$53,0),$B$4,1,1)","v":9.1999999999999993},null,33,32.5,282209,{"$f":"RANK(AF37,$AF$5:$AF$56,0)+COUNTIF($AF$5:AF37,AF37)-1","v":4},{"$f":"OFFSET(Map_Data!$D$1,MATCH(Model!AD37,Model!$AG$5:$AG$56,0),0,1,1)","v":"Iowa"},70405,{"$f":"OFFSET(Map_Data!$N$1,MATCH(AH37,Map_Data!$D$2:$D$53,0),Model!$B$4,1,1)","v":74516},{"$f":"OFFSET(Map_Data!$H$1,MATCH(AH37,Map_Data!$D$2:$D$53,0),Model!$B$4,1,1)","v":146057000000}]
[null,null,null,null,null,null,null,null,null,null,null,null,null,null,null,null,null,null,null,null,34,4572,{"$f":"RANK(V38,$V$5:$V$56,0)+COUNTIF($V$5:V38,V38)-1","v":15},{"$f":"OFFSET(Map_Data!$E$1,MATCH(Model!U38,Model!$W$5:$W$56,0),0,1,1)","v":"WY"},1280,null,null,{"$f":"OFFSET(Map_Data!$U$1,MATCH(X38,Map_Data!$E$2:$E$53,0),$B$4,1,1)","v":5.8},null,34,33.5,265291,{"$f":"RANK(AF38,$AF$5:$AF$56,0)+COUNTIF($AF$5:AF38,AF38)-1","v":6},{"$f":"OFFSET(Map_Data!$D$1,MATCH(Model!AD38,Model!$AG$5:$AG$56,0),0,1,1)","v":"Arkansas"},69845,{"$f":"OFFSET(Map_Data!$N$1,MATCH(AH38,Map_Data!$D$2:$D$53,0),Model!$B$4,1,1)","v":77226},{"$f":"OFFSET(Map_Data!$H$1,MATCH(AH38,Map_Data!$D$2:$D$53,0),Model!$B$4,1,1)","v":106557000000}]
[null,null,null,null,null,null,null,null,null,null,null,null,null,null,null,null,null,null,null,null,35,204,{"$f":"RANK(V39,$V$5:$V$56,0)+COUNTIF($V$5:V39,V39)-1","v":47},{"$f":"OFFSET(Map_Data!$E$1,MATCH(Model!U39,Model!$W$5:$W$56,0),0,1,1)","v":"CT"},1189,null,null,{"$f":"OFFSET(Map_Data!$U$1,MATCH(X39,Map_Data!$E$2:$E$53,0),$B$4,1,1)","v":8.3000000000000007},null,35,34.5,32510,{"$f":"RANK(AF39,$AF$5:$AF$56,0)+COUNTIF($AF$5:AF39,AF39)-1","v":47},{"$f":"OFFSET(Map_Data!$D$1,MATCH(Model!AD39,Model!$AG$5:$AG$56,0),0,1,1)","v":"Mississippi"},68511,{"$f":"OFFSET(Map_Data!$N$1,MATCH(AH39,Map_Data!$D$2:$D$53,0),Model!$B$4,1,1)","v":68597},{"$f":"OFFSET(Map_Data!$H$1,MATCH(AH39,Map_Data!$D$2:$D$53,0),Model!$B$4,1,1)","v":97533000000}]
[null,null,null,null,null,null,null,null,null,null,null,null,null,null,null,null,null,null,null,null,36,0,{"$f":"RANK(V40,$V$5:$V$56,0)+COUNTIF($V$5:V40,V40)-1","v":52},{"$f":"OFFSET(Map_Data!$E$1,MATCH(Model!U40,Model!$W$5:$W$56,0),0,1,1)","v":"NE"},1176,null,null,{"$f":"OFFSET(Map_Data!$U$1,MATCH(X40,Map_Data!$E$2:$E$53,0),$B$4,1,1)","v":4.2},null,36,35.5,191778,{"$f":"RANK(AF40,$AF$5:$AF$56,0)+COUNTIF($AF$5:AF40,AF40)-1","v":13},{"$f":"OFFSET(Map_Data!$D$1,MATCH(Model!AD40,Model!$AG$5:$AG$56,0),0,1,1)","v":"New Mexico"},62130,{"$f":"OFFSET(Map_Data!$N$1,MATCH(AH40,Map_Data!$D$2:$D$53,0),Model!$B$4,1,1)","v":61431},{"$f":"OFFSET(Map_Data!$H$1,MATCH(AH40,Map_Data!$D$2:$D$53,0),Model!$B$4,1,1)","v":79555000000}]
[null,null,null,null,null,null,null,null,null,null,null,null,null,null,null,null,null,null,null,null,37,2333,{"$f":"RANK(V41,$V$5:$V$56,0)+COUNTIF($V$5:V41,V41)-1","v":21},{"$f":"OFFSET(Map_Data!$E$1,MATCH(Model!U41,Model!$W$5:$W$56,0),0,1,1)","v":"IA"},1146,null,null,{"$f":"OFFSET(Map_Data!$U$1,MATCH(X41,Map_Data!$E$2:$E$53,0),$B$4,1,1)","v":5.5},null,37,36.5,108878,{"$f":"RANK(AF41,$AF$5:$AF$56,0)+COUNTIF($AF$5:AF41,AF41)-1","v":27},{"$f":"OFFSET(Map_Data!$D$1,MATCH(Model!AD41,Model!$AG$5:$AG$56,0),0,1,1)","v":"Idaho"},60336,{"$f":"OFFSET(Map_Data!$N$1,MATCH(AH41,Map_Data!$D$2:$D$53,0),Model!$B$4,1,1)","v":57831},{"$f":"OFFSET(Map_Data!$H$1,MATCH(AH41,Map_Data!$D$2:$D$53,0),Model!$B$4,1,1)","v":57096000000}]
[null,null,null,null,null,null,null,null,null,null,null,null,null,null,null,null,null,null,null,null,38,1326,{"$f":"RANK(V42,$V$5:$V$56,0)+COUNTIF($V$5:V42,V42)-1","v":33},{"$f":"OFFSET(Map_Data!$E$1,MATCH(Model!U42,Model!$W$5:$W$56,0),0,1,1)","v":"HI"},1044,null,null,{"$f":"OFFSET(Map_Data!$U$1,MATCH(X42,Map_Data!$E$2:$E$53,0),$B$4,1,1)","v":6.4},null,38,37.5,127906,{"$f":"RANK(AF42,$AF$5:$AF$56,0)+COUNTIF($AF$5:AF42,AF42)-1","v":21},{"$f":"OFFSET(Map_Data!$D$1,MATCH(Model!AD42,Model!$AG$5:$AG$56,0),0,1,1)","v":"Hawaii"},57542,{"$f":"OFFSET(Map_Data!$N$1,MATCH(AH42,Map_Data!$D$2:$D$53,0),Model!$B$4,1,1)","v":61940},{"$f":"OFFSET(Map_Data!$H$1,MATCH(AH42,Map_Data!$D$2:$D$53,0),Model!$B$4,1,1)","v":70006000000}]
[null,null,null,null,null,null,null,null,null,null,null,null,null,null,null,null,null,null,null,null,39,14292,{"$f":"RANK(V43,$V$5:$V$56,0)+COUNTIF($V$5:V43,V43)-1","v":3},{"$f":"OFFSET(Map_Data!$E$1,MATCH(Model!U43,Model!$W$5:$W$56,0),0,1,1)","v":"MS"},691,null,null,{"$f":"OFFSET(Map_Data!$U$1,MATCH(X43,Map_Data!$E$2:$E$53,0),$B$4,1,1)","v":9.8000000000000007},null,39,38.5,234291,{"$f":"RANK(AF43,$AF$5:$AF$56,0)+COUNTIF($AF$5:AF43,AF43)-1","v":8},{"$f":"OFFSET(Map_Data!$D$1,MATCH(Model!AD43,Model!$AG$5:$AG$56,0),0,1,1)","v":"Nebraska"},52070,{"$f":"OFFSET(Map_Data!$N$1,MATCH(AH43,Map_Data!$D$2:$D$53,0),Model!$B$4,1,1)","v":52809},{"$f":"OFFSET(Map_Data!$H$1,MATCH(AH43,Map_Data!$D$2:$D$53,0),Model!$B$4,1,1)","v":96230000000}]
[null,null,null,null,null,null,null,null,null,null,null,null,null,null,null,null,null,null,null,null,40,369,{"$f":"RANK(V44,$V$5:$V$56,0)+COUNTIF($V$5:V44,V44)-1","v":43},{"$f":"OFFSET(Map_Data!$E$1,MATCH(Model!U44,Model!$W$5:$W$56,0),0,1,1)","v":"UT"},691,null,null,{"$f":"OFFSET(Map_Data!$U$1,MATCH(X44,Map_Data!$E$2:$E$53,0),$B$4,1,1)","v":5.9},null,40,39.5,26769,{"$f":"RANK(AF44,$AF$5:$AF$56,0)+COUNTIF($AF$5:AF44,AF44)-1","v":50},{"$f":"OFFSET(Map_Data!$D$1,MATCH(Model!AD44,Model!$AG$5:$AG$56,0),0,1,1)","v":"West Virginia"},50068,{"$f":"OFFSET(Map_Data!$N$1,MATCH(AH44,Map_Data!$D$2:$D$53,0),Model!$B$4,1,1)","v":45956},{"$f":"OFFSET(Map_Data!$H$1,MATCH(AH44,Map_Data!$D$2:$D$53,0),Model!$B$4,1,1)","v":66109000000}]
[null,null,null,null,null,null,null,null,null,null,null,null,null,null,null,null,null,null,null,null,41,3826,{"$f":"RANK(V45,$V$5:$V$56,0)+COUNTIF($V$5:V45,V45)-1","v":18},{"$f":"OFFSET(Map_Data!$E$1,MATCH(Model!U45,Model!$W$5:$W$56,0),0,1,1)","v":"KS"},657,null,null,{"$f":"OFFSET(Map_Data!$U$1,MATCH(X45,Map_Data!$E$2:$E$53,0),$B$4,1,1)","v":6.1},null,41,40.5,157644,{"$f":"RANK(AF45,$AF$5:$AF$56,0)+COUNTIF($AF$5:AF45,AF45)-1","v":15},{"$f":"OFFSET(Map_Data!$D$1,MATCH(Model!AD45,Model!$AG$5:$AG$56,0),0,1,1)","v":"District of Columbia"},48066,{"$f":"OFFSET(Map_Data!$N$1,MATCH(AH45,Map_Data!$D$2:$D$53,0),Model!$B$4,1,1)","v":49732},{"$f":"OFFSET(Map_Data!$H$1,MATCH(AH45,Map_Data!$D$2:$D$53,0),Model!$B$4,1,1)","v":107201000000}]
[null,null,null,null,null,null,null,null,null,null,null,null,null,null,null,null,null,null,null,null,42,34,{"$f":"RANK(V46,$V$5:$V$56,0)+COUNTIF($V$5:V46,V46)-1","v":50},{"$f":"OFFSET(Map_Data!$E$1,MATCH(Model!U46,Model!$W$5:$W$56,0),0,1,1)","v":"DC"},587,null,null,{"$f":"OFFSET(Map_Data!$U$1,MATCH(X46,Map_Data!$E$2:$E$53,0),$B$4,1,1)","v":9.6999999999999993},null,42,41.5,27506,{"$f":"RANK(AF46,$AF$5:$AF$56,0)+COUNTIF($AF$5:AF46,AF46)-1","v":49},{"$f":"OFFSET(Map_Data!$D$1,MATCH(Model!AD46,Model!$AG$5:$AG$56,0),0,1,1)","v":"New Hampshire"},37000,{"$f":"OFFSET(Map_Data!$N$1,MATCH(AH46,Map_Data!$D$2:$D$53,0),Model!$B$4,1,1)","v":43277},{"$f":"OFFSET(Map_Data!$H$1,MATCH(AH46,Map_Data!$D$2:$D$53,0),Model!$B$4,1,1)","v":63333000000}]
[null,null,null,null,null,null,null,null,null,null,null,null,null,null,null,null,null,null,null,null,43,6468,{"$f":"RANK(V47,$V$5:$V$56,0)+COUNTIF($V$5:V47,V47)-1","v":12},{"$f":"OFFSET(Map_Data!$E$1,MATCH(Model!U47,Model!$W$5:$W$56,0),0,1,1)","v":"RI"},369,null,null,{"$f":"OFFSET(Map_Data!$U$1,MATCH(X47,Map_Data!$E$2:$E$53,0),$B$4,1,1)","v":10.9},null,43,42.5,170969,{"$f":"RANK(AF47,$AF$5:$AF$56,0)+COUNTIF($AF$5:AF47,AF47)-1","v":14},{"$f":"OFFSET(Map_Data!$D$1,MATCH(Model!AD47,Model!$AG$5:$AG$56,0),0,1,1)","v":"Alaska"},35084,{"$f":"OFFSET(Map_Data!$N$1,MATCH(AH47,Map_Data!$D$2:$D$53,0),Model!$B$4,1,1)","v":88850},{"$f":"OFFSET(Map_Data!$H$1,MATCH(AH47,Map_Data!$D$2:$D$53,0),Model!$B$4,1,1)","v":51237000000}]
[null,null,null,null,null,null,null,null,null,null,null,null,null,null,null,null,null,null,null,null,44,11987,{"$f":"RANK(V48,$V$5:$V$56,0)+COUNTIF($V$5:V48,V48)-1","v":5},{"$f":"OFFSET(Map_Data!$E$1,MATCH(Model!U48,Model!$W$5:$W$56,0),0,1,1)","v":"ID"},312,null,null,{"$f":"OFFSET(Map_Data!$U$1,MATCH(X48,Map_Data!$E$2:$E$53,0),$B$4,1,1)","v":7.8},null,44,43.5,514726,{"$f":"RANK(AF48,$AF$5:$AF$56,0)+COUNTIF($AF$5:AF48,AF48)-1","v":1},{"$f":"OFFSET(Map_Data!$D$1,MATCH(Model!AD48,Model!$AG$5:$AG$56,0),0,1,1)","v":"Delaware"},33912,{"$f":"OFFSET(Map_Data!$N$1,MATCH(AH48,Map_Data!$D$2:$D$53,0),Model!$B$4,1,1)","v":26631},{"$f":"OFFSET(Map_Data!$H$1,MATCH(AH48,Map_Data!$D$2:$D$53,0),Model!$B$4,1,1)","v":64377000000}]
[null,null,null,null,null,null,null,null,null,null,null,null,null,null,null,null,null,null,null,null,45,691,{"$f":"RANK(V49,$V$5:$V$56,0)+COUNTIF($V$5:V49,V49)-1","v":40},{"$f":"OFFSET(Map_Data!$E$1,MATCH(Model!U49,Model!$W$5:$W$56,0),0,1,1)","v":"DE"},263,null,null,{"$f":"OFFSET(Map_Data!$U$1,MATCH(X49,Map_Data!$E$2:$E$53,0),$B$4,1,1)","v":7.2},null,45,44.5,85217,{"$f":"RANK(AF49,$AF$5:$AF$56,0)+COUNTIF($AF$5:AF49,AF49)-1","v":30},{"$f":"OFFSET(Map_Data!$D$1,MATCH(Model!AD49,Model!$AG$5:$AG$56,0),0,1,1)","v":"Maine"},33818,{"$f":"OFFSET(Map_Data!$N$1,MATCH(AH49,Map_Data!$D$2:$D$53,0),Model!$B$4,1,1)","v":33729},{"$f":"OFFSET(Map_Data!$H$1,MATCH(AH49,Map_Data!$D$2:$D$53,0),Model!$B$4,1,1)","v":52489000000}]
[null,null,null,null,null,null,null,null,null,null,null,null,null,null,null,null,null,null,null,null,46,68,{"$f":"RANK(V50,$V$5:$V$56,0)+COUNTIF($V$5:V50,V50)-1","v":49},{"$f":"OFFSET(Map_Data!$E$1,MATCH(Model!U50,Model!$W$5:$W$56,0),0,1,1)","v":"NM"},255,null,null,{"$f":"OFFSET(Map_Data!$U$1,MATCH(X50,Map_Data!$E$2:$E$53,0),$B$4,1,1)","v":7.2},null,46,45.5,20463,{"$f":"RANK(AF50,$AF$5:$AF$56,0)+COUNTIF($AF$5:AF50,AF50)-1","v":52},{"$f":"OFFSET(Map_Data!$D$1,MATCH(Model!AD50,Model!$AG$5:$AG$56,0),0,1,1)","v":"Montana"},33553,{"$f":"OFFSET(Map_Data!$N$1,MATCH(AH50,Map_Data!$D$2:$D$53,0),Model!$B$4,1,1)","v":31204},{"$f":"OFFSET(Map_Data!$H$1,MATCH(AH50,Map_Data!$D$2:$D$53,0),Model!$B$4,1,1)","v":38933000000}]
[null,null,null,null,null,null,null,null,null,null,null,null,null,null,null,null,null,null,null,null,47,5425,{"$f":"RANK(V51,$V$5:$V$56,0)+COUNTIF($V$5:V51,V51)-1","v":13},{"$f":"OFFSET(Map_Data!$E$1,MATCH(Model!U51,Model!$W$5:$W$56,0),0,1,1)","v":"ND"},204,null,null,{"$f":"OFFSET(Map_Data!$U$1,MATCH(X51,Map_Data!$E$2:$E$53,0),$B$4,1,1)","v":3.1},null,47,46.5,257130,{"$f":"RANK(AF51,$AF$5:$AF$56,0)+COUNTIF($AF$5:AF51,AF51)-1","v":7},{"$f":"OFFSET(Map_Data!$D$1,MATCH(Model!AD51,Model!$AG$5:$AG$56,0),0,1,1)","v":"North Dakota"},32510,{"$f":"OFFSET(Map_Data!$N$1,MATCH(AH51,Map_Data!$D$2:$D$53,0),Model!$B$4,1,1)","v":26563},{"$f":"OFFSET(Map_Data!$H$1,MATCH(AH51,Map_Data!$D$2:$D$53,0),Model!$B$4,1,1)","v":39992000000}]
[null,null,null,null,null,null,null,null,null,null,null,null,null,null,null,null,null,null,null,null,48,1979,{"$f":"RANK(V52,$V$5:$V$56,0)+COUNTIF($V$5:V52,V52)-1","v":25},{"$f":"OFFSET(Map_Data!$E$1,MATCH(Model!U52,Model!$W$5:$W$56,0),0,1,1)","v":"MT"},101,null,null,{"$f":"OFFSET(Map_Data!$U$1,MATCH(X52,Map_Data!$E$2:$E$53,0),$B$4,1,1)","v":6.2},null,48,47.5,208507,{"$f":"RANK(AF52,$AF$5:$AF$56,0)+COUNTIF($AF$5:AF52,AF52)-1","v":11},{"$f":"OFFSET(Map_Data!$D$1,MATCH(Model!AD52,Model!$AG$5:$AG$56,0),0,1,1)","v":"Wyoming"},30651,{"$f":"OFFSET(Map_Data!$N$1,MATCH(AH52,Map_Data!$D$2:$D$53,0),Model!$B$4,1,1)","v":31991},{"$f":"OFFSET(Map_Data!$H$1,MATCH(AH52,Map_Data!$D$2:$D$53,0),Model!$B$4,1,1)","v":38190000000}]
[null,null,null,null,null,null,null,null,null,null,null,null,null,null,null,null,null,null,null,null,49,7548,{"$f":"RANK(V53,$V$5:$V$56,0)+COUNTIF($V$5:V53,V53)-1","v":9},{"$f":"OFFSET(Map_Data!$E$1,MATCH(Model!U53,Model!$W$5:$W$56,0),0,1,1)","v":"VT"},68,null,null,{"$f":"OFFSET(Map_Data!$U$1,MATCH(X53,Map_Data!$E$2:$E$53,0),$B$4,1,1)","v":5.0999999999999996},null,49,48.5,50068,{"$f":"RANK(AF53,$AF$5:$AF$56,0)+COUNTIF($AF$5:AF53,AF53)-1","v":40},{"$f":"OFFSET(Map_Data!$D$1,MATCH(Model!AD53,Model!$AG$5:$AG$56,0),0,1,1)","v":"South Dakota"},27506,{"$f":"OFFSET(Map_Data!$N$1,MATCH(AH53,Map_Data!$D$2:$D$53,0),Model!$B$4,1,1)","v":29383},{"$f":"OFFSET(Map_Data!$H$1,MATCH(AH53,Map_Data!$D$2:$D$53,0),Model!$B$4,1,1)","v":41667000000}]
[null,null,null,null,null,null,null,null,null,null,null,null,null,null,null,null,null,null,null,null,50,2534,{"$f":"RANK(V54,$V$5:$V$56,0)+COUNTIF($V$5:V54,V54)-1","v":20},{"$f":"OFFSET(Map_Data!$E$1,MATCH(Model!U54,Model!$W$5:$W$56,0),0,1,1)","v":"SD"},34,null,null,{"$f":"OFFSET(Map_Data!$U$1,MATCH(X54,Map_Data!$E$2:$E$53,0),$B$4,1,1)","v":4.4000000000000004},null,50,49.5,109439,{"$f":"RANK(AF54,$AF$5:$AF$56,0)+COUNTIF($AF$5:AF54,AF54)-1","v":26},{"$f":"OFFSET(Map_Data!$D$1,MATCH(Model!AD54,Model!$AG$5:$AG$56,0),0,1,1)","v":"Rhode Island"},26769,{"$f":"OFFSET(Map_Data!$N$1,MATCH(AH54,Map_Data!$D$2:$D$53,0),Model!$B$4,1,1)","v":31065},{"$f":"OFFSET(Map_Data!$H$1,MATCH(AH54,Map_Data!$D$2:$D$53,0),Model!$B$4,1,1)","v":49423000000}]
[null,null,null,null,null,null,null,null,null,null,null,null,null,null,null,null,null,null,null,null,51,1280,{"$f":"RANK(V55,$V$5:$V$56,0)+COUNTIF($V$5:V55,V55)-1","v":34},{"$f":"OFFSET(Map_Data!$E$1,MATCH(Model!U55,Model!$W$5:$W$56,0),0,1,1)","v":"ME"},0,null,null,{"$f":"OFFSET(Map_Data!$U$1,MATCH(X55,Map_Data!$E$2:$E$53,0),$B$4,1,1)","v":7.4},null,51,50.5,30651,{"$f":"RANK(AF55,$AF$5:$AF$56,0)+COUNTIF($AF$5:AF55,AF55)-1","v":48},{"$f":"OFFSET(Map_Data!$D$1,MATCH(Model!AD55,Model!$AG$5:$AG$56,0),0,1,1)","v":"Puerto Rico"},22649,{"$f":"OFFSET(Map_Data!$N$1,MATCH(AH55,Map_Data!$D$2:$D$53,0),Model!$B$4,1,1)","v":76218},{"$f":"OFFSET(Map_Data!$H$1,MATCH(AH55,Map_Data!$D$2:$D$53,0),Model!$B$4,1,1)","v":98757000000}]
[null,null,null,null,null,null,null,null,null,null,null,null,null,null,null,null,null,null,null,null,52,1607,{"$f":"RANK(V56,$V$5:$V$56,0)+COUNTIF($V$5:V56,V56)-1","v":31},{"$f":"OFFSET(Map_Data!$E$1,MATCH(Model!U56,Model!$W$5:$W$56,0),0,1,1)","v":"OH"},{"$f":"LARGE(ActiveDataSet,U56)","v":0},null,null,{"$f":"OFFSET(Map_Data!$U$1,MATCH(X56,Map_Data!$E$2:$E$53,0),$B$4,1,1)","v":7.9},null,52,51.5,22649,{"$f":"RANK(AF56,$AF$5:$AF$56,0)+COUNTIF($AF$5:AF56,AF56)-1","v":51},{"$f":"OFFSET(Map_Data!$D$1,MATCH(Model!AD56,Model!$AG$5:$AG$56,0),0,1,1)","v":"Vermont"},20463,{"$f":"OFFSET(Map_Data!$N$1,MATCH(AH56,Map_Data!$D$2:$D$53,0),Model!$B$4,1,1)","v":18172},{"$f":"OFFSET(Map_Data!$H$1,MATCH(AH56,Map_Data!$D$2:$D$53,0),Model!$B$4,1,1)","v":26545000000}]

{"sheet":"Map_Data","index":2,"n_rows":54,"n_cols":26,"rows_kept":54,"cut":false,"hidden":false,"merged":[]}
["Dataset ID #","Dataset Name","State ID #","State Name","State Code",2010,2011,2012,"GSP 2010","GSP 2011","GSP 2012","Influx 2010","Influx 2011","Influx 2012","Outflow 2010","Outflow 2011","Outflow 2012","Deg C","Internal 2010","Internal 2011","Internal 2012","ER % 2010","ER % 2011","ER % 2012"]
[1,"Migration in 2010",1,"Alabama","AL",{"$f":"TRANSPOSE(OFFSET('Raw_Data-1'!$J$3,Model!$B$5,1,1,52))","v":1289},{"$f":"TRANSPOSE(OFFSET('Raw_Data-1'!$J$3,52+Model!$B$5,1,1,52))","v":1567},{"$f":"TRANSPOSE(OFFSET('Raw_Data-1'!$J$3,104+Model!$B$5,1,1,52))","v":3705},172842000000,178533000000,183547000000,108723,117726,104600,99221,106806,109210,17.094907407407412,13.119015102836256,12.397440149976461,12.390280638095486,8.9,7.3,6.8,null,"HELP"]
[2,"Migration in 2011",2,"Alaska","AK",1556,1637,2207,47910000000,51237000000,51859000000,36326,35084,33415,94692,88850,84068,2.3055555555555549,13.638911254185787,14.085021391591123,12.564442460058848,7.8,7.4,6.6]
[3,"Migration in 2012",3,"Arizona","AZ",4715,6763,4929,247329000000,255989000000,266891000000,222725,222877,232457,176768,211816,206842,15.725,15.822277904227303,16.062443799502709,14.744206401483281,10,8.6999999999999993,8.1]
[4,"GSP 2010",4,"Arkansas","AR",434,1952,884,103170000000,106557000000,109557000000,79127,69845,76948,64264,77226,64967,15.78935185185186,14.298944986400326,13.962242210228196,12.807654805883242,8.1,7.6,7.5]
[5,"GSP 2011",5,"California","CA",8997,9032,8995,1845249000000,1908985000000,2003479000000,444749,468428,493641,573988,562343,566986,15.22314814814815,14.667015571220436,14.161173465272972,13.431595003803023,12.2,11.2,9.6999999999999993]
[6,"GSP 2012",6,"Colorado","CO",2859,2690,3180,254551000000,264733000000,274048000000,186366,202124,205060,140620,160623,161530,7.3032407407407423,14.542609643979079,15.118185943666196,14.674652962639717,9,8.3000000000000007,7.3]
[7,"Influx 2010",7,"Connecticut","CT",1307,1189,1355,221767000000,225409000000,229317000000,77333,71502,80311,89360,91295,87023,9.4717592592592545,9.6834188706142026,8.9296347050878531,9.4201954873810188,9.4,8.3000000000000007,8.1]
[8,"Influx 2011",8,"Delaware","DE",15,263,1079,62832000000,64377000000,65984000000,30759,33912,34757,30055,26631,25149,12.929629629629638,10.114608479094461,9.2685248448762643,9.4865736573657369,7.7,7.2,7]
[9,"Influx 2012",9,"District of Columbia","DC",972,587,985,103745000000,107201000000,109793000000,51244,48066,53830,56052,49732,59513,12.343055555555555,10.685600430333123,10.876084027677859,9.9211486972010743,10.1,9.6999999999999993,8.6999999999999993]
[10,"Outflow 2010",10,"Florida","FL",16495,16492,16366,727972000000,746439000000,777164000000,482889,498597,537148,427853,437202,428325,21.515277777777779,13.189525729852637,13.010293497416342,12.45270897355009,11.1,9.5,8.1]
[11,"Outflow 2011",11,"Georgia","GA",9502,4290,8052,402006000000,417438000000,433569000000,249459,271077,277466,244992,248892,252262,17.506481481481487,13.335938185318669,13.293492204371219,12.619773069021157,10.199999999999999,9.5,8.6999999999999993]
[12,"Outflow 2012",12,"Hawaii","HI",436,1044,1198,67274000000,70006000000,72424000000,53581,57542,55145,49218,61940,61509,25.12962962962963,9.9767952140500373,9.0386255473904225,9.8066555527431323,6.6,6.4,5]
[13,"Deg C",13,"Idaho","ID",564,312,412,55639000000,57096000000,58243000000,55638,60336,59283,53122,57831,55191,6.8814814814814795,13.49300146295827,13.364263607493282,13.359579818897979,8.6999999999999993,7.8,6.8]
[14,"Internal 2010",14,"Illinois","IL",7092,7027,9510,642769000000,670247000000,695238000000,203959,216204,208755,277579,269008,277953,10.96527777777778,11.076585516579252,10.64483572700407,11.325560098887877,9.5,9.4,9.1]
[15,"Internal 2011",15,"Indiana","IN",9438,11588,13534,270739000000,284344000000,298625000000,127353,127874,134137,130170,143228,144597,10.909259259259256,12.986810939970336,12.570118320904189,12.470491633430472,9.1999999999999993,8.5,8]
[16,"Internal 2012",16,"Iowa","IA",1270,1146,1039,138378000000,146057000000,152436000000,72557,70405,75760,66922,74516,73325,8.780555555555555,12.467420918251355,12.23872236450026,11.956570796802735,6.2,5.5,5]
[17,"ER % 2010",17,"Kansas","KS",1016,657,1166,126640000000,134767000000,138953000000,95059,83640,88284,90681,94180,93134,12.363425925925927,13.193016114749437,12.802937904787717,13.398881177010772,6.9,6.1,5.6]
[18,"ER % 2011",18,"Kentucky","KY",9159,12744,13227,161064000000,168019000000,173466000000,118443,110031,112787,92999,99256,103004,13.106481481481483,12.09985293155883,11.717011132459143,12.047957019155731,10,8.6999999999999993,8.1999999999999993]
[19,"ER % 2012",19,"Louisiana","LA",743,1872,2214,227373000000,237389000000,243264000000,97889,99138,91215,88131,86593,95956,19.108333333333331,12.206701462174104,11.921558508122706,11.6237570706353,7.7,7,6.2]
[null,null,20,"Maine","ME",291,0,1189,51343000000,52489000000,53656000000,27758,33818,27523,32209,33729,38574,4.9842592592592618,11.167880100646775,11.939357046068915,11.511068071566587,8,7.4,7]
[null,null,21,"Maryland","MD",3828,4982,5026,295981000000,305175000000,317678000000,164484,153979,154983,159866,165041,157664,12.343055555555555,10.300877153854833,9.6177571201824179,9.4554396548285631,7.5,7,6.9]
[null,null,22,"Massachusetts","MA",3686,2101,2189,376908000000,388575000000,403823000000,140162,139830,142577,144152,145869,158156,8.810648148148152,10.889147436144393,10.075752215214694,9.5185256269108134,7.9,6.9,6.9]
[null,null,23,"Michigan","MI",15130,14330,16336,367107000000,385123000000,400504000000,116149,139158,133981,178207,186505,175733,6.8935185185185173,13.233806525975334,12.726233375183559,12.967661248923712,11.3,9.4,8.9]
[null,null,24,"Minnesota","MN",2298,1788,1122,268578000000,279987000000,294729000000,89872,101029,101042,104765,103253,115946,5.0884259259259208,12.355346497196171,12.24437589545772,12.285681818352852,7,5.8,5.4]
[null,null,25,"Mississippi","MS",89,691,1017,95763000000,97533000000,101490000000,72321,68511,73500,68363,68597,66947,17.414814814814818,11.608308872595376,11.312661377543687,11.527884829371821,10.6,9.8000000000000007,9.1]
[null,null,26,"Missouri","MO",1171,2003,3026,243876000000,249546000000,258832000000,145226,149439,162930,148055,138404,142754,12.47268518518519,13.287364770443745,13.490401313866057,13.459420525804056,9.1999999999999993,7.6,6.8]
[null,null,27,"Montana","MT",460,101,276,36521000000,38933000000,40422000000,35630,33553,37690,35870,31204,33832,5.968055555555555,12.033843396112649,12.381012201694702,12.702904140851635,6.7,6.2,5.8]
[null,null,28,"Nebraska","NE",1531,1176,1052,90910000000,96230000000,99557000000,51290,52070,43266,43531,52809,48816,9.3152777777777729,13.701969881793779,13.937888731986664,13.006144023788959,4.5999999999999996,4.2,4]
[null,null,29,"Nevada","NV",2240,1851,907,124838000000,129421000000,133584000000,102677,110345,124285,109409,115943,98882,9.9300925925925885,19.392216435402144,17.866702674070503,17.667762578524041,13.8,12.4,10.6]
[null,null,30,"New Hampshire","NH",175,1992,189,61147000000,63333000000,64697000000,39367,37000,50484,38399,43277,38696,6.5587962962962951,10.83033903049779,9.3536844459353681,9.5568066984264473,5.7,5.4,5.5]
[null,null,31,"New Jersey","NJ",2465,3936,4703,483007000000,493175000000,508003000000,127369,140194,130223,193972,216369,219202,11.471759259259263,7.8586368000764182,7.951649275133625,7.4716075152768626,9.5,9.1999999999999993,9.1]
[null,null,32,"New Mexico","NM",515,255,1361,77686000000,79555000000,80600000000,73605,62130,54693,50438,61431,63921,11.910648148148146,10.819205618497032,11.103915597435501,10.979498639955935,7.9,7.2,6.9]
[null,null,33,"New York","NY",5988,8784,8732,1136417000000,1169436000000,1205930000000,269427,282209,270053,363139,377800,405864,7.4157407407407421,9.2820143797834298,9.1232466010015756,8.9040067014765754,8.3000000000000007,8.4,8.1999999999999993]
[null,null,34,"North Carolina","NC",5985,4572,5498,426875000000,436144000000,455973000000,263256,265291,273149,207025,225147,238663,15.003240740740738,12.083035052419781,12.165424871050751,11.919311155345838,10.5,9.6999999999999993,8.9]
[null,null,35,"North Dakota","ND",26,204,453,35357000000,39992000000,46016000000,30100,32510,38213,24450,26563,23959,4.6851851851851833,11.375279048875242,11.824883250069243,12.219390639541459,3.6,3.1,3]
[null,null,36,"Ohio","OH",0,0,0,465679000000,490265000000,509393000000,172633,191778,196391,188013,206049,199202,10.377777777777782,12.743429453189412,12.485471511201036,12.622523628657421,9.3000000000000007,7.9,7.3]
[null,null,37,"Oklahoma","OK",1228,2333,858,147649000000,156058000000,160953000000,106511,108878,108972,90616,81009,102572,15.299074074074074,14.229990119108868,14.120775974978478,14.122888830827648,6.4,5.7,5.4]
[null,null,38,"Oregon","OR",342,1326,432,181523000000,188981000000,198702000000,116700,127906,118925,100185,109795,108182,9.1138888888888889,14.386922747658939,14.347689589768262,14.534752745650318,10.3,9.1999999999999993,8.4]
[null,null,39,"Pennsylvania","PA",12012,14292,14147,558818000000,581256000000,600897000000,235580,234291,215500,209810,215127,237156,9.3189814814814849,9.8524633762285276,9.7106804606896198,9.9158342756602842,8.1,7.8,7.9]
[null,null,40,"Rhode Island","RI",444,369,435,48572000000,49423000000,50956000000,32059,26769,33446,24948,31065,30498,10.038425925925926,9.5566280319312256,9.7775816280809451,9.7224771678197683,11.5,10.9,9.6999999999999993]
[null,null,41,"South Carolina","SC",2479,3826,2445,162292000000,168716000000,176217000000,152441,157644,156705,117569,121426,127418,16.900462962962973,11.752547680462202,11.821901396571931,12.087465832320602,10.6,9.6999999999999993,8.3000000000000007]
[null,null,42,"South Dakota","SD",207,34,47,38297000000,41667000000,42464000000,25777,27506,26051,27915,29383,22534,7.298611111111116,12.016270779130505,11.625878957226639,14.069655785967342,5,4.4000000000000004,4]
[null,null,43,"Tennessee","TN",4987,6468,3542,253602000000,263626000000,277036000000,159778,170969,177098,143135,154243,163843,14.207407407407405,12.754933940884708,12.545358260390124,12.277247871604215,9.6999999999999993,8.5,8.1]
[null,null,44,"Texas","TX",7465,11987,11760,1226714000000,1321005000000,1397369000000,486558,514726,507752,411641,404839,402187,18.240277777777774,15.022019894313344,14.404568323326664,14.219429521654092,8.1999999999999993,7.4,6.5]
[null,null,45,"Utah","UT",485,691,197,118225000000,124454000000,130486000000,77780,85217,87870,75541,73211,82165,9.2416666666666725,14.258475571792733,13.503045716986438,13.330529257442683,7.7,5.9,4.9000000000000004]
[null,null,46,"Vermont","VT",182,68,364,25809000000,26545000000,27296000000,22529,20463,24431,18380,18172,20056,6.0444444444444461,9.5310827414617929,9.7720462087634417,9.8741744917965129,6.1,5.0999999999999996,4.5999999999999996]
[null,null,47,"Virginia","VA",6769,5425,3193,422763000000,433611000000,445876000000,259507,257130,250653,232002,229227,238540,12.841666666666667,10.976117964793595,11.12668310041628,11.31970273786456,6.7,6.2,5.7]
[null,null,48,"Washington","WA",2567,1979,2862,342702000000,357056000000,375730000000,191784,208507,215494,166162,190644,180462,9.036111111111115,14.215243492994858,13.631600269927691,13.273568931314072,9.6,8.6,7.4]
[null,null,49,"West Virginia","WV",7814,7548,7820,62732000000,66109000000,69380000000,39609,50068,47125,49349,45956,47425,10.953703703703704,9.0627121925679077,9.3793252147702226,9.4753901730486447,8.4,7.3,7.1]
[null,null,50,"Wisconsin","WI",1771,2534,974,245415000000,253349000000,261548000000,93065,109439,99192,111240,105370,97724,6.1750000000000007,12.298913287034633,11.963830654165161,12.255371574813401,7.8,7.1,6.9]
[null,null,51,"Wyoming","WY",144,1280,202,36459000000,38190000000,38422000000,28046,30651,31149,28186,31991,32228,5.5472222222222181,14.768724167525505,11.87198181653007,13.57194761063935,6.5,5.8,5]
[null,null,52,"Puerto Rico","PR",2140,1607,1403,101496000000,98757000000,97147000000,31732,22649,20044,59885,76218,74500,26.689814814814817,6.734488546557821,6.4936041829338587,6.5605189281672764,16.3,16.2,15.2]
[null,null,53,"United States","US",null,null,null,14388813000000,14959778000000,15566077000000,6743229,6987416,7070345,null,null,null,null,12.624107860426822,12.341234696804584,12.151852685747883,9.4,8.5,7.9]

{"sheet":"Sample_Palette","index":3,"n_rows":135,"n_cols":12,"rows_kept":135,"cut":false,"hidden":false,"merged":[]}
[]
[null,"Sample Color Palette"]
[null,"ColorName","NumOfColors","ColorNum","ColorLetter","R","G","B","Sample",null,null,"Apache-Style Software License for ColorBrewer software and ColorBrewer Color Schemes"]
[null,"GnBu",2,1,"C",224,243,219]
[null,null,null,2,"I",67,162,202,null,null,null,"Copyright (c) 2002 Cynthia Brewer, Mark Harrower, and The Pennsylvania State University."]
[null,null,3,1,"C",224,243,219]
[null,null,null,2,"F",168,221,181,null,null,null,"Licensed under the Apache License, Version 2.0 (the \"License\"); you may not use this file except in compliance with the License."]
[null,null,null,3,"I",67,162,202,null,null,null,"You may obtain a copy of the License at"]
[null,null,4,1,"B",240,249,232]
[null,null,null,2,"E",186,228,188,null,null,null,"       http://www.apache.org/licenses/LICENSE-2.0"]
[null,null,null,3,"G",123,204,196]
[null,null,null,4,"J",43,140,190,null,null,null,"Unless required by applicable law or agreed to in writing, software distributed under the License is distributed on an \"AS IS\" BASIS,"]
[null,null,5,1,"B",240,249,232,null,null,null,"WITHOUT WARRANTIES OR CONDITIONS OF ANY KIND, either express or implied."]
[null,null,null,2,"E",186,228,188,null,null,null,"See the License for the specific language governing permissions and limitations under the License."]
[null,null,null,3,"G",123,204,196]
[null,null,null,4,"I",67,162,202]
[null,null,null,5,"K",8,104,172,null,null,null,"Redistribution and use in source and binary forms, with or without modification, are permitted provided that the following conditions are met:"]
[null,null,6,1,"B",240,249,232,null,null,null,"1. Redistributions as source code must retain the above copyright notice, this list of conditions and the following disclaimer."]
[null,null,null,2,"D",204,235,197,null,null,null,"2. The end-user documentation included with the redistribution, if any, must include the following acknowledgment:"]
[null,null,null,3,"F",168,221,181,null,null,null,"This product includes color specifications and designs developed by Cynthia Brewer (http://colorbrewer.org/)."]
[null,null,null,4,"G",123,204,196,null,null,null,"Alternately, this acknowledgment may appear in the software itself, if and wherever such third-party acknowledgments normally appear."]
[null,null,null,5,"I",67,162,202,null,null,null,"4. The name \"ColorBrewer\" must not be used to endorse or promote products derived from this software without prior written permission. "]
[null,null,null,6,"K",8,104,172,null,null,null,"For written permission, please contact Cynthia Brewer at cbrewer@psu.edu."]
[null,null,7,1,"B",240,249,232,null,null,null,"5. Products derived from this software may not be called \"ColorBrewer\", nor may \"ColorBrewer\" appear in their name, without prior written permission of Cynthia Brewer."]
[null,null,null,2,"D",204,235,197]
[null,null,null,3,"F",168,221,181]
[null,null,null,4,"G",123,204,196,null,null,null,"This version of the file (4) is sorted to have schemes in the same order as on the ColorBrewer site. Color patches are included"]
[null,null,null,5,"H",78,179,211,null,null,null,"in column K. These were programmed by David P. Ryan as rectangles filled with corresponding RGB colors and inserted in the"]
[null,null,null,6,"J",43,140,190,null,null,null,"cells as comments. Thank you to David for the idea and initiative in making the color examples available in the file."]
[null,null,null,7,"L",8,88,158]
[null,null,8,1,"A",247,252,240,null,null,null,"The original ColorBrewer web site is at http://ColorBrewer.org"]
[null,null,null,2,"C",224,243,219]
[null,null,null,3,"D",204,235,197,null,null,null,"For more information about ColorBrewer, check the updates section of the site at http://www.personal.psu.edu/cab38/ColorBrewer/ColorBrewer_updates.html"]
[null,null,null,4,"F",168,221,181]
[null,null,null,5,"G",123,204,196]
[null,null,null,6,"H",78,179,211]
[null,null,null,7,"J",43,140,190]
[null,null,null,8,"L",8,88,158]
[null,null,9,1,"A",247,252,240]
[null,null,null,2,"C",224,243,219]
[null,null,null,3,"D",204,235,197]
[null,null,null,4,"F",168,221,181]
[null,null,null,5,"G",123,204,196]
[null,null,null,6,"H",78,179,211]
[null,null,null,7,"J",43,140,190]
[null,null,null,8,"K",8,104,172]
[null,null,null,9,"M",8,64,129]
[null,"BuGn",2,1,"C",229,245,249]
[null,null,null,3,"I",44,162,95]
[null,null,3,1,"C",229,245,249]
[null,null,null,2,"F",153,216,201]
[null,null,null,3,"I",44,162,95]
[null,null,4,1,"B",237,248,251]
[null,null,null,2,"E",178,226,226]
[null,null,null,3,"G",102,194,164]
[null,null,null,4,"J",35,139,69]
[null,null,5,1,"B",237,248,251]
[null,null,null,2,"E",178,226,226]
[null,null,null,3,"G",102,194,164]
[null,null,null,4,"I",44,162,95]
[null,null,null,5,"K",0,109,44]
[null,null,6,1,"B",237,248,251]
[null,null,null,2,"D",204,236,230]
[null,null,null,3,"F",153,216,201]
[null,null,null,4,"G",102,194,164]
[null,null,null,5,"I",44,162,95]
[null,null,null,6,"K",0,109,44]
[null,null,7,1,"B",237,248,251]
[null,null,null,2,"D",204,236,230]
[null,null,null,3,"F",153,216,201]
[null,null,null,4,"G",102,194,164]
[null,null,null,5,"H",65,174,118]
[null,null,null,6,"J",35,139,69]
[null,null,null,7,"L",0,88,36]
[null,null,8,1,"A",247,252,253]
[null,null,null,2,"C",229,245,249]
[null,null,null,3,"D",204,236,230]
[null,null,null,4,"F",153,216,201]
[null,null,null,5,"G",102,194,164]
[null,null,null,6,"H",65,174,118]
[null,null,null,7,"J",35,139,69]
[null,null,null,8,"L",0,88,36]
[null,null,9,1,"A",247,252,253]
[null,null,null,2,"C",229,245,249]
[null,null,null,3,"D",204,236,230]
[null,null,null,4,"F",153,216,201]
[null,null,null,5,"G",102,194,164]
[null,null,null,6,"H",65,174,118]
[null,null,null,7,"J",35,139,69]
[null,null,null,8,"K",0,109,44]
[null,null,null,9,"M",0,68,27]
[null,"YlOrRd",2,1,"C",255,237,160]
[null,null,null,3,"I",240,59,32]
[null,null,3,1,"C",255,237,160]
[null,null,null,2,"F",254,178,76]
[null,null,null,3,"I",240,59,32]
[null,null,4,1,"B",255,255,178]
[null,null,null,2,"E",254,204,92]
[null,null,null,3,"G",253,141,60]
[null,null,null,4,"J",227,26,28]
[null,null,5,1,"B",255,255,178]
[null,null,null,2,"E",254,204,92]
[null,null,null,3,"G",253,141,60]
[null,null,null,4,"I",240,59,32]
[null,null,null,5,"K",189,0,38]
[null,null,6,1,"B",255,255,178]
[null,null,null,2,"D",254,217,118]
[null,null,null,3,"F",254,178,76]
[null,null,null,4,"G",253,141,60]
[null,null,null,5,"I",240,59,32]
[null,null,null,6,"K",189,0,38]
[null,null,7,1,"B",255,255,178]
[null,null,null,2,"D",254,217,118]
[null,null,null,3,"F",254,178,76]
[null,null,null,4,"G",253,141,60]
[null,null,null,5,"H",252,78,42]
[null,null,null,6,"J",227,26,28]
[null,null,null,7,"L",177,0,38]
[null,null,8,1,"A",255,255,204]
[null,null,null,2,"C",255,237,160]
[null,null,null,3,"D",254,217,118]
[null,null,null,4,"F",254,178,76]
[null,null,null,5,"G",253,141,60]
[null,null,null,6,"H",252,78,42]
[null,null,null,7,"J",227,26,28]
[null,null,null,8,"L",177,0,38]
[null,null,9,1,"A",255,255,204]
[null,null,null,2,"C",255,237,160]
[null,null,null,3,"D",254,217,118]
[null,null,null,4,"F",254,178,76]
[null,null,null,5,"G",253,141,60]
[null,null,null,6,"H",252,78,42]
[null,null,null,7,"J",227,26,28]
[null,null,null,8,"K",189,0,38]
[null,null,null,9,"M",128,0,38]

{"sheet":"Raw_Data-1","index":4,"n_rows":162,"n_cols":69,"rows_kept":162,"cut":false,"hidden":false,"merged":[[0,3,1,4],[0,5,1,6],[0,7,1,8]]}
[null,null,null,"Population 1 year and over",null,"Same residence 1 year ago",null,"Different residence, same state 1 year ago",null,1,2,3,4,5,6,7,8,9,10,11,12,13,14,15,16,17,18,19,20,21,22,23,24,25,26,27,28,29,30,31,32,33,34,35,36,37,38,39,40,41,42,43,44,45,46,47,48,49,50,51,52,53]
[null,null,null,null,null,null,null,null,null,"State of Residence Last year (Estimate)"]
["Year","#","Current residence in --","Estimate","MOE","Estimate","MOE","Estimate","MOE","TOTAL","Alabama","Alaska","Arizona","Arkansas","California","Colorado","Connecticut","Delaware","District of Columbia ","Florida","Georgia","Hawaii","Idaho","Illinois","Indiana","Iowa","Kansas","Kentucky","Louisiana","Maine","Maryland","Massachusetts","Michigan","Minnesota","Mississippi","Missouri","Montana","Nebraska","Nevada","New Hampshire","New Jersey","New Mexico","New York","North Carolina","North Dakota","Ohio","Oklahoma","Oregon","Pennsylvania","Rhode Island","South Carolina","South Dakota","Tennessee","Texas","Utah","Vermont","Virginia","Washington","West Virginia","Wisconsin","Wyoming","Puerto Rico","GSP $ ","Per capita income","External Migration \nto State % of pop","Internal Migration within State % of pop","Unemployment Rate %",null,"GDP Data Sources"]
[2010,1,"Alabama",4729509,3716,3987155,21708,620465,21448,108723,null,3013,676,1481,3827,1278,454,811,211,15062,21644,267,304,2503,3945,669,649,1967,1901,97,716,435,2334,386,7233,1373,229,169,265,0,356,650,3686,2371,169,2222,880,485,1477,0,2368,31,7409,6500,1336,0,2490,1171,41,1155,27,228,172842000000,{"$f":"BK4/D4","v":36545.442666458614},{"$f":"J4/D4","v":2.2988221398880942E-2},{"$f":"H4/D4","v":0.13119015102836257},8.9,null,"http://www.bea.gov/newsreleases/regional/gdp_state/gsp_newsrelease.htm"]
[2010,2,"Alaska",702974,1600,565031,7596,95878,7984,36326,477,null,1354,47,3906,1930,0,0,14,2315,1251,1705,895,388,9,262,106,1440,100,574,704,107,923,530,263,0,616,215,240,316,413,421,255,698,69,156,1455,1793,126,0,121,531,477,4123,1274,353,714,2421,0,158,81,19,47910000000,{"$f":"BK5/D5","v":68153.30296710832},{"$f":"J5/D5","v":5.1674741882345575E-2},{"$f":"H5/D5","v":0.13638911254185787},7.8,null,"https://www.google.com/publicdata/explore?ds=d5bncppjof8f9_&met_y=ny_gdp_mktp_cd&hl=en&dl=en&idim=country:PRI:CRI:DOM"]
[2010,3,"Arizona",6332786,4439,5069002,35057,1001991,32027,222725,416,3109,null,689,47164,7687,479,738,0,7712,4261,1966,2147,12250,2690,3008,1935,1705,2014,241,1284,1449,6354,5421,272,4567,1343,1750,10342,64,1782,4419,6618,4463,826,5225,2910,5430,5535,403,2310,1351,3061,14705,7164,664,3413,12645,595,5556,593,599,247329000000,39055.322570508462,3.517014470408443E-2,0.15822277904227303,10,null,"2012 data for GSP/GDP is calculated/forecast (except for PR)"]
[2010,4,"Arkansas",2888304,2453,2387806,18627,412997,17485,79127,1405,934,777,null,4457,2535,451,0,154,3578,3921,129,618,3221,722,85,3611,2540,4012,0,306,190,1506,222,2764,7320,85,394,67,0,77,0,289,1561,0,1137,8607,239,731,0,1496,243,2653,13707,361,0,494,264,0,821,443,87,103170000000,35719.924218503314,2.7395661952481457E-2,0.14298944986400325,8.1]
[2010,5,"California",36907897,10889,30790221,71574,5413287,66460,444749,3364,9579,33854,4172,null,15662,4631,643,3683,20362,8820,9528,5719,16482,6550,3163,3857,3394,2989,1796,10626,11969,10435,5095,2757,6921,3009,3062,27724,1614,10108,4632,20981,9593,392,8170,5708,20913,9948,526,5016,1604,4349,36582,10653,525,14232,30544,1446,6031,1336,1223,1845249000000,49996.048271187057,1.2050239546295471E-2,0.14667015571220435,12.2,null,"Unemployment data"]
[2010,6,"Colorado",4988190,3936,4042039,25546,725413,23003,186366,954,2225,12287,1034,26089,null,459,486,479,8849,6445,2355,839,6950,3296,2140,4308,1961,968,532,1532,2242,4587,2878,1277,1978,2042,4065,4131,791,1259,3921,4594,2940,802,2838,3464,4330,3928,192,1231,1847,1628,22253,4748,350,2739,7583,623,2499,4418,874,254551000000,51030.734595113659,3.7361447739560842E-2,0.14542609643979079,9,null,"http://data.bls.gov/map/MapToolServlet?survey=la"]
[2010,7,"Connecticut",3541146,2779,3100742,16358,342904,15404,77333,896,0,664,334,4479,547,null,149,331,9207,748,182,147,3391,1074,108,0,400,0,528,1531,8510,770,934,67,42,0,0,507,1049,3475,112,20727,1345,0,1296,145,640,1955,1728,1140,0,430,1887,0,458,1735,2084,442,1092,47,2027,221767000000,62625.771431056499,2.1838410503266455E-2,9.6834188706142021E-2,9.4,null,"http://en.wikipedia.org/wiki/Economy_of_Puerto_Rico"]
[2010,8,"Delaware",889812,1573,764640,9145,90001,8498,30759,128,68,60,0,353,178,714,null,432,2362,585,0,0,612,0,0,28,163,0,294,4969,689,61,55,0,539,73,0,106,139,3678,59,4251,424,0,325,0,0,7318,149,195,0,146,178,0,0,1051,377,0,0,0,954,62832000000,70612.668743509872,3.4567976156761202E-2,0.1011460847909446,7.7,null,"https://www.google.com/url?sa=t&rct=j&q=&esrc=s&source=web&cd=1&cad=rja&uact=8&ved=0CCwQ-iQwAA&url=%2Fpublicdata%2Fexplore%3Fds%3Dz1ebjpgk2654c1_%26met_y%3Dunemployment_rate%26hl%3Den%26dl%3Den%26idim%3Dcountry%3AUS%26fdim_y%3Dseasonality%3AS&ei=Lz9TU6HXHYiI2AXAiIHQAQ&usg=AFQjCNEZysSfqrmdhOMYRJRpLDdxpaU1yA&bvm=bv.65058239,d.b2I"]
[2010,9,"District of Columbia ",596747,1124,474676,8281,63766,6163,51244,360,591,662,155,4205,656,926,0,null,1100,1597,0,0,615,711,392,83,94,0,76,13503,1376,126,87,0,272,0,62,0,137,1924,61,3852,1897,98,598,0,601,2378,249,380,0,591,1180,0,199,7915,284,860,391,0,0,103745000000,173850.89493537461,8.5872237313300279E-2,0.10685600430333123,10.1,null,"All data from December of that year and are seasonally adjusted"]
[2010,10,"Florida",18647600,7733,15554008,45602,2459530,38387,482889,15830,5887,3907,3611,22130,6428,11183,3099,1110,null,35615,2021,884,17432,9030,2921,4136,6321,7232,5497,13241,13900,21359,5439,7929,7984,338,1544,7050,3645,22344,900,55011,19108,794,21047,3466,1655,19935,1982,10759,430,12882,24039,2833,1442,20080,3573,5634,8081,191,12968,727972000000,39038.374911516767,2.589550397906433E-2,0.13189525729852636,11.1]
[2010,11,"Georgia",9587237,5924,8015409,37393,1278548,36794,249459,13840,3645,2554,599,8909,3224,2619,837,1708,49901,null,1040,414,9736,2649,1096,1355,6525,3645,0,5382,3910,6857,1169,2380,3072,52,148,1155,162,4151,826,12472,15361,0,9323,2070,843,6294,43,15562,557,14445,11424,380,361,8393,4495,358,3416,102,1010,402006000000,41931.371885351327,2.6019905422177421E-2,0.13335938185318669,10.199999999999999]
[2010,12,"Hawaii",1346274,1690,1140572,10422,134315,9295,53581,749,743,1398,0,12677,1073,307,0,0,4599,2013,null,42,715,192,68,387,95,88,89,990,1283,627,476,234,170,150,0,1925,496,443,11,1339,1510,69,625,57,1834,553,644,322,267,142,6694,467,0,2644,2705,483,1168,18,0,67274000000,49970.511203514296,3.9799476183897183E-2,9.9767952140500368E-2,6.6]
[2010,13,"Idaho",1550967,1954,1279856,12606,209272,10887,55638,376,3264,3086,45,8932,1372,0,0,144,612,313,123,null,169,132,773,422,315,59,202,44,115,427,465,37,425,1509,0,2110,109,97,694,155,134,96,325,711,3202,172,0,0,296,1153,1746,8014,0,611,10876,133,233,1410,233,55639000000,35873.748442100958,3.5873103683057087E-2,0.13493001462958271,8.6999999999999993]
[2010,14,"Illinois",12680126,5467,11009852,32636,1404525,28126,203959,1397,1764,5921,1194,16205,3850,2264,56,1047,8051,6781,1224,313,null,21918,9141,1970,2921,1419,55,1985,2811,11865,4300,1093,16703,928,546,2541,206,2331,996,8479,5504,1112,5103,1459,1224,5190,838,1565,292,3999,12245,658,260,3831,1642,812,15364,586,2055,642769000000,50691.057801791561,1.6084934802698334E-2,0.11076585516579252,9.5]
[2010,15,"Indiana",6414862,4257,5431015,24897,833086,22796,127353,1502,177,2210,1548,8959,1362,544,0,181,5496,1623,267,772,27950,null,1885,1582,10643,749,30,1641,103,9361,916,270,3893,164,705,227,114,1876,188,2564,2828,0,13272,681,423,2668,174,584,216,3093,6335,444,45,3673,571,669,1762,413,572,270739000000,42204.960917319811,1.9852804315977492E-2,0.12986810939970336,9.1999999999999993]
[2010,16,"Iowa",3013053,2381,2553210,15158,375650,12448,72557,330,519,1483,247,2847,2554,114,0,53,1364,973,866,315,17016,1710,null,1520,334,315,0,134,189,1439,7564,117,6031,836,4783,623,381,472,492,273,1123,601,632,679,1071,378,0,591,1992,1617,4131,146,45,303,538,0,2705,111,149,138378000000,45926.175211654096,2.4080890711182312E-2,0.12467420918251355,6.2]
[2010,17,"Kansas",2820894,2731,2341401,17752,372161,15608,95059,44,1050,2238,1596,6125,6022,85,238,0,2863,1916,128,398,2943,1544,1875,null,1048,890,0,1369,100,806,1562,167,23384,289,2678,1318,76,1743,873,2390,1083,225,1509,7568,514,563,39,137,352,1152,9217,238,75,1648,1175,0,1233,573,68,126640000000,44893.569201820414,3.3698182207484578E-2,0.13193016114749437,6.9]
[2010,18,"Kentucky",4296639,3389,3638259,20337,519887,18955,118443,2161,3017,2598,558,3779,329,698,38,147,10119,6397,520,71,4659,11906,656,1109,null,437,0,1395,1036,4672,930,1442,3153,0,858,76,0,1147,122,2057,3758,0,15598,1153,181,2618,289,1286,163,11153,5758,905,525,3671,716,2297,1993,292,179,161064000000,37486.044324412636,2.7566430412236168E-2,0.1209985293155883,10]
[2010,19,"Louisiana",4483529,3720,3826390,25103,547291,22645,97889,5740,1504,1960,2382,5751,1215,89,0,264,9394,5766,342,202,2131,948,625,706,1656,null,162,963,995,1301,569,7032,2852,40,119,1552,462,171,294,2161,1443,438,1100,1074,281,1350,0,1130,0,1853,26134,473,0,1278,1509,210,237,31,402,227373000000,50712.954014572002,2.1833024833786064E-2,0.12206701462174105,7.7]
[2010,20,"Maine",1313902,1878,1136780,8034,146735,7677,27758,402,424,254,67,1066,478,1361,174,55,3025,844,62,0,311,259,337,56,484,115,null,243,3521,122,91,0,201,275,204,345,4058,902,234,2339,1001,55,315,124,0,375,379,148,0,249,458,390,420,654,381,0,0,500,204,51343000000,39076.734794528056,2.1126385377296025E-2,0.11167880100646775,8]
[2010,21,"Maryland",5716785,3648,4917637,22981,588879,20180,164484,1641,2672,1124,273,8206,2501,1603,8340,23202,6564,3454,422,357,3300,431,160,781,396,1376,53,null,1983,3572,820,403,1147,86,54,979,1369,9058,238,10736,5787,0,3277,607,723,13467,782,1710,49,2669,5883,655,350,24765,1542,4363,324,230,612,295981000000,51774.030333482893,2.877211579585379E-2,0.10300877153854833,7.5]
[2010,22,"Massachusetts",6489250,3528,5583650,23686,706624,22760,140162,583,1891,1572,206,14971,1051,13270,131,1539,11118,1409,682,79,2842,1891,307,0,340,0,4666,3660,null,1624,2185,453,1957,388,46,792,9911,4709,161,20002,2798,0,2163,158,228,5316,6965,1659,0,918,7073,207,1526,4542,1627,0,546,0,3085,376908000000,58081.904688523326,2.1599106214123358E-2,0.10889147436144393,7.9]
[2010,23,"Michigan",9762127,4595,8310098,29394,1291901,28130,116149,2403,1040,3197,636,6726,2031,277,167,471,11646,3913,313,66,10651,7816,758,640,2353,1342,645,620,1206,null,1275,656,2921,312,213,1874,437,1676,669,3135,2444,53,9783,2276,537,3134,653,1446,706,4453,7184,545,45,2073,1427,446,6291,568,1432,367107000000,37605.226811738874,1.1897919377611046E-2,0.13233806525975333,11.3]
[2010,24,"Minnesota",5244256,3049,4480630,17843,647946,16565,89872,266,1169,4165,279,6233,2521,211,176,306,2575,1776,227,231,6641,1120,4948,1067,402,519,172,1259,1092,2631,null,196,1549,1020,734,540,183,513,151,1309,1673,7316,1035,284,738,730,123,1597,3237,1155,2619,1013,0,2371,1328,200,17929,343,39,268578000000,51213.747002434662,1.7137225947779819E-2,0.12355346497196171,7]
[2010,25,"Mississippi",2931228,3253,2510729,16977,340266,16300,72321,8306,1192,187,4941,3000,1167,71,0,0,4814,4014,276,121,3030,1403,114,330,407,7390,0,649,107,2495,863,null,959,314,0,408,0,403,633,1026,2227,0,1312,663,0,750,145,1860,56,8158,5755,232,0,572,508,94,879,490,814,95763000000,32669.925369162684,2.4672594557639323E-2,0.11608308872595377,10.6]
[2010,26,"Missouri",5920858,4730,4968921,23164,786726,21904,145226,819,1051,2988,4381,9840,1903,243,314,478,8317,2492,380,830,21277,3351,4708,23427,2552,2238,171,1359,1395,2610,1701,1183,null,220,2636,1060,108,1320,150,2630,1825,848,2163,4647,314,1639,0,954,512,3311,12884,1319,498,3206,1107,177,1331,359,867,243876000000,41189.300604743432,2.4527864035921821E-2,0.13287364770443744,9.1999999999999993]
[2010,27,"Montana",978507,1744,821709,7063,117752,6986,35630,212,650,1909,672,5756,2185,128,71,0,1373,46,0,1458,1094,251,169,60,321,85,76,51,59,648,1323,242,564,null,340,548,0,0,660,246,1072,1677,89,182,1620,419,0,110,295,111,2101,964,0,497,3250,0,357,1689,11,36521000000,37323.187263862194,3.6412616363500724E-2,0.12033843396112649,6.7]
[2010,28,"Nebraska",1802697,2153,1497138,11336,247005,9960,51290,232,35,2322,674,4430,4182,361,177,0,1775,1202,257,127,1820,639,5536,2484,153,89,0,77,100,726,2254,823,2723,112,null,232,0,143,831,111,442,777,1232,702,506,345,0,65,2936,77,4445,537,0,772,1230,73,1046,1478,0,90910000000,50429.994613626142,2.8451814142920303E-2,0.1370196988179378,4.5999999999999996]
[2010,29,"Nevada",2667364,3181,2030410,22983,517261,21311,102677,150,511,7818,530,35472,2935,648,0,0,3579,1187,4363,1686,1711,739,543,453,569,733,0,485,1275,2202,805,946,1747,770,1129,null,59,1528,1220,1204,957,37,1554,886,2629,1567,167,312,1203,706,5224,4500,197,1832,3290,56,419,144,502,124838000000,46802.011274051838,3.849380886898076E-2,0.19392216435402143,13.8]
[2010,30,"New Hampshire",1303865,1720,1118359,9822,141213,9061,39367,152,0,544,0,1692,240,3134,0,298,1659,0,51,66,850,23,109,57,0,19,3242,49,13752,230,240,25,295,486,0,95,null,540,276,2462,471,0,28,0,508,674,988,51,0,372,1570,279,2566,745,261,0,268,0,56,61147000000,46896.726271508167,3.0192542939644827E-2,0.10830339030497789,5.7]
[2010,31,"New Jersey",8709933,4515,7841470,25935,684482,23318,127369,616,383,1625,258,8777,807,2503,1543,431,9841,4588,385,91,2656,402,332,442,91,249,95,4231,2626,1070,322,450,727,122,261,874,705,null,421,41374,3052,0,1584,32,613,22225,332,1134,0,852,3434,178,57,2670,964,358,586,0,2732,483007000000,55454.731970957757,1.4623419032040775E-2,7.8586368000764184E-2,9.5]
[2010,32,"New Mexico",2039549,2727,1735950,14043,220663,12854,73605,751,969,6117,77,6547,2852,25,391,56,3259,1977,122,755,526,465,0,751,739,65,94,1968,2076,1460,179,719,138,1003,530,4192,79,160,null,784,1793,79,1712,1182,1659,809,46,152,204,1269,18511,1601,309,290,3004,0,407,752,632,77686000000,38089.79338079154,3.6088860821681654E-2,0.10819205618497031,7.9]
[2010,33,"New York",19171916,7371,16976205,41292,1779540,36331,269427,1310,5070,2649,362,25177,3135,15338,2603,1983,30553,7676,259,198,6533,2497,477,1189,804,1321,2270,5912,16855,4779,1649,872,1870,237,886,2077,2636,35333,829,null,13322,0,6510,2298,2284,20514,1913,7161,521,1730,9692,910,2900,8881,2503,444,2354,151,6740,1136417000000,59275.087581230793,1.4053212000302942E-2,9.2820143797834292E-2,8.3000000000000007]
[2010,34,"North Carolina",9443000,5070,7982017,29580,1141001,25307,263256,3044,1618,2847,550,16699,1842,3752,479,1691,28983,15943,1567,724,5657,4132,1077,2192,4419,2180,2259,9881,4052,5789,1839,1187,1932,230,516,698,2130,7195,1186,19406,null,243,8661,1453,1796,11155,97,23196,362,8685,14329,790,350,25662,2874,3025,2012,870,1950,426875000000,45205.443185428361,2.7878428465530021E-2,0.12083035052419781,10.5]
[2010,35,"North Dakota",665654,1209,556222,6833,75720,5430,30100,109,1066,662,168,1411,873,30,0,175,492,799,53,69,39,45,289,114,97,374,0,121,52,298,12350,0,197,1236,328,382,0,144,380,188,637,null,134,108,313,392,0,0,1038,273,2513,462,0,25,696,0,749,219,0,35357000000,53116.183482710236,4.5218687185835285E-2,0.11375279048875242,3.6]
[2010,36,"Ohio",11405101,4931,9745227,23258,1453401,23324,172633,1289,1556,4715,434,8997,2859,1307,15,972,16495,9502,436,564,7092,9438,1270,1016,9159,743,291,3828,3686,15130,2298,89,1171,460,1531,2240,175,2465,515,5988,5985,26,null,1228,342,12012,444,2479,207,4987,7465,485,182,6769,2567,7814,1771,144,2140,465679000000,40830.765111155088,1.5136472706379364E-2,0.12743429453189412,9.3000000000000007]
[2010,37,"Oklahoma",3716264,3181,3065497,21363,528824,18463,106511,1612,1397,2759,5873,9429,3184,68,109,0,5438,3159,773,611,2679,957,1108,5024,877,2208,298,382,465,1047,599,1733,4102,448,829,1079,69,890,2723,1118,1991,139,1385,null,398,1316,119,596,83,1872,28238,428,93,2286,2035,221,551,1713,209,147649000000,39730.492774463819,2.8660773292747771E-2,0.14229990119108868,6.4]
[2010,38,"Oregon",3794008,3282,3110896,20156,545841,17758,116700,400,2027,5264,246,34190,2050,270,0,217,2273,688,2323,4129,1565,317,161,678,0,0,0,595,1471,1159,668,735,1786,3386,777,2805,317,544,981,2538,1040,592,1541,821,null,1689,0,989,741,787,3826,2879,456,1124,22793,358,1981,523,821,181523000000,47844.653991240928,3.0759028446961632E-2,0.1438692274765894,10.3]
[2010,39,"Pennsylvania",12577555,4619,11053022,29699,1239199,26490,235580,369,2185,3668,807,12077,3657,4007,4608,1621,18212,4644,332,380,4490,2018,227,1426,1675,625,1621,18281,4455,4961,1491,563,1725,339,551,1810,729,42456,1250,30481,7611,521,14545,1254,918,null,377,1315,966,1611,7778,1048,215,10558,2495,4258,1300,1069,6275,558818000000,44429.7798737513,1.8730190406641038E-2,9.8524633762285277E-2,8.1]
[2010,40,"Rhode Island",1042240,1435,900283,9035,99603,7344,32059,136,0,324,0,1697,59,4090,0,146,1336,382,274,0,1210,206,48,0,0,0,447,977,8639,77,47,0,47,0,0,297,333,1868,0,4583,1376,62,0,199,0,560,null,61,48,71,678,0,72,1399,160,150,0,0,276,48572000000,46603.469450414494,3.0759709855695424E-2,9.5566280319312247E-2,11.5]
[2010,41,"South Carolina",4577399,3786,3870879,23788,537961,21768,152441,1741,1670,1457,365,4691,1867,3998,249,38,16060,17486,813,233,4253,2174,703,514,2211,2059,603,5184,3765,3709,818,1175,1371,0,0,1173,486,4908,1390,7912,20749,118,3883,1458,1020,4689,154,null,95,3816,4965,455,478,9786,3070,1190,1057,382,269,162292000000,35455.06957116913,3.3302974025205143E-2,0.11752547680462201,10.6]
[2010,42,"South Dakota",805616,1372,680993,6027,96805,5853,25777,325,25,745,61,1338,807,0,0,0,251,24,75,457,80,439,3520,571,82,129,0,0,407,144,4615,201,252,560,2260,38,0,0,38,758,262,2020,160,296,122,209,0,0,null,0,1334,0,0,224,1564,0,736,648,0,38297000000,47537.53649381343,3.1996633631904033E-2,0.12016270779130504,5]
[2010,43,"Tennessee",6282706,4009,5299496,24505,801355,21988,159778,8897,343,2291,4736,8019,1858,765,248,394,14168,11065,243,333,3162,4764,1052,2506,11188,2602,84,1450,1733,5529,1504,9029,4342,290,187,2433,197,2230,621,4800,7102,0,4462,669,430,2562,805,4765,63,null,8701,2062,0,8650,1412,2201,2831,0,0,253602000000,40365.091092914423,2.5431398508859081E-2,0.12754933940884708,9.6999999999999993]
[2010,44,"Texas",24899075,8102,20500156,52416,3740344,51566,486558,8636,11613,16521,15251,68959,16361,924,704,460,26668,16671,3718,2033,20169,6985,3946,11598,5153,31149,1318,4724,7139,13775,6088,7773,12061,1027,4893,8324,1067,7058,11752,16624,12183,2452,8317,22969,4373,7161,975,5249,1936,13044,null,4123,52,13713,8847,2221,5927,1874,4180,1226714000000,49267.452706576449,1.9541207856115139E-2,0.15022019894313343,8.1999999999999993]
[2010,45,"Utah",2724064,2775,2240636,18397,388410,17535,77780,93,1798,8147,316,12187,3987,119,0,138,2097,966,932,7692,1831,517,483,299,235,46,148,426,246,261,914,127,1255,1929,118,4549,0,247,518,1462,1167,0,1527,886,2525,557,0,838,875,459,5305,null,297,3005,3792,0,338,2126,383,118225000000,43400.228482150196,2.8552926803481857E-2,0.14258475571792734,7.7]
[2010,46,"Vermont",619363,779,534975,5691,59032,4857,22529,0,184,65,0,1001,326,1287,87,9,2063,496,49,0,370,0,91,0,176,0,824,300,3599,201,85,0,51,236,0,58,2760,751,0,4056,539,30,50,0,100,524,227,134,153,125,565,0,null,400,128,0,377,52,0,25809000000,41670.232157878338,3.6374468607262622E-2,9.5310827414617924E-2,6.1]
[2010,47,"Virginia",7930773,4735,6752310,28251,870491,21599,259507,2671,3296,3807,1233,17088,3229,2468,1265,10593,18165,11927,2347,1159,7576,2892,1135,2103,2051,2148,1494,24822,4104,5733,462,1858,4262,866,523,748,372,6825,1098,17525,23829,201,7708,781,2137,11796,1543,8339,98,5842,12938,1551,676,null,4373,6779,2648,423,1306,422763000000,53306.657497320877,3.2721526640593544E-2,0.10976117964793596,6.7]
[2010,48,"Washington",6661321,4568,5464985,26926,946923,24983,191784,1322,5644,5971,658,39468,4883,642,202,243,5378,3107,4246,12661,3931,1912,1685,1694,886,1011,717,629,1448,2871,1323,737,3727,5094,323,5310,282,721,1012,4140,2143,515,2727,1986,26235,2893,220,3047,866,789,11338,4020,981,7266,null,62,2180,638,0,342702000000,51446.552418056417,2.8790685811417884E-2,0.14215243492994858,9.6]
[2010,49,"West Virginia",1833535,1890,1625125,9824,166168,9198,39609,41,1326,0,0,760,608,84,556,480,1842,485,0,88,356,366,0,161,851,60,0,4249,191,657,0,44,160,39,0,25,107,906,0,611,2552,268,7925,229,0,4908,238,647,0,1160,968,112,208,4999,192,null,150,0,182,62732000000,34213.691039440208,2.1602532812299739E-2,9.062712192567908E-2,8.4]
[2010,50,"Wisconsin",5623196,3124,4824045,20412,691592,17462,93065,552,798,1854,518,4506,1890,359,351,98,4492,1656,550,902,20299,2563,2300,752,287,331,448,1088,992,6317,16741,810,1716,154,853,1049,69,632,123,1291,1817,497,1674,89,1444,2211,0,1142,235,856,3039,476,75,771,1013,256,null,129,521,245415000000,43643.330234265355,1.6550196720868347E-2,0.12298913287034632,7.8]
[2010,51,"Wyoming",556954,1133,444614,8794,82255,8679,28046,172,0,1511,0,2784,4390,0,0,0,396,745,25,942,415,132,462,532,519,107,0,51,252,570,218,0,421,2528,1711,416,0,0,707,146,34,233,56,62,14,95,0,220,258,495,1990,3226,75,580,556,0,0,null,0,36459000000,65461.420512286473,5.0356043766630637E-2,0.14768724167525504,6.5]
[2010,52,"Puerto Rico",3676493,2933,3392179,13112,247593,12844,31732,629,156,288,0,1177,388,899,0,0,11262,207,0,0,1642,109,0,112,254,109,0,59,2004,89,50,170,221,0,0,0,0,1244,364,4768,146,0,69,0,0,1516,684,109,0,30,977,882,0,392,0,141,585,0,null,101496000000,27606.743709290349,8.6310513851107565E-3,6.7344885465578208E-2,16.3]
[2011,53,"Alabama",4745278,4078,4024442,22751,588293,20366,117726,null,1771,1677,1642,3389,348,2921,232,399,20063,19346,1259,137,6991,1434,30,842,2686,2413,626,1606,112,2797,327,3945,1086,317,770,257,64,1996,119,1108,2697,284,2596,973,169,1075,0,2036,90,8710,7973,300,66,4935,2621,65,417,9,569,178533000000,37623.296253665219,2.4809083893504238E-2,0.1239744014997646,7.3]
[2011,54,"Alaska",711962,1401,571857,8892,100280,8388,35084,93,null,2467,190,3098,1583,138,11,140,1188,556,1366,475,985,181,319,750,237,1077,0,216,141,771,593,554,921,248,5,532,520,128,226,940,470,0,319,616,2161,378,0,186,301,388,2492,662,68,1488,4548,89,23,246,1044,51237000000,71965.919529413091,4.9277910899739034E-2,0.14085021391591124,7.4]
[2011,55,"Arizona",6402301,5660,5107496,39045,1028366,36556,222877,833,5001,null,1066,49635,10189,1875,0,389,3732,2206,2199,2190,10035,5855,4526,1708,2134,844,0,1918,743,9396,3297,1226,3872,2431,1393,8756,228,3379,4610,3880,2548,1159,4682,3219,4613,3436,72,1774,1657,1680,12688,10577,0,2233,13940,70,6473,2510,871,255989000000,39983.905786372743,3.4812015242644795E-2,0.1606244379950271,8.6999999999999993]
[2011,56,"Arkansas",2906632,2928,2421746,18606,405831,18050,69845,691,560,439,null,4077,746,519,79,0,3067,1446,13,179,3684,1362,851,2008,213,2120,30,133,781,1881,232,1731,7314,713,332,641,52,341,775,674,1664,214,174,3761,632,567,0,235,0,6462,14767,0,0,1245,1477,24,687,252,529,106557000000,36659.955577451838,2.4029529709987368E-2,0.13962242210228196,7.6]
[2011,57,"California",37222678,9999,31213310,71183,5271168,68394,468428,2087,7358,35650,2648,null,21245,3073,1302,3240,22094,13303,9864,4796,20834,4673,3324,2810,1201,3600,1658,7793,10244,12069,5687,2092,7677,2599,1955,36159,1222,8053,5904,25629,8708,1392,10474,5113,18165,8550,1103,5758,1004,8761,37087,8944,745,15753,36481,832,5668,2047,1344,1908985000000,51285.536199195558,1.2584478741696124E-2,0.14161173465272972,11.2]
[2011,58,"Colorado",5048443,4037,4048042,22888,763233,18937,202124,2340,3191,12338,1615,23234,null,1567,501,298,8075,3250,1852,1578,6027,2116,3510,3718,1361,908,1358,3303,2157,3225,3055,879,4552,4079,4582,4061,489,2863,8797,3998,4756,2249,5527,3824,5543,3348,435,718,1340,3193,22390,3856,914,6281,5524,412,3995,2942,476,264733000000,52438.543923344288,4.0036898505143068E-2,0.15118185943666196,8.3000000000000007]
[2011,59,"Connecticut",3548667,2644,3139496,16755,316883,15392,71502,101,180,1387,84,3699,1502,null,62,607,4771,2000,587,133,1843,168,67,16,0,315,259,1267,8691,692,76,69,365,206,62,160,1221,3809,265,20015,1029,0,1383,217,117,3668,1488,997,0,123,1214,398,608,2555,2255,46,660,65,2105,225409000000,63519.344024108206,2.0148974248640403E-2,8.9296347050878536E-2,8.3000000000000007]
[2011,60,"Delaware",897187,1369,775414,8584,83156,6851,33912,81,329,541,0,699,169,66,null,154,810,639,201,441,34,210,0,7,305,0,0,4238,806,43,201,0,713,0,12,0,0,6297,0,3141,388,0,664,27,0,8571,131,153,0,221,883,475,0,1064,482,198,55,463,1008,64377000000,71754.27196336996,3.7798140187051306E-2,9.2685248448762636E-2,7.2]
[2011,61,"District of Columbia ",611608,1403,489659,6701,66519,6073,48066,13,135,43,81,3797,452,981,128,null,1254,937,372,68,1397,128,241,6,297,0,0,14129,2048,1108,409,83,112,38,79,238,145,1035,0,2313,1716,285,306,0,51,1589,50,357,104,421,1083,75,445,7975,476,120,946,0,0,107201000000,175277.30180115369,7.8589554093471639E-2,0.10876084027677858,9.6999999999999993]
[2011,62,"Florida",18863948,8536,15742168,59355,2454255,53419,498597,12635,7405,8451,3025,22420,9383,11704,1264,891,null,38658,3639,312,19152,11472,1846,2661,5441,6094,4689,15410,13701,19640,4663,5175,7114,559,3857,3527,4324,25206,1376,59288,23983,514,18191,2600,3315,20821,5002,11953,716,10451,25532,2343,2019,16614,6339,4964,7412,846,21611,746439000000,39569.606531994257,2.6431211536418569E-2,0.13010293497416342,9.5]
[2011,63,"Georgia",9699859,5580,8095407,40769,1289450,37444,271077,18799,1079,4292,2112,14949,2325,709,619,364,42666,null,1006,126,6080,2442,950,4513,3686,6541,408,3708,4436,6992,1808,5380,2514,246,4144,774,132,8371,791,14454,19138,201,6863,1632,727,5791,337,16914,536,16898,15760,793,361,9438,3701,1340,2727,504,1635,417438000000,43035.47092797947,2.7946488706691509E-2,0.13293492204371218,9.5]
[2011,64,"Hawaii",1357806,1803,1160948,10743,122727,8676,57542,1268,844,2900,242,10173,950,731,784,222,3160,2519,null,112,1884,402,478,125,18,179,106,341,92,1303,933,371,308,85,91,1548,107,564,354,4246,2307,32,970,685,2030,870,58,1681,0,636,3007,1040,0,2523,3790,312,147,14,238,70006000000,51558.17546836588,4.2378660869078502E-2,9.038625547390422E-2,6.4]
[2011,65,"Idaho",1559637,2674,1284530,13188,208434,13285,60336,263,4510,3543,224,9021,1813,0,0,0,1733,275,254,null,390,296,318,479,120,51,0,0,396,615,566,62,384,1602,439,3581,129,84,141,419,263,1201,260,288,7170,343,0,55,842,296,1303,6059,0,905,8991,0,165,487,249,57096000000,36608.518520655765,3.8685924994085165E-2,0.13364263607493282,7.8]
[2011,66,"Illinois",12718402,5792,11076528,31383,1353853,28856,216204,2823,4119,7657,3185,13930,3271,1819,277,1440,17548,6042,1269,393,null,23491,8420,2533,5569,1315,693,2565,3507,10274,4496,1521,13889,304,827,2454,590,3009,1573,6412,4057,105,8384,1002,792,3012,278,1582,1318,3223,11011,951,49,5233,3075,352,14507,58,2387,670247000000,{"$f":"BK69/D69","v":52698.994732199848},{"$f":"J69/D69","v":1.6999305415884795E-2},{"$f":"H69/D69","v":0.10644835727004069},9.4]
[2011,67,"Indiana",6437155,3841,5478683,24180,809158,21392,127874,1562,371,3975,2016,7649,1930,1227,79,0,8595,2543,1057,1368,23071,null,916,1321,10177,2241,275,480,952,7896,1168,469,1824,34,622,511,90,651,504,2518,3038,70,11109,844,505,3998,49,3306,235,3879,6326,123,530,1486,1028,216,2923,117,132,284344000000,44172.309040251479,1.9864986939105864E-2,0.12570118320904189,8.5]
[2011,68,"Iowa",3027718,2514,2573313,16682,370554,15638,70405,207,967,1411,433,3297,2891,424,0,0,707,1938,299,161,13725,349,null,1776,387,228,26,487,466,1687,5634,408,3649,370,6490,2009,0,185,421,2361,1760,604,993,532,811,388,65,172,2842,623,2334,1482,38,720,856,115,2537,140,57,146057000000,48239.96158162682,2.3253486619295455E-2,0.12238722364500261,5.5]
[2011,69,"Kansas",2833584,2851,2372033,15236,362782,14847,83640,434,108,2028,998,4743,5030,412,74,128,1581,1146,287,264,2760,863,1715,null,1167,519,481,3180,28,1947,679,1517,22033,270,1648,657,27,1189,769,780,1223,379,1616,5022,285,1494,180,1102,104,1066,6575,196,0,1986,772,0,893,1285,775,134767000000,47560.615813753888,2.9517388579269221E-2,0.12802937904787717,6.1]
[2011,70,"Kentucky",4316297,3382,3686232,19523,505741,18525,110031,925,0,1818,1058,2130,221,176,0,201,7400,2725,63,36,4273,11071,536,253,null,1399,71,2076,1019,3178,475,1248,2793,216,471,1358,52,1289,553,2174,3916,117,19617,1256,459,1490,640,1387,0,16852,4661,140,151,5154,1121,1174,581,57,192,168019000000,38926.654027746466,2.5491990009028572E-2,0.11717011132459143,8.6999999999999993]
[2011,71,"Louisiana",4518629,3250,3865118,18789,538691,17818,99138,3065,288,2010,2774,3957,1202,358,0,195,5193,4425,688,230,1189,1549,468,312,1520,null,120,1221,439,1163,698,10255,1375,278,176,994,15,453,1028,1360,2134,277,2641,4235,1531,455,268,1573,37,2495,30292,179,87,2055,1075,110,339,357,393,237389000000,52535.625296965074,2.193984060209413E-2,0.11921558508122707,7]
[2011,72,"Maine",1315833,1456,1120364,10400,157102,9401,33818,634,37,325,38,829,290,2481,238,239,4304,507,177,0,675,164,275,523,158,138,null,52,4439,702,296,0,325,10,0,150,4302,694,144,2589,1439,19,483,25,471,915,234,587,42,394,1637,182,612,570,88,43,321,21,65,52489000000,39890.320428200233,2.570082981654967E-2,0.11939357046068916,7.4]
[2011,73,"Maryland",5759087,4326,5008452,20478,553895,18323,153979,228,671,945,423,8595,1796,1608,6652,18492,7825,7113,1170,389,2392,1318,110,689,848,860,1526,null,3470,2077,810,1109,1469,73,0,1105,232,9627,797,9222,6686,0,3396,845,276,14158,197,2882,0,1942,3619,223,40,22089,1525,2027,353,80,779,305175000000,52990.170143288335,2.6736703230911426E-2,9.6177571201824172E-2,7]
[2011,74,"Massachusetts",6515057,3680,5658768,20357,656441,18778,139830,1201,225,1017,167,11556,1388,9445,399,676,11396,3264,733,412,2991,640,138,969,180,977,4006,2762,null,2629,862,356,1261,596,637,163,12010,8332,199,19431,3964,61,1757,90,178,6538,10182,1621,44,371,5203,548,2246,2984,1673,911,441,0,4413,388575000000,59642.609419994333,2.1462590427067638E-2,0.10075752215214694,6.9]
[2011,75,"Michigan",9766574,4376,8340767,29076,1242917,25401,139158,3527,3456,3840,2054,7793,3425,1656,0,256,17712,4254,630,882,9897,7668,1709,1148,2578,955,599,1035,2861,null,2671,715,2509,84,439,1215,73,1849,508,6087,3405,159,11224,917,647,2864,385,2185,571,3106,9935,642,0,2327,1430,417,4018,841,908,385123000000,39432.763218709035,1.4248394575211328E-2,0.1272623337518356,9.4]
[2011,76,"Minnesota",5277329,3380,4505462,20788,646176,19647,101029,123,893,2314,951,6638,2662,74,86,367,2820,840,901,402,8209,786,6175,606,755,573,321,424,970,5164,null,549,1345,1457,1936,2682,21,631,540,2416,845,7574,1961,546,1800,870,0,447,5305,874,3062,919,177,1034,1413,92,19255,224,54,279987000000,53054.679744241832,1.9143964683649626E-2,0.12244375895457721,5.8]
[2011,77,"Mississippi",2943021,3088,2534036,16620,332934,15960,68511,8922,117,556,2315,4723,484,54,0,415,6152,3136,369,55,2068,611,650,66,1626,7139,0,265,1445,1610,614,null,1581,0,118,84,65,269,1075,364,483,0,991,566,74,2568,41,398,6,7683,5243,332,0,1453,286,303,1136,0,318,97533000000,33140.436306774573,2.3279140719689055E-2,0.11312661377543687,9.8000000000000007]
[2011,78,"Missouri",5937896,4110,4963040,26160,801046,25054,149439,1395,2043,2356,6168,8386,3144,1516,0,215,4513,2964,871,560,20161,4404,4811,20884,1993,1728,291,716,463,2830,2026,1641,null,845,4860,1544,769,1114,1016,2904,3669,977,3240,6073,777,1810,359,267,361,2676,10293,1697,88,2684,2518,196,1503,1120,709,249546000000,42025.997087183743,2.5166995178090016E-2,0.13490401313866057,7.6]
[2011,79,"Montana",987076,1359,828254,8593,122210,8386,33553,449,1118,1971,49,3033,2856,58,365,0,291,231,32,1543,765,646,417,845,0,0,71,57,10,353,969,0,158,null,384,688,0,889,264,422,1173,360,321,96,1959,840,0,77,227,266,1329,1232,53,278,3835,14,146,2413,353,38933000000,39442.758207068146,3.3992316701044294E-2,0.12381012201694702,6.2]
[2011,80,"Nebraska",1817126,2304,1505191,11978,253269,10841,52070,169,721,1646,161,5124,3245,381,0,29,1105,434,275,506,1415,615,9575,3040,352,222,122,318,0,683,1455,424,1848,64,null,240,0,119,242,544,829,292,268,1255,1556,252,0,243,2999,226,5343,734,0,615,835,24,560,965,0,96230000000,52957.252276396903,2.8655140039821125E-2,0.13937888731986664,4.2]
[2011,81,"Nevada",2688336,3578,2084668,23272,480317,23514,110345,280,597,10142,310,40114,2714,189,184,983,2923,1731,4093,3929,1668,855,114,602,628,78,49,931,256,1663,1055,203,335,1137,32,null,0,2118,2136,1516,1333,0,1354,258,1691,570,86,165,588,96,7249,3365,0,1740,4680,0,2672,933,153,129421000000,48141.675742913088,4.1045836532338217E-2,0.17866702674070503,12.4]
[2011,82,"New Hampshire",1305678,2046,1141236,9064,122129,8186,37000,193,0,246,22,547,403,1617,20,68,1970,535,0,0,478,470,47,0,0,0,3080,222,15526,155,104,160,153,230,33,186,null,294,186,1471,1297,47,248,0,198,1015,608,588,86,126,605,158,2138,880,428,0,0,162,0,63333000000,48505.833750740996,2.8337767811052954E-2,9.3536844459353688E-2,5.4]
[2011,83,"New Jersey",8719952,4595,7825661,21158,693380,21063,140194,189,1198,3784,57,5986,2203,1924,2100,781,12907,4268,264,256,3690,718,332,317,102,871,624,5335,4675,1889,1261,510,583,49,312,899,499,null,355,40815,2482,61,1121,773,360,19733,463,1586,0,1412,3801,256,0,4458,2454,1252,214,15,4312,493175000000,56557.077378407586,1.6077382077332537E-2,7.9516492751336251E-2,9.1999999999999993]
[2011,84,"New Mexico",2055293,2718,1753413,15690,228218,13801,62130,410,416,7444,682,7066,5525,0,0,212,2806,676,81,355,466,2030,0,1333,87,184,510,2277,252,908,438,556,1183,544,353,2099,114,245,null,1445,522,264,1742,234,916,492,0,145,240,899,13633,303,71,425,924,0,340,283,99,79555000000,38707.376515173266,3.0229266581455784E-2,0.111039155974355,7.2]
[2011,85,"New York",19248685,7023,17055260,37016,1756105,32216,282209,1812,6124,2821,1041,25761,3724,15123,1124,3702,29344,10584,1002,434,6914,2198,928,838,2414,1495,2915,5037,14646,3936,1824,401,1417,391,579,1785,2972,41450,461,null,9336,374,5191,1425,2189,26596,1393,6947,112,2660,9151,773,3882,10800,2986,631,1878,688,10582,1169436000000,60754.072291172095,1.4661209324169417E-2,9.123246601001575E-2,8.4]
[2011,86,"North Carolina",9539412,5364,8070238,36924,1160510,33476,265291,5420,3991,4286,327,15373,3919,1975,954,1135,28044,16192,1806,675,5971,3228,654,4995,1637,2936,824,10485,9053,7530,1294,1273,2638,563,1056,1048,2078,10374,1737,18321,null,189,10187,1390,1175,9450,444,20427,565,6057,6621,961,212,27302,3295,2780,2291,153,844,436144000000,45720.218395012191,2.780999499759524E-2,0.12165424871050752,9.6999999999999993]
[2011,87,"North Dakota",675161,1047,559906,6503,79837,6140,32510,97,393,1313,249,1356,1229,0,84,0,459,364,138,1209,571,130,208,75,0,422,50,10,369,328,12244,80,330,1227,218,845,0,183,99,264,900,null,286,59,264,652,0,1,1293,113,1862,429,0,166,404,0,1398,139,76,39992000000,59233.279173411975,4.8151477943779337E-2,0.11824883250069243,3.1]
[2011,88,"Ohio",11418944,4418,9764366,32087,1425709,29701,191778,1567,1637,6763,1952,9032,2690,1189,263,587,16492,4290,1044,312,7027,11588,1146,657,12744,1872,0,4982,2101,14330,1788,691,2003,101,1176,1851,1992,3936,255,8784,4572,204,null,2333,1326,14292,369,3826,34,6468,11987,691,68,5425,1979,7548,2534,1280,1607,490265000000,42934.355400989793,1.6794722874549521E-2,0.12485471511201036,7.9]
[2011,89,"Oklahoma",3742698,2585,3089041,15209,528498,15584,108878,591,1137,3770,6894,8233,3273,97,66,191,6056,3514,140,21,2179,2113,580,4626,1398,1934,271,432,160,1038,497,199,5781,803,1979,705,0,391,403,1858,1322,928,1608,null,917,1116,152,2015,600,1700,31595,587,0,1013,1246,44,942,1763,105,156058000000,41696.658399902961,2.9090778898003527E-2,0.14120775974978478,5.7]
[2011,90,"Oregon",3828714,3857,3128121,20096,549332,19087,127906,758,1935,7911,988,34214,2110,949,251,349,3384,1946,2491,6236,1350,1371,659,1263,71,0,269,453,1423,1652,1413,7,1172,1079,324,7222,427,1322,537,2056,1099,313,949,2034,null,1407,0,370,417,673,4498,3443,176,1179,21862,66,914,914,4,188981000000,49358.870889807906,3.3407039543825942E-2,0.14347689589768262,9.1999999999999993]
[2011,91,"Pennsylvania",12610486,5092,11099077,27780,1224564,25195,234291,1332,759,2278,582,10672,2491,4150,5177,1401,19299,4627,495,236,3902,4086,1176,2323,4013,615,608,17751,6284,4406,853,1238,1761,338,582,1057,1326,36133,325,29436,11254,195,13075,283,1594,null,799,3438,142,3742,7006,1246,446,8419,3688,4631,2426,195,2723,581256000000,46093.068895203563,1.8579061901341471E-2,9.7106804606896191E-2,7.8]
[2011,92,"Rhode Island",1040022,1440,903786,8645,101689,7813,26769,0,0,214,0,1949,301,2613,0,0,2230,476,0,107,373,41,82,374,211,121,228,472,7715,178,27,0,109,0,0,0,941,1224,93,2776,259,0,60,0,57,1125,null,223,0,210,207,181,621,485,262,199,2,23,293,49423000000,47521.110130362627,2.5738878600644985E-2,9.7775816280809447E-2,10.9]
[2011,93,"South Carolina",4624180,3871,3899705,25459,546666,21151,157644,2999,2421,1971,1333,6592,1000,1752,841,589,15476,16355,712,55,2371,3249,1379,1885,2454,878,652,3807,730,4483,471,2163,1522,915,204,1017,372,4241,598,11317,23102,271,6327,1008,833,3523,453,null,62,3324,8623,181,91,7879,2510,1680,341,632,2166,168716000000,36485.60393410291,3.4091233472745439E-2,0.11821901396571932,9.6999999999999993]
[2011,94,"South Dakota",814175,1297,688436,7824,94655,6542,27506,0,554,1422,659,1286,1021,0,0,0,101,69,0,186,267,285,4772,144,211,0,0,254,113,239,5342,129,354,232,1695,110,0,441,513,6,166,2060,84,40,15,57,7,529,null,0,1156,560,0,79,557,0,481,1310,0,41667000000,51176.958270642062,3.3783891669481377E-2,0.1162587895722664,4.4000000000000004]
[2011,95,"Tennessee",6333466,4450,5342978,29750,794556,26578,170969,9326,531,1346,7393,7130,1372,150,155,307,15491,17507,179,0,8593,5645,387,1805,13884,1901,9,1135,1690,5983,445,9172,3795,43,631,883,132,1396,381,4921,9353,50,5944,3166,726,3360,14,5531,181,null,7009,200,38,6098,2852,1385,1213,131,1083,263626000000,41624.285975483253,2.6994539798587378E-2,0.12545358260390124,8.5]
[2011,96,"Texas",25327104,10987,20984855,65490,3648260,63784,514726,8747,6670,20073,16461,58992,19126,2927,884,2276,35777,17401,6106,4379,15064,10265,3236,12766,6616,25513,1357,9443,5035,15654,7691,6048,13473,537,3837,7793,459,7578,15225,26155,14956,809,12315,19302,3743,9107,1297,4075,1486,10788,null,5234,349,13231,15325,663,5982,2500,5225,1321005000000,52157.759529079995,2.0323128929387268E-2,0.14404568323326664,7.4]
[2011,97,"Utah",2769627,2949,2295961,19215,373984,17246,85217,486,2151,6585,422,18237,3986,562,0,132,1643,1052,1701,7538,1447,545,290,1146,611,494,0,342,959,1099,939,143,511,1241,195,4315,34,506,1707,1937,1653,2,2584,150,2037,1496,0,309,128,549,4507,null,122,2413,4825,270,158,1058,0,124454000000,44935.292730753994,3.0768403109877249E-2,0.13503045716986439,5.9]
[2011,98,"Vermont",621354,940,537304,5021,60719,4634,20463,0,580,310,0,819,529,2105,107,27,366,101,143,0,386,258,0,7,627,41,322,361,2378,335,206,0,69,0,0,15,2244,962,56,3723,250,0,383,0,124,389,401,21,0,327,185,182,null,740,156,53,137,38,19,26545000000,42721.21850024302,3.2932917467337459E-2,9.7720462087634422E-2,5.0999999999999996]
[2011,99,"Virginia",7996552,5256,6789620,30962,889751,30111,257130,4930,3202,4679,645,19371,4908,5376,961,6854,17773,8715,2917,434,4000,2703,1503,892,3630,2496,2855,22051,5386,7323,834,1682,2277,617,256,1717,1344,7327,1014,12455,22753,462,9570,853,3499,12009,1897,6612,908,7482,11655,1426,173,null,4615,9041,858,190,1222,433611000000,54224.745865468016,3.2155108851915172E-2,0.11126683100416279,6.2]
[2011,100,"Washington",6748474,4248,5565069,27197,919925,27221,208507,1821,5266,12397,756,38421,3938,1026,0,358,6094,8705,5940,10895,2062,2303,1000,2820,1271,1016,1313,1899,1580,3720,1543,1110,3307,2125,673,4925,824,2006,1569,4512,3870,189,2686,765,29168,2296,463,1519,227,2342,15491,4789,119,4233,null,157,1491,1507,1083,357056000000,52909.14657150639,3.0896910916453111E-2,0.13631600269927691,8.6]
[2011,101,"West Virginia",1836614,1681,1609110,9854,172262,8430,50068,221,598,50,225,1442,124,594,89,300,2949,1296,147,120,1331,210,0,0,515,326,45,7515,236,459,0,0,309,60,78,293,160,1431,0,2017,3865,0,8545,97,132,4205,284,1857,0,546,1574,114,23,5561,83,null,42,0,680,66109000000,35995.043052051224,2.7261035797396731E-2,9.3793252147702233E-2,7.3]
[2011,102,"Wisconsin",5647213,2653,4846550,18735,675623,19411,109439,708,432,4045,335,6637,2592,993,219,123,4338,1745,1108,566,25521,4017,3306,418,1040,850,12,147,733,5623,17927,983,2090,143,483,663,480,378,714,2213,2120,1383,1358,118,1057,1294,368,377,590,744,1984,890,342,2573,1555,1090,null,14,728,253349000000,44862.660572569162,1.9379293821571809E-2,0.11963830654165161,7.1]
[2011,103,"Wyoming",561389,1021,462808,7194,66648,5771,30651,51,761,369,174,2539,6905,11,0,0,1525,46,0,2140,450,6,342,286,83,114,0,0,152,849,357,70,241,1105,1784,427,0,7,76,113,395,237,22,462,960,284,13,219,1043,69,1398,2140,4,451,1803,0,168,null,0,38190000000,68027.695590757925,5.4598504780107908E-2,0.11871981816530071,5.8]
[2011,104,"Puerto Rico",3669195,3034,3403602,12450,238263,11889,22649,35,378,229,0,207,0,1849,13,212,6614,247,0,13,624,784,0,38,0,0,0,70,1412,88,0,27,101,0,0,0,0,2150,51,2615,200,0,0,79,0,1978,490,3,113,224,444,0,0,1077,41,14,229,0,null,98757000000,26915.168040946312,6.1727436126997881E-3,6.4936041829338584E-2,16.2]
[2012,105,"Alabama",4764428,3589,4054260,21464,590326,19701,104600,null,1004,962,660,3077,1386,284,42,162,11244,19920,627,493,2722,1347,345,865,2495,3104,67,1513,334,2298,752,4952,1555,101,151,1009,161,1702,459,2709,5133,228,1411,194,200,1837,0,2811,518,10539,7468,579,0,3170,1034,128,760,88,619,183547000000,38524.456660904521,2.1954366820109362E-2,0.12390280638095486,6.8]
[2012,106,"Alaska",721186,1290,592551,8741,90613,7239,33415,1097,null,1520,196,3494,556,0,0,356,1991,928,1376,538,58,260,13,221,161,120,66,508,297,563,192,56,819,371,1195,803,118,116,263,736,920,264,1316,335,3174,255,0,384,99,451,1488,330,79,1265,3725,0,206,136,25,51859000000,71907.940531291519,4.6333400814769006E-2,0.12564442460058847,6.6]
[2012,107,"Arizona",6468907,3874,5242674,32185,953789,28803,232457,1331,3717,null,1214,44889,13790,417,246,36,5553,2263,2491,2934,10744,2930,2702,2498,1328,724,616,3007,1961,9598,8570,293,2595,1118,2293,6712,510,2564,6946,7402,2721,877,7906,1626,8587,4280,614,1070,1472,5075,14788,5916,207,2763,13247,765,3765,2786,1791,266891000000,41257.510735584852,3.5934509492871053E-2,0.14744206401483281,8.1]
[2012,108,"Arkansas",2912680,2753,2453347,16841,373046,14543,76948,374,855,1677,null,3525,603,185,0,205,2682,1525,0,0,3576,1172,409,1033,1310,3953,17,169,254,1283,295,3689,9105,258,166,121,0,157,547,2262,3057,0,1135,9938,193,516,59,52,673,4195,11767,269,0,1159,251,84,695,1498,0,109557000000,37613.812708570804,2.6418281445266902E-2,0.12807654805883242,7.5]
[2012,109,"California",37572738,10274,31777868,67939,5046618,65422,493641,2509,6995,38916,3472,null,15150,6764,474,3199,21004,10790,11906,5331,21251,5891,2284,2790,3763,5180,1256,7902,14356,8921,8539,2556,6729,3060,3302,27968,1327,12057,5921,31261,11195,1827,10653,6671,22724,10466,1648,4110,826,5802,43005,12172,544,15625,34569,1413,5681,1886,2323,2003479000000,53322.677735117417,1.3138275948907423E-2,0.13431595003803024,9.6999999999999993]
[2012,110,"Colorado",5123944,2939,4131357,21752,751921,19587,205060,3108,3457,10589,1043,22152,null,1317,70,488,8615,5834,2536,2660,6374,4336,2776,5283,2500,5048,20,2844,5939,3343,2992,835,3771,2021,4472,3789,679,2464,6520,7250,4378,1918,4533,4582,2419,3950,137,2383,756,2535,17355,6398,503,3796,4853,837,3000,5602,1144,274048000000,53483.800759727274,4.0019953379662229E-2,0.14674652962639717,7.3]
[2012,111,"Connecticut",3555319,2447,3114940,16188,334918,14546,80311,46,439,3167,200,3161,367,null,22,288,6578,1702,408,97,912,53,0,0,124,909,1224,1752,8743,753,605,276,358,50,45,172,1009,5665,444,23310,3379,0,287,415,35,2214,1558,940,0,260,3279,45,709,1729,1593,174,711,104,3228,229317000000,64499.697495499,2.2588971622518262E-2,9.4201954873810195E-2,8.1]
[2012,112,"Delaware",906576,1624,782216,9177,86003,7626,34757,119,692,188,0,2221,0,1489,null,11,715,179,0,32,567,62,30,113,0,178,0,5649,157,227,351,58,80,0,91,572,99,5846,85,3566,1349,0,191,0,0,6828,135,298,0,344,133,166,0,1746,29,161,0,0,56,65984000000,72783.748963131613,3.8338760346622897E-2,9.4865736573657364E-2,7]
[2012,113,"District of Columbia ",624847,948,500267,6225,61992,5668,53830,79,1247,902,35,4999,677,618,78,null,1705,1079,38,46,795,469,133,164,112,283,194,14120,1524,944,393,44,337,0,172,42,197,1451,116,3085,985,0,651,0,157,1494,635,150,0,577,1473,116,267,9537,481,293,721,215,0,109793000000,175711.81425212891,8.6149089297059916E-2,9.9211486972010751E-2,8.6999999999999993]
[2012,114,"Florida",19114620,6877,16032617,49245,2380288,44658,537148,18599,10704,6473,3321,20386,8766,8975,1099,780,null,42754,3177,1268,22565,13803,3864,5661,6912,5550,7348,10442,15159,23400,5460,5490,10666,1758,945,1241,2362,27606,2853,53009,23133,239,22927,3142,2919,25659,3050,11366,1070,16275,28564,2499,2747,25697,4943,3533,6216,773,21638,777164000000,40658.093124529812,2.8101421843594064E-2,0.12452708973550089,8.1]
[2012,115,"Georgia",9796547,5863,8231384,34188,1236302,31155,277466,13864,2654,6657,1041,14174,4710,1829,226,1352,42870,null,1409,936,7143,5972,1687,1497,6172,4100,222,3619,4153,9949,2237,3280,3377,251,1283,3783,15,4920,915,13957,16009,207,7501,3299,453,9076,440,18611,257,17606,16198,20,84,10702,1965,1237,3441,106,1730,433569000000,44257.328628138057,2.8322836607633281E-2,0.12619773069021156,8.6999999999999993]
[2012,116,"Hawaii",1374852,1662,1164145,10466,134827,9196,55145,608,1417,1865,24,9756,1216,191,278,230,2780,1448,null,404,318,292,84,1135,485,207,91,2491,1266,321,192,44,944,131,75,760,85,410,284,2382,2241,0,884,1095,1763,1087,106,644,459,1314,3300,2183,0,1393,5920,197,295,50,336,72424000000,52677.670032847171,4.0109771815439045E-2,9.8066555527431321E-2,5]
[2012,117,"Idaho",1573036,2184,1296975,12998,210151,11483,59283,575,1198,2424,291,10280,1186,44,120,116,2014,583,206,null,532,283,90,63,83,54,0,107,338,683,637,87,214,3800,35,2535,0,214,675,938,817,0,1018,93,4963,169,0,205,118,1957,1352,6617,0,269,10398,0,225,677,136,58243000000,37025.853190899637,3.7686995084664304E-2,0.13359579818897979,6.8]
[2012,118,"Illinois",12725119,5939,11009321,31714,1441191,27618,208755,883,2250,7139,1587,14940,3036,955,234,1066,12687,8745,869,1384,null,16907,8529,2009,2923,1229,526,1865,3296,12583,6537,2744,13264,228,1302,1478,283,2366,1359,7561,3761,196,6872,1491,954,4588,462,1583,394,4648,16780,1154,156,4311,2704,1221,14414,302,2049,695238000000,54635.088284832542,1.6404954641288619E-2,0.11325560098887877,9.1]
[2012,119,"Indiana",6457067,4184,5493090,26865,805228,22224,134137,1625,479,2763,564,6033,1225,823,639,1045,11472,2258,856,186,28436,null,1678,1624,11177,736,0,1050,837,11017,1543,1948,4526,134,591,1011,0,1537,219,2316,2665,113,11235,1198,387,2419,0,1414,111,3547,4490,105,0,1932,258,507,1727,1681,136,298625000000,46247.777822345655,2.0773673248241035E-2,0.12470491633430472,8]
[2012,120,"Iowa",3035469,2721,2585979,14093,362938,11238,75760,503,951,1590,451,3268,3252,112,0,151,4335,596,521,290,11969,1716,null,918,819,763,78,419,585,946,7505,751,4168,452,7698,681,56,1018,114,1230,734,833,1127,1465,348,451,0,943,1158,1148,3553,886,0,268,919,22,3607,392,786,152436000000,50218.269400873476,2.4958251920872854E-2,0.11956570796802735,5]
[2012,121,"Kansas",2848708,2507,2361899,16878,381695,15902,88284,853,333,3094,2158,5411,3746,210,0,456,3118,1896,149,456,1702,1679,1527,null,617,438,211,282,187,1125,682,452,21022,300,4126,851,0,267,1029,571,813,261,1310,8408,848,918,18,556,154,1542,8468,97,70,1705,3265,139,486,278,82,138953000000,48777.551086317028,3.0990891309323386E-2,0.13398881177010771,5.6]
[2012,122,"Kentucky",4328626,2851,3676472,15304,521511,14825,112787,4137,304,1103,518,3415,712,246,706,254,9232,4173,647,50,4445,12203,238,602,null,666,46,1120,419,7302,605,646,2381,0,723,301,84,496,554,5239,3643,122,17041,577,298,2226,0,1347,0,10064,3345,464,45,3319,1988,3346,1395,0,170,173466000000,40074.148240111295,2.6056074144543789E-2,0.12047957019155732,8.1999999999999993]
[2012,123,"Louisiana",4545914,4612,3912023,21791,528406,20131,91215,2329,403,2021,3645,5139,1433,164,0,596,6534,4478,378,265,1229,1359,544,420,1649,null,251,642,549,1080,330,6791,1591,428,745,931,11,975,150,2786,2284,64,1115,2159,195,1239,737,1914,0,2348,24488,277,45,1857,1581,238,682,146,655,243264000000,53512.670939221462,2.0065271802326222E-2,0.116237570706353,6.2]
[2012,124,"Maine",1315586,1384,1132344,9895,151438,9223,27523,129,38,230,0,1610,314,1468,234,32,2926,511,0,143,195,0,7,277,482,15,null,325,3887,116,430,79,69,0,82,35,3655,405,272,2519,1112,0,628,79,215,976,1024,173,0,985,496,200,349,573,118,51,0,59,38,53656000000,40784.866971828524,2.0920715179395342E-2,0.11511068071566587,7]
[2012,125,"Maryland",5816472,3717,5068457,21604,549973,20595,154983,1261,1947,760,136,8614,1071,881,4100,21213,9610,4610,610,429,3621,1210,569,1726,715,606,332,null,3977,2167,1422,581,256,0,132,330,1124,6260,638,11736,7507,116,2522,463,378,15485,82,2297,0,1800,5612,1061,589,20579,1431,1957,460,0,294,317678000000,54616.956808182003,2.6645533581181168E-2,9.4554396548285624E-2,6.9]
[2012,126,"Massachusetts",6580641,3587,5752166,19793,626380,17354,142577,636,890,1972,394,12770,980,10525,506,379,12890,2789,1108,188,2886,677,151,565,52,1556,3907,2381,null,1337,966,155,453,49,182,787,13331,8046,521,19467,2514,81,1829,297,1528,8236,6863,2477,194,823,3694,1027,2534,4098,1653,385,584,264,4056,403823000000,61365.298608448633,2.166612644573682E-2,9.5185256269108134E-2,6.9]
[2012,127,"Michigan",9778980,4263,8330990,24803,1268105,23226,133981,2341,1152,7168,906,8085,2363,798,114,274,13146,4270,291,242,10047,10976,993,805,3409,1284,261,2201,1720,null,1127,922,2206,218,113,1354,446,1617,1318,5731,3912,265,11318,705,811,2739,68,1822,66,3259,8638,819,60,3057,2146,353,4768,1277,782,400504000000,40955.600686370155,1.3700917682621296E-2,0.12967661248923712,8.9]
[2012,128,"Minnesota",5315228,2787,4536303,18312,653012,17074,101042,1299,523,3065,375,8086,3565,696,0,310,2372,2235,1277,575,5896,2026,7220,924,57,791,187,1841,814,2212,null,202,1709,1257,992,932,0,1038,322,1849,1745,6672,2635,1212,781,1106,299,1705,3442,1738,4001,429,77,1037,1685,0,17618,213,134,294729000000,55449.926136752743,1.9009908888198212E-2,0.12285681818352853,5.4]
[2012,129,"Mississippi",2947696,2744,2529377,17940,339807,16126,73500,5141,0,710,2680,4371,799,106,0,97,4676,2669,184,586,2703,1200,160,400,446,8588,163,379,67,1768,568,null,2634,166,138,526,60,2127,86,1492,1709,98,896,562,465,613,185,596,79,11643,7230,454,0,1929,433,0,611,307,81,101490000000,34430.280463114243,2.4934728683012088E-2,0.11527884829371821,9.1]
[2012,130,"Missouri",5951913,3866,4965459,21306,801093,19635,162930,1333,2186,2297,9434,10717,3798,410,234,144,8374,3451,2114,596,22001,4184,5956,20218,2291,1178,996,1246,810,2964,2798,1110,null,511,1999,836,35,960,451,2834,3988,636,3557,5298,1186,1535,361,2856,527,3122,9278,3287,318,2609,2312,148,2636,810,826,258832000000,{"$f":"BK133/D133","v":43487.194789305555},{"$f":"J133/D133","v":2.7374392065206598E-2},{"$f":"H133/D133","v":0.13459420525804056},6.8]
[2012,131,"Montana",995544,947,829489,8669,126463,7466,37690,31,726,1548,63,5428,2135,0,0,0,1875,292,556,3385,542,163,415,224,367,0,225,33,97,822,481,32,447,null,108,968,115,156,259,482,1082,977,402,1018,2950,457,0,230,191,45,1393,260,87,156,4783,0,750,934,0,40422000000,40602.926641112797,3.7858698359891675E-2,0.12702904140851634,5.8]
[2012,132,"Nebraska",1829420,2101,1540361,9074,237937,9736,43266,245,626,2406,363,3438,2023,0,0,0,1368,786,165,315,1193,290,6815,3103,131,411,68,129,195,258,1489,176,2223,108,null,233,0,524,158,318,874,497,563,587,106,702,0,456,2507,232,3130,229,79,1076,1327,111,316,917,0,99557000000,54419.980102983456,2.3650118616829377E-2,0.1300614402378896,4]
[2012,133,"Nevada",2725280,3005,2105070,21984,481496,19389,124285,761,2161,8748,353,49978,6402,143,373,468,3381,745,2053,1503,2822,362,714,1202,952,421,209,934,318,1235,1157,783,694,1086,714,null,175,912,1138,3521,767,702,1407,1520,3101,1601,336,480,0,1699,5484,4605,121,1135,2997,100,1046,766,237,133584000000,49016.614806551988,4.5604488346151585E-2,0.17667762578524041,10.6]
[2012,134,"New Hampshire",1309203,1504,1127376,9730,125118,9101,50484,0,437,440,0,1514,572,1345,0,101,2746,470,43,20,673,297,53,102,284,7,6118,33,18990,426,0,0,289,0,110,0,null,591,223,2905,1609,0,324,186,208,890,1248,323,0,77,2150,557,2960,660,113,80,239,71,75,64697000000,49417.088106275347,3.8560864892610236E-2,9.5568066984264469E-2,5.5]
[2012,135,"New Jersey",8772744,4541,7929570,23298,655465,21808,130223,779,359,1328,57,4330,380,3466,1921,840,10649,3002,22,113,2052,1039,357,426,631,339,430,3474,4907,324,570,106,384,67,35,908,126,null,45,40495,3236,55,1452,1540,760,23597,429,2372,581,1400,2509,425,35,5024,1847,297,680,23,2574,508003000000,57906.967306922437,1.4844044235190267E-2,7.4716075152768624E-2,9.1]
[2012,136,"New Mexico",2060595,2119,1769341,11461,226243,12069,54693,787,320,6391,410,4536,4780,280,100,25,4707,192,168,355,790,660,384,672,159,790,57,505,303,602,284,451,1216,139,194,604,268,252,null,1111,335,41,1178,1076,932,822,0,325,509,338,11955,1382,81,1560,1251,0,321,95,429,80600000000,39114.915837415894,2.6542333646349718E-2,0.10979498639955936,6.9]
[2012,137,"New York",19352153,6112,17202134,34343,1723117,30910,270053,1364,4002,4146,247,24623,3596,14595,477,3936,27392,7592,1598,607,8017,3040,955,1437,1753,1083,1345,7321,15073,5191,1059,773,3310,421,78,600,2760,42574,646,null,10544,77,4625,1327,1055,22895,3222,5952,0,1279,11231,622,2764,7939,2614,921,979,396,7321,1205930000000,62315.030270792093,1.3954674707253503E-2,8.9040067014765745E-2,8.1999999999999993]
[2012,138,"North Carolina",9640490,5097,8167830,27074,1149080,24801,273149,4329,1458,3493,861,13883,4790,4914,2180,1801,26365,16823,1566,334,6378,4532,775,1595,1531,919,1259,9005,3710,6161,1523,2377,2623,244,628,1627,754,11468,1138,19891,null,206,9337,1263,1333,12179,290,25532,351,9230,12638,1189,445,26759,5915,2677,2266,604,2025,455973000000,47297.699598256935,2.8333518317015007E-2,0.11919311155345838,8.9]
[2012,139,"North Dakota",689838,1379,563978,6361,84294,5380,38213,83,70,1571,0,999,546,65,0,70,950,98,160,540,799,55,458,161,22,18,98,232,187,757,15257,72,1490,1776,950,854,0,140,161,331,231,null,6,280,724,114,244,14,1754,746,1414,43,758,403,1604,0,543,365,0,46016000000,66705.516367610951,5.5394165006856684E-2,0.12219390639541458,3]
[2012,140,"Ohio",11414635,5725,9735390,29715,1440815,28423,196391,3705,2207,4929,884,8995,3180,1355,1079,985,16366,8052,1198,412,9510,13534,1039,1166,13227,2214,1189,5026,2189,16336,1122,1017,3026,276,1052,907,189,4703,1361,8732,5498,453,null,858,432,14147,435,2445,47,3542,11760,197,364,3193,2862,7820,974,202,1403,509393000000,44626.306491622381,1.720519315773128E-2,0.1262252362865742,7.3]
[2012,141,"Oklahoma",3762311,2764,3107367,14635,531347,12812,108972,1030,1279,2974,5777,8950,4717,0,380,151,5011,2581,189,905,1100,1490,1088,7065,1354,2562,167,750,1233,1347,906,1850,5210,798,300,1101,549,1523,1244,1981,1961,308,1148,null,1261,494,0,569,108,2471,25508,2588,197,1749,1574,368,1061,45,0,160953000000,42780.35494673354,2.8964112748786585E-2,0.14122888830827648,5.4]
[2012,142,"Oregon",3857465,2984,3158450,19251,560673,17729,118925,373,2513,7954,165,31862,4472,381,0,696,1660,1032,2501,5093,1676,1380,834,556,202,227,446,457,760,570,1792,186,403,2192,570,5935,39,385,920,2379,1482,42,1411,725,null,904,177,461,119,802,3347,4793,367,676,21224,593,426,765,152,198702000000,51511.031208319451,3.0829832545467038E-2,0.14534752745650317,8.4]
[2012,143,"Pennsylvania",12630082,4558,11107110,28998,1252378,26347,215500,1926,1658,3529,573,7772,2574,3311,4814,2921,14631,4337,245,359,3749,1599,125,967,1233,694,988,17529,5900,2642,1169,55,1171,135,214,1600,1138,33791,1001,32898,6380,166,14319,378,234,null,771,3023,159,1273,6768,1276,1012,11960,1787,6762,1550,434,7847,600897000000,47576.650729583547,1.7062438707840535E-2,9.9158342756602846E-2,7.9]
[2012,144,"Rhode Island",1040527,1533,899551,9890,101165,8498,33446,20,0,93,0,2146,332,4170,0,313,2752,168,120,0,385,0,0,27,286,24,279,482,11253,230,131,0,210,0,188,25,611,1219,36,3603,478,0,63,0,139,735,null,481,0,120,823,0,53,1008,287,0,135,21,116,50956000000,48971.338562094017,3.2143327371610735E-2,9.722477167819768E-2,9.6999999999999993]
[2012,145,"South Carolina",4668886,3434,3929626,20572,564350,20053,156705,1665,1244,2222,839,5979,1915,1590,697,435,11552,18570,638,198,2125,3802,643,1064,1924,2709,2077,3565,2313,2966,757,1407,1884,93,158,1025,917,6517,1052,10746,24764,656,4388,555,255,6497,538,null,816,3550,5351,566,298,9377,1629,1345,832,0,1070,176217000000,37742.836299708324,3.3563680929455122E-2,0.12087465832320601,8.3000000000000007]
[2012,146,"South Dakota",821669,1036,676014,7752,115606,7423,26051,0,855,435,227,1494,1744,2,0,0,970,122,8,78,74,210,2441,403,0,0,0,60,61,892,3568,34,474,248,2175,135,0,0,175,371,240,1725,64,21,667,515,0,158,null,507,1715,388,5,340,1026,131,314,979,134,42464000000,51680.177784484993,3.1704980959486116E-2,0.14069655785967342,4]
[2012,147,"Tennessee",6378278,4412,5396833,24470,783077,21860,177098,12116,1281,2250,3306,8396,2473,936,176,180,15641,16012,1058,787,7094,5591,617,2630,13202,2452,1040,1743,1525,4507,1178,10568,2694,308,432,735,271,783,751,6279,5904,7,6200,2495,1080,3329,26,4300,0,null,8716,784,133,8008,1876,3248,1622,358,717,277036000000,43434.293707486569,2.7765801365196061E-2,0.12277247871604216,8.1]
[2012,148,"Texas",25711791,10124,21354247,60947,3656070,53747,507752,9993,6759,18908,13781,62702,16616,2769,181,1189,31259,20362,5040,2387,19672,8264,4934,12699,6040,29348,1293,4969,4813,9501,2803,6402,12319,1813,4794,8266,761,6797,16762,20274,22660,989,8728,26284,3827,10449,1763,4470,1264,10368,null,4610,113,17734,11630,1729,4192,2472,4435,1397369000000,54347.400381404783,1.9747826979458569E-2,0.14219429521654092,6.5]
[2012,149,"Utah",2805440,2571,2324019,16852,373980,16586,87870,126,2819,7966,361,15286,5350,142,0,0,2428,1142,1436,5129,1588,475,2791,398,217,345,380,613,1503,1670,385,284,1553,1057,489,5391,507,437,686,2129,842,175,1875,1338,4089,944,351,60,47,863,3605,null,39,1369,3529,0,1445,2216,239,130486000000,46511.777118740734,3.1321290065016542E-2,0.13330529257442683,4.9000000000000004]
[2012,150,"Vermont",620224,821,532237,5326,61242,5294,24431,16,93,127,0,1112,382,1626,0,116,966,56,6,0,230,68,30,0,1243,73,883,862,3318,284,315,0,23,147,0,17,2893,833,74,4780,328,0,214,11,26,935,341,124,39,193,493,81,null,728,98,0,151,96,0,27296000000,44009.906098441854,3.9390607264472188E-2,9.8741744917965127E-2,4.5999999999999996]
[2012,151,"Virginia",8085389,4754,6857430,25550,915242,24032,250653,2515,1906,2420,445,14780,5352,2725,2279,10964,19574,9535,3823,652,7089,2663,221,1144,3908,1638,1144,23925,3767,2982,2294,1344,1914,658,357,973,535,9073,947,15893,25575,852,5622,2810,1541,14190,1605,7936,35,6189,12944,2092,423,null,4160,3839,1258,143,516,445876000000,55145.893413415237,3.1000734782210233E-2,0.11319702737864561,5.7]
[2012,152,"Washington",6815763,3864,5648199,25225,904695,24285,215494,1507,4328,8362,1413,45597,5195,2901,100,773,9370,6363,5239,10604,4298,1089,1159,2544,1368,1646,532,1191,2911,3470,2703,615,2802,2919,682,5671,309,2300,872,5562,4088,217,3192,1223,25525,3397,97,2727,94,3206,14196,5298,223,3839,null,215,1168,394,1025,375730000000,55126.623387579646,3.1617003114691636E-2,0.13273568931314073,7.4]
[2012,153,"West Virginia",1837518,2090,1613322,11785,174112,11396,47125,477,306,79,0,1231,104,143,674,294,1919,1108,166,181,220,328,68,39,2249,90,35,5352,164,778,20,0,59,0,0,229,129,1213,81,1721,4683,175,6757,520,118,5208,0,1098,36,1061,622,0,54,6317,297,null,470,252,79,69380000000,37757.453260321803,2.5646007277207623E-2,9.4753901730486451E-2,7.1]
[2012,154,"Wisconsin",5660677,3351,4849945,15530,693737,15440,99192,323,236,3257,253,5347,1600,657,296,15,4937,970,333,360,22285,2480,4161,1160,635,598,233,1306,489,3917,18965,238,1263,784,324,1163,3,606,526,2033,2939,284,2610,289,945,1563,144,1053,329,1051,2765,900,62,1267,1208,0,null,30,975,261548000000,46204.367428136247,1.7522992391192784E-2,0.12255371574813401,6.9]
[2012,155,"Wyoming",569734,1083,459226,7512,77324,6960,31149,260,590,2014,244,2035,5599,0,0,0,733,166,0,745,905,179,259,539,4,88,0,294,548,965,290,136,244,1901,1216,355,0,121,604,231,459,338,819,964,893,230,0,122,1175,4,1427,1710,0,138,1323,0,282,null,16,38422000000,67438.488838651014,5.4672882432854633E-2,0.13571947610639351,5]
[2012,156,"Puerto Rico",3628402,2934,3366593,12125,238042,11523,20044,8,57,54,93,519,0,370,0,0,4192,232,110,0,1021,121,0,143,37,59,0,108,2258,435,0,0,0,0,0,0,0,1922,28,2314,638,0,328,0,0,2313,624,4,0,15,360,0,0,684,0,8,989,0,null,97147000000,26774.04543377498,5.524194948630279E-3,6.5605189281672763E-2,15.2]
[2010,157,"United States",305628607,29823,258552348,236128,38582885,213239,6743229,99221,94692,176768,64264,573988,140620,89360,30055,56052,427853,244992,49218,53122,277579,130170,66922,90681,92999,88131,32209,159866,144152,178207,104765,68363,148055,35870,43531,109409,38399,193972,50438,363139,207025,24450,188013,90616,100185,209810,24948,117569,27915,143135,411641,75541,18380,232002,166162,49349,111240,28186,59885,14388813000000,47079.405102939199,2.2063474575205588E-2,0.12624107860426823,9.4]
[2011,158,"United States",307900319,29996,261087925,263315,37998701,233440,6987416,106806,88850,211816,77226,562343,160623,91295,26631,49732,437202,248892,61940,57831,269008,143228,74516,94180,99256,86593,33729,165041,145869,186505,103253,68597,138404,31204,52809,115943,43277,216369,61431,377800,225147,26563,206049,81009,109795,215127,31065,121426,29383,154243,404839,73211,18172,229227,190644,45956,105370,31991,76218,14959778000000,48586.432286223127,2.2693760184119848E-2,0.12341234696804584,8.5]
[2012,159,"United States",310212755,25814,263612596,229733,37696597,211307,7070345,109210,84068,206842,64967,566986,161530,87023,25149,59513,428325,252262,61509,55191,277953,144597,73325,93134,103004,95956,38574,157664,158156,175733,115946,66947,142754,33832,48816,98882,38696,219202,63921,405864,238663,23959,199202,102572,108182,237156,30498,127418,22534,163843,402187,82165,20056,238540,180462,47425,97724,32228,74500,15566077000000,50178.713637999834,2.279192227282853E-2,0.12151852685747883,7.9]

{"sheet":"Raw_Data-2","index":5,"n_rows":55,"n_cols":16,"rows_kept":55,"cut":false,"hidden":false,"merged":[]}
[" Average Mean Temperature Index by month -  Climatology by state based on climate division data: 1971-2000"]
["http://www.esrl.noaa.gov/psd/data/usclimate/tmp.state.19712000.climo"]
["State","Jan","Feb","Mar","Apr","May","Jun","Jul","Aug","Sep","Oct","Nov","Dec  Ave","Average","Deg C","Notes"]
["Alabama",44.29,48.04,55.47,61.99,69.89,76.75,79.87,79.040000000000006,73.88,63.08,54.1,46.85,62.770833333333343,17.094907407407412]
["Alaska",15.2,19.100000000000001,25.1,36.1,47,54.8,58.45,56.45,48.3,34.65,22.05,16.600000000000001,36.15,2.3055555555555549,"http://gonw.about.com/library/climate/blanchorageclimate.htm"]
["Arizona",42.27,46.24,51.03,57.63,66.010000000000005,75.510000000000005,80.19,78.5,72.52,61.61,49.64,42.51,60.305,15.725]
["Arkansas",38.479999999999997,43.76,51.96,60.36,68.62,76.400000000000006,80.569999999999993,79.260000000000005,72.260000000000005,61.47,50.32,41.59,60.420833333333348,15.78935185185186]
["California",45.14,48.51,51.76,56.5,63.11,70.180000000000007,75.319999999999993,74.62,69.97,61.56,51.17,44.98,59.401666666666671,15.22314814814815]
["Colorado",23.71,28.34,35.57,43.06,52.5,62.15,67.599999999999994,65.75,57.72,46.64,33.51,25.2,45.145833333333336,7.3032407407407423]
["Connecticut",25.96,28.43,36.94,47.07,57.77,66.290000000000006,71.52,69.77,61.68,50.6,41.43,31.13,49.049166666666657,9.4717592592592545]
["Delaware",33.950000000000003,35.93,44.04,53.02,62.8,71.59,76.45,74.7,68.08,56.95,47.33,38.44,55.273333333333348,12.929629629629638]
["District of Columbia",32.24,34.869999999999997,43.26,52.69,62.35,70.8,75.44,73.77,67.010000000000005,55.7,45.72,36.76,54.217500000000001,12.343055555555555,"Used MD data"]
["Florida",58.09,59.99,64.900000000000006,69.290000000000006,75.36,79.98,81.599999999999994,81.44,79.42,72.66,66.010000000000005,59.99,70.727500000000006,21.515277777777779]
["Georgia",45.77,49.22,56.29,62.73,70.38,76.959999999999994,80.08,78.989999999999995,74.09,64,55.57,48.06,63.511666666666677,17.506481481481487]
["Hawaii",72.900000000000006,73,74.400000000000006,75.8,77.5,79.400000000000006,80.5,81.400000000000006,81,79.599999999999994,77.2,74.099999999999994,77.233333333333334,25.12962962962963,"http://www.climate-zone.com/climate/united-states/hawaii/honolulu/"]
["Idaho",23.6,28.36,35.869999999999997,43.49,51.56,59.35,66.239999999999995,65.37,56.16,45.51,32.81,24.32,44.386666666666663,6.8814814814814795]
["Illinois",24.58,30.06,40.72,51.68,62.36,71.55,75.430000000000007,73.22,65.790000000000006,54.2,41.51,29.75,51.737500000000004,10.96527777777778]
["Indiana",26.03,30.55,40.76,51.11,61.5,70.569999999999993,74.37,72.31,65.23,53.68,42.36,31.17,51.636666666666663,10.909259259259256]
["Iowa",17.84,24.15,35.979999999999997,48.53,60.23,69.739999999999995,73.760000000000005,71.33,62.92,50.95,35.61,22.62,47.805,8.780555555555555]
["Kansas",28.77,34.54,43.82,53.59,63.28,73.400000000000006,78.790000000000006,76.91,67.989999999999995,56.22,41.81,31.93,54.25416666666667,12.363425925925927]
["Kentucky",32.93,37.229999999999997,46.21,55.15,63.96,72.28,76.31,74.78,68.06,56.64,46.37,37.18,55.591666666666669,13.106481481481483]
["Louisiana",48.71,52.63,59.49,65.989999999999995,73.56,79.62,82.08,81.61,76.91,67.03,58.16,50.95,66.394999999999996,19.108333333333331]
["Maine",13.58,16.68,27.02,39.1,51.26,60.79,66.08,64.19,55.13,43.99,33.479999999999997,20.36,40.971666666666671,4.9842592592592618]
["Maryland",32.24,34.869999999999997,43.26,52.69,62.35,70.8,75.44,73.77,67.010000000000005,55.7,45.72,36.76,54.217500000000001,12.343055555555555]
["Massachusetts",24.87,27.21,35.51,45.43,56.16,64.95,70.37,68.63,60.54,49.69,40.71,30.24,47.859166666666674,8.810648148148152]
["Michigan",18.87,21.37,30.73,42.57,54.48,63.56,68.319999999999993,66.52,58.61,47.58,35.72,24.57,44.408333333333331,6.8935185185185173]
["Minnesota",7.94,15.27,27.55,42.45,55.75,64.67,69.08,66.819999999999993,57.15,45.19,28.27,13.77,41.159166666666657,5.0884259259259208]
["Mississippi",44.21,48.46,55.94,62.9,70.86,77.73,80.73,79.86,74.47,63.7,54.4,46.9,63.346666666666671,17.414814814814818]
["Missouri",28.83,34.58,44.5,54.7,63.93,72.739999999999995,77.540000000000006,75.72,67.55,56.33,43.98,33.01,54.450833333333343,12.47268518518519]
["Montana",18.37,24.44,32.86,42.53,52.18,60.58,66.430000000000007,65.64,55.09,44.26,29.67,20.86,42.7425,5.968055555555555]
["Nebraska",22.73,28.54,37.590000000000003,48.14,58.73,68.87,74.260000000000005,72.2,62.64,50.49,35.380000000000003,25.64,48.767499999999991,9.3152777777777729]
["Nevada",30.43,35.46,41.18,47.26,55.66,64.88,71.94,70.209999999999994,61.61,50.55,38.409999999999997,30.9,49.87416666666666,9.9300925925925885]
["New Hampshire",18.170000000000002,21.06,30.79,42.15,54.1,62.98,67.83,65.67,57.05,45.9,35.85,24.12,43.805833333333332,6.5587962962962951]
["New Jersey",30.62,32.9,40.99,50.44,60.49,69.3,74.47,72.680000000000007,65.48,54.13,44.91,35.380000000000003,52.649166666666673,11.471759259259263]
["New Mexico",34.39,38.92,44.87,51.79,60.66,69.680000000000007,73.209999999999994,71.3,64.760000000000005,54.31,42.44,34.94,53.439166666666665,11.910648148148146]
["New York",20.65,22.72,31.93,43.51,55.33,63.95,68.66,66.75,58.85,47.76,37.590000000000003,26.48,45.348333333333336,7.4157407407407421]
["North Carolina",39.97,42.95,50.3,58.26,66.14,73.5,77.489999999999995,75.959999999999994,70.239999999999995,59.47,50.88,42.91,59.005833333333328,15.003240740740738]
["North Dakota",7.9,15.4,26.87,41.71,54.8,63.73,68.7,67.23,56.14,43.62,26.08,13.02,40.43333333333333,4.6851851851851833]
["Ohio",26.5,29.92,39.549999999999997,49.67,59.99,68.790000000000006,72.78,70.92,63.99,52.54,41.9,31.61,50.680000000000007,10.377777777777782]
["Oklahoma",36.11,41.71,50.21,59.07,67.849999999999994,76.53,81.62,80.45,72.37,61.3,48.28,38.96,59.538333333333334,15.299074074074074]
["Oregon",32.630000000000003,36.68,41.47,46.35,52.95,59.66,66.03,65.55,58.56,49.24,38.96,32.78,48.405000000000001,9.1138888888888889]
["Pennsylvania",25.78,28.29,37.020000000000003,47.48,57.74,66.17,70.58,68.92,61.62,50.34,40.65,30.7,48.774166666666673,9.3189814814814849]
["Rhode Island",29.1,30.8,37.909999999999997,46.71,56.5,65.27,71.09,70.040000000000006,62.81,52.56,43.83,34.21,50.069166666666668,10.038425925925926]
["South Carolina",44.12,47.35,54.54,61.8,69.59,76.45,80.08,78.58,73.19,62.7,54.2,46.45,62.420833333333348,16.900462962962973]
["South Dakota",16.11,22.53,32.6,45.02,56.79,66.47,72.47,70.75,60.35,47.57,31.15,19.84,45.13750000000001,7.298611111111116]
["Tennessee",36.32,40.58,49.02,57.23,65.53,73.44,77.290000000000006,75.87,69.45,58.1,48.29,39.76,57.573333333333331,14.207407407407405]
["Texas",45.63,50.28,57.71,64.84,72.61,79.34,82.3,81.41,75.47,66.010000000000005,55.11,47.28,64.832499999999996,18.240277777777774]
["Utah",25.93,31.48,39.67,46.89,55.93,65.680000000000007,72.510000000000005,70.67,61.53,49.61,36.380000000000003,27.34,48.635000000000012,9.2416666666666725]
["Vermont",16.41,18.87,29.1,41.4,54.04,62.69,67.38,65.12,56.56,45.31,34.97,22.71,42.88,6.0444444444444461]
["Virginia",34.479999999999997,37.549999999999997,45.4,54.3,62.74,70.81,75.099999999999994,73.5,67.040000000000006,55.76,46.61,38.090000000000003,55.115000000000002,12.841666666666667]
["Washington",31.47,35.75,41.51,47.4,54.15,60.09,65.73,65.81,58.76,48.5,38.270000000000003,31.74,48.265000000000008,9.036111111111115]
["West Virginia",30.21,33.36,41.82,50.92,59.85,67.83,71.95,70.55,63.92,52.7,43.13,34.36,51.716666666666669,10.953703703703704]
["Wisconsin",13.18,18.97,30.09,43.17,55.46,64.47,69.11,66.86,58.11,46.63,32.35,18.98,43.115000000000002,6.1750000000000007]
["Wyoming",19.18,23.72,32.06,40.42,50.01,59.62,66.25,64.709999999999994,54.64,43.39,29.18,20.64,41.984999999999992,5.5472222222222181]
["Puerto Rico",76.5,77,78,79.5,80.5,82.5,82,82.5,82.5,81.5,80,78,80.041666666666671,26.689814814814817,"http://www.topuertorico.org/reference/tempera.shtml"]

{"sheet":"Help","index":6,"n_rows":124,"n_cols":3,"rows_kept":124,"cut":false,"hidden":false,"merged":[]}
[]
[]
[0,"General Notes"]
[null,"Map - Contains the map"]
[null,"Model - Contains the controls to customize the map and dashboard"]
[null,"Map_Data - Enter map data here"]
[null,"Sample_Palette - Contains the color schemes available to use with the map"]
[null,"Raw_Data-1/2 - contains raw data"]
[null,"See the 'Data' worksheet for help on entering data for visualization."]
[]
[null,"Below are detailed directions for using the 'Model' worksheet"]
[]
[]
[1,"Data selection"]
[null,"This control is a copy of the control on the 'Map' worksheet. Any changes made with this control  "]
[null,null,"will be reflected on the 'Map' worksheet dropdown control as well.  Use this to select "]
[null,null,"the dataset to analyze using the histogram and min-max-median plot."]
[null,"Use the 'Autoscale' option to automatically use min/max from data to set the classes.  If 'Autoscale'"]
[null,null,"is used, the correct number of levels and color scheme must be selected first (see"]
[null,null,"section 3 and 6 below."]
[]
[]
[]
[]
[]
[2,"Map Data Summary"]
[null,"No user intervention is needed.  These cells show values that characterize the dataset."]
[null,"This data also serves as the source for the min-max-median plot."]
[]
[]
[]
[]
[]
[]
[]
[3,"Scale Options' Section"]
[null,"Use this section to set the scale for the map, i.e. define the levels. "]
[null,"Select the number of levels and how the Min/Max will be obtained.  "]
[null,"Either allow min/max to be picked from the data or select the option to enter the min and max manually."]
[null,"Once minimum and maximum has been set click 'Set Scale'.  "]
[null,"This will automatically create the Levels/Classes and calculate the  Necessary start and end values. "]
[null,"The 'Class Name and Freq' table simply identifies how many values in the dataset will fall into "]
[null,null,"each class.  The table resizes based on the number of levels selected."]
[]
[]
[]
[]
[]
[]
[]
[]
[]
[]
[]
[]
[4,"Palette Section"]
[null,"Color scheme for the map can be selected in this section"]
[null,null,"Select the color scheme and click 'Set Colors'."]
[null,"In the current version of this workbook 3 sequential color schemes"]
[null,null,"with a maximum of 9 levels each are available. "]
[null,"Click the 'View' button on the 'Map' sheet to refresh the chart with the selected colors."]
[]
[]
[]
[]
[]
[]
[]
[]
[]
[]
[5,"Color Table Section"]
[null,"Use this section to set colors for the map.  The 'Class Start' and 'Class End' colums are available"]
[null,null,"for editing even when the worksheet is locked so classes can be entered manually."]
[null,null,"  Similarly the 'Color' column can be filled even when the worksheet is locked."]
[null,"Once the classes have been set (see Section 3 above), there are 3 ways to set the colors:"]
[null,null,"(i) Built in palette (Section 4) (ii) Manually filling the colors in the color column"]
[null,null,"(iii) Manually entering/copying-pasting RGB values in the RGB columns."]
[null,"If the 'Color' column has been manually filled, use the 'Get RGB' button to get the RGB "]
[null,null,"values for the filled cells.  "]
[null,"Otherwise copy/paste or manually enter desired RGB values if you have very specific "]
[null,null,"requirements.  After this the 'Set RGB' button can be used to fill the 'Color' column"]
[null,null,"according to these values. Entries into the Red/Green/Blue columns have been"]
[null,null,"limited to whole numbers between 0 and 256."]
[null,"In this version a maximum of 9 levels can be set for the data/colors."]
[]
[]
[]
[]
[]
[]
[]
[]
[]
[]
[]
[]
[]
[]
[]
[]
[5,"Data Charts Section"]
[null,"No user input is required in this section.  The histogram provides a chart version of"]
[null,null,"the frequency table indicating how many values from the dataset fall into each class."]
[null,null,"This chart is present to enable selection of a scale that will distribute the data appropriately."]
[null,"The 'Min - Median - Max\n' plot shows these value to give an idea of the data distribution."]
[]
[]
[]
[]
[]
[]
[]
[]
[]
[]
[]
[]
[]
[7,"Selected Data Section"]
[null,"No user input is required in this section.  This table is used by the"]
[null,null,"bar chart on the 'Map' worksheet. Most cells are locked to protect formulas."]
[null,null,"Some cells remain unlocked when the worksheet is protected and are "]
[null,null,"populated by a macro."]