{"text_format":"1","workbook":"xlsx","n_sheets":7,"sheets":["Map","Model","Map_Data","Sample_Palette","Raw_Data-1","Raw_Data-2","Help"],"not_rendered":{"charts":6,"images":24,"macros":1,"external_links":0,"defined_names":21,"comments":3,"pivot_tables":0},"unopened":[],"bounds":{"document_bytes":16777216,"sheet_cells":100000,"rows_first":2000,"rows_last":500,"rows_between":2000,"halvings":0,"cell_chars":16384,"cell_head_chars":4096},"cells_cut":0,"cells_raw":0,"read":"whole","date_system":"1900"}

{"sheet":"Map","index":0,"n_rows":58,"n_cols":63,"rows_kept":58,"cut":false,"hidden":false,"merged":[[54,20,54,23],[54,34,54,37],[5,44,5,51],[2,9,2,10],[54,6,54,9],[57,6,57,9],[56,54,57,54],[53,10,54,15],[53,24,54,29],[53,38,54,43],[56,10,57,15],[56,24,57,29],[54,16,54,19],[54,30,54,33],[54,44,54,47],[57,16,57,19],[57,30,57,33],[57,20,57,23]]}
[]
[null,"US Migration Data by State (2010 - 2012)",null,null,null,null,null,null,null,null,null,null,null,null,null,null,null,null,null,null,null,null,null,null,null,null,null,null,null,null,null,null,null,null,null,null,null,null,null,null,null,null,null,null,null,null,null,null,null,null,null,null,null,null,null,{"$f":"Model!C4","v":"Migration in 2011"},null,"n  Influx","Gross State Product"]
[null,null,null,null,null,null,null,null,null,"to",null,null,null,null,null,null,null,null,null,null,null,null,null,null,null,null,null,null,null,null,null,null,null,null,null,null,null,null,null,null,null,null,null,null,null,null,null,null,null,null,null,null,null,null,null,"by State (Thousands)",null,"u Outflow","($ Billion)",null,null,null,"HELP"]
[]
[null,null,null,null,null,null,null,null,null,null,null,null,null,null,null,null,null,null,null,null,null,null,null,null,null,null,null,null,"Click a state to ",null,null,null,null,null,null,null,null,null,null,null,null,null,null,null,null,null,null,null,null,null,null,{"$f":"\"US Population \" & RIGHT(Model!$C$4,4)","v":"US Population 2011"},null,null,1,null,null,null,null,null,1,null,"Please go to the 'Help' worksheet for more information "]
[null,null,null,null,null,null,null,null,null,null,null,null,null,null,null,null,null,null,null,null,null,null,null,null,null,null,null,null,"highlight below",null,null,null,null,null,null,null,null,null,null,null,null,null,null,null,{"$f":"OFFSET(Model!$AM$11,0,Model!$B$4,1,1)","v":307900319},null,null,null,null,null,null,null,null,null,2,null,null,null,null,null,2,null,"on using this workbook."]
[null,null,null,null,null,null,null,null,null,null,null,null,null,null,null,null,null,null,null,null,null,null,null,null,null,null,null,null,null,null,null,null,null,null,null,null,null,null,null,null,null,null,null,null,null,null,null,null,null,null,null,null,null,null,3,null,null,null,null,null,3]
[null,null,null,null,null,null,null,null,null,null,null,null,null,null,null,null,null,null,null,null,null,null,null,null,null,null,null,null,null,null,null,null,null,null,null,null,null,null,null,null,null,null,null,null,null,null,null,null,null,null,null,"Mouse over ",null,null,4,null,null,null,null,null,4]
[null,null,null,null,null,null,null,null,null,null,null,null,null,null,null,null,null,null,null,null,null,null,null,null,null,null,null,null,null,null,null,null,null,null,null,null,null,null,null,null,null,null,null,null,null,null,null,null,null,null,null,"for State Codes ",null,null,5,null,null,null,null,null,5]
[null,null,null,null,null,null,null,null,null,null,null,null,null,null,null,null,null,null,null,null,null,null,null,null,null,null,null,null,null,null,null,null,null,null,null,null,null,null,null,null,null,null,null,null,null,null,null,null,null,null,null,null,null,null,6,null,null,null,null,null,6]
{"$rows_left_out":49}
{"sheet":"Model","index":1,"n_rows":56,"n_cols":42,"rows_kept":56,"cut":false,"hidden":false,"merged":[]}
[]
[]
[null,"Selected Dataset",null,null,null,true,null,null,null,null,null,"Scale Options",null,null,null,null,"Palette",null,null,null,"Selected Data",null,null,null,null,null,null,null,null,"Chart Data",null,null,null,null,null,null,null,null,"Sparkline & Table Data"]
[null,{"$f":"IFERROR(MATCH($C$4,MapDatasetNames,0),0)","v":2},"Migration in 2011",null,null,null,null,null,null,null,null,null,"Freq","Class Name","Freq.",null,"Colors",null,null,null,"#","Data","Sort Order","State Code","Data 2","State Code","Data 2","ER %",null,"#","Bullet Index","Influx","Sort Order","State","Sorted Data","Outflow ","GSP $",null,null,2010,2011,2012]
[null,{"$f":"IFERROR(MATCH($C$5,State_Names,0),0)","v":36},"Ohio",null,{"$f":"OFFSET(Map_Data!E1,MATCH(Model!C5,State_Names,0),0,1,1)","v":"OH"},null,null,null,null,null,null,null,{"$f":"FREQUENCY(ActiveDataSet,ClassEnd)","v":30},{"$f":"E16:E24","v":"Class1"},{"$f":"IF(ISERROR(M5),\"\",M5)","v":30},null,null,"GnBu",null,null,1,{"$f":"ActiveDataSet","v":1567},{"$f":"RANK(V5,$V$5:$V$56,0)+COUNTIF($V$5:V5,V5)-1","v":32},{"$f":"OFFSET(Map_Data!$E$1,MATCH(Model!U5,Model!$W$5:$W$56,0),0,1,1)","v":"FL"},{"$f":"LARGE(ActiveDataSet,U5)","v":16492},null,null,{"$f":"OFFSET(Map_Data!$U$1,MATCH(X5,Map_Data!$E$2:$E$53,0),$B$4,1,1)","v":9.5},null,1,0.5,{"$f":"Influx","v":117726},{"$f":"RANK(AF5,$AF$5:$AF$56,0)+COUNTIF($AF$5:AF5,AF5)-1","v":23},{"$f":"OFFSET(Map_Data!$D$1,MATCH(Model!AD5,Model!$AG$5:$AG$56,0),0,1,1)","v":"Texas"},{"$f":"LARGE($AF$5:$AF$56,AD5)","v":514726},{"$f":"OFFSET(Map_Data!$N$1,MATCH(AH5,Map_Data!$D$2:$D$53,0),Model!$B$4,1,1)","v":404839},{"$f":"OFFSET(Map_Data!$H$1,MATCH(AH5,Map_Data!$D$2:$D$53,0),Model!$B$4,1,1)","v":1321005000000},null,"GSP $",{"$f":"OFFSET(Map_Data!$E$1,MATCH(Model!$C$5,State_Names,0),4,1,3)","v":465679000000},490265000000,509393000000]
[null,null,null,null,null,null,null,null,null,null,null,null,6,"Class2",6,null,null,"BuGn",null,null,2,1637,{"$f":"RANK(V6,$V$5:$V$56,0)+COUNTIF($V$5:V6,V6)-1","v":30},{"$f":"OFFSET(Map_Data!$E$1,MATCH(Model!U6,Model!$W$5:$W$56,0),0,1,1)","v":"MI"},{"$f":"LARGE(ActiveDataSet,U6)","v":14330},null,null,{"$f":"OFFSET(Map_Data!$U$1,MATCH(X6,Map_Data!$E$2:$E$53,0),$B$4,1,1)","v":9.4},null,2,1.5,35084,{"$f":"RANK(AF6,$AF$5:$AF$56,0)+COUNTIF($AF$5:AF6,AF6)-1","v":43},{"$f":"OFFSET(Map_Data!$D$1,MATCH(Model!AD6,Model!$AG$5:$AG$56,0),0,1,1)","v":"Florida"},{"$f":"LARGE($AF$5:$AF$56,AD6)","v":498597},{"$f":"OFFSET(Map_Data!$N$1,MATCH(AH6,Map_Data!$D$2:$D$53,0),Model!$B$4,1,1)","v":437202},{"$f":"OFFSET(Map_Data!$H$1,MATCH(AH6,Map_Data!$D$2:$D$53,0),Model!$B$4,1,1)","v":746439000000},null,"Influx",{"$f":"OFFSET(Map_Data!$E$1,MATCH(Model!$C$5,State_Names,0),7,1,3)","v":172633},191778,196391]
[null,"Map Data Summary",null,null,null,null,null,null,null,null,null,null,4,"Class3",4,null,null,"YlOrRd",null,null,3,6763,{"$f":"RANK(V7,$V$5:$V$56,0)+COUNTIF($V$5:V7,V7)-1","v":11},{"$f":"OFFSET(Map_Data!$E$1,MATCH(Model!U7,Model!$W$5:$W$56,0),0,1,1)","v":"PA"},14292,null,null,{"$f":"OFFSET(Map_Data!$U$1,MATCH(X7,Map_Data!$E$2:$E$53,0),$B$4,1,1)","v":7.8},null,3,2.5,222877,{"$f":"RANK(AF7,$AF$5:$AF$56,0)+COUNTIF($AF$5:AF7,AF7)-1","v":9},{"$f":"OFFSET(Map_Data!$D$1,MATCH(Model!AD7,Model!$AG$5:$AG$56,0),0,1,1)","v":"California"},468428,{"$f":"OFFSET(Map_Data!$N$1,MATCH(AH7,Map_Data!$D$2:$D$53,0),Model!$B$4,1,1)","v":562343},{"$f":"OFFSET(Map_Data!$H$1,MATCH(AH7,Map_Data!$D$2:$D$53,0),Model!$B$4,1,1)","v":1908985000000},null,"Outflow",{"$f":"OFFSET(Map_Data!$E$1,MATCH(Model!$C$5,State_Names,0),10,1,3)","v":188013},206049,199202]
[null,null,null,"Minimum Value",{"$f":"IFERROR(MIN(ActiveDataSet),\"\")","v":0},{"$f":"OFFSET(Map_Data!E1,0,Model!B4,1,1)","v":2011},null,null,null,null,null,null,4,"Class4",4,null,null,null,null,null,4,1952,{"$f":"RANK(V8,$V$5:$V$56,0)+COUNTIF($V$5:V8,V8)-1","v":26},{"$f":"OFFSET(Map_Data!$E$1,MATCH(Model!U8,Model!$W$5:$W$56,0),0,1,1)","v":"KY"},12744,null,null,{"$f":"OFFSET(Map_Data!$U$1,MATCH(X8,Map_Data!$E$2:$E$53,0),$B$4,1,1)","v":8.6999999999999993},null,4,3.5,69845,{"$f":"RANK(AF8,$AF$5:$AF$56,0)+COUNTIF($AF$5:AF8,AF8)-1","v":34},{"$f":"OFFSET(Map_Data!$D$1,MATCH(Model!AD8,Model!$AG$5:$AG$56,0),0,1,1)","v":"New York"},282209,{"$f":"OFFSET(Map_Data!$N$1,MATCH(AH8,Map_Data!$D$2:$D$53,0),Model!$B$4,1,1)","v":377800},{"$f":"OFFSET(Map_Data!$H$1,MATCH(AH8,Map_Data!$D$2:$D$53,0),Model!$B$4,1,1)","v":1169436000000},null,"State Pop",{"$f":"OFFSET('Raw_Data-1'!$D$3,MATCH(Model!$C$5,'Raw_Data-1'!C4:C55,0),0,1,1)","v":11405101},{"$f":"OFFSET('Raw_Data-1'!$A$55,MATCH(Model!$C$5,'Raw_Data-1'!C4:C55,0),3,1,1)","v":11418944},{"$f":"OFFSET('Raw_Data-1'!$A$107,MATCH(Model!$C$5,'Raw_Data-1'!C4:C55,0),3,1,1)","v":11414635}]
[null,null,null,"Maximum Value",{"$f":"IFERROR(MAX(ActiveDataSet),\"\")","v":16492},{"$f":"OFFSET(Map_Data!E1,0,Model!B4,1,1)","v":2011},null,null,null,null,null,null,2,"Class5",2,null,"YlOrRd",{"$f":"MATCH(Q9,R5:R7,0)","v":3},null,null,5,9032,{"$f":"RANK(V9,$V$5:$V$56,0)+COUNTIF($V$5:V9,V9)-1","v":7},{"$f":"OFFSET(Map_Data!$E$1,MATCH(Model!U9,Model!$W$5:$W$56,0),0,1,1)","v":"TX"},11987,null,null,{"$f":"OFFSET(Map_Data!$U$1,MATCH(X9,Map_Data!$E$2:$E$53,0),$B$4,1,1)","v":7.4},null,5,4.5,468428,{"$f":"RANK(AF9,$AF$5:$AF$56,0)+COUNTIF($AF$5:AF9,AF9)-1","v":3},{"$f":"OFFSET(Map_Data!$D$1,MATCH(Model!AD9,Model!$AG$5:$AG$56,0),0,1,1)","v":"Georgia"},271077,{"$f":"OFFSET(Map_Data!$N$1,MATCH(AH9,Map_Data!$D$2:$D$53,0),Model!$B$4,1,1)","v":248892},{"$f":"OFFSET(Map_Data!$H$1,MATCH(AH9,Map_Data!$D$2:$D$53,0),Model!$B$4,1,1)","v":417438000000},null,"State Migration",{"$f":"OFFSET(Map_Data!$E$1,MATCH(Model!$C$5,State_Names,0),14,1,3)","v":12.743429453189412},12.485471511201036,12.622523628657421]
[null,null,null,"Median",{"$f":"IFERROR(MEDIAN(ActiveDataSet),\"\")","v":1912},{"$f":"OFFSET(Map_Data!E1,0,Model!B4,1,1)","v":2011},null,null,null,null,null,null,2,"Class6",2,null,null,null,null,null,6,2690,{"$f":"RANK(V10,$V$5:$V$56,0)+COUNTIF($V$5:V10,V10)-1","v":19},{"$f":"OFFSET(Map_Data!$E$1,MATCH(Model!U10,Model!$W$5:$W$56,0),0,1,1)","v":"IN"},11588,null,null,{"$f":"OFFSET(Map_Data!$U$1,MATCH(X10,Map_Data!$E$2:$E$53,0),$B$4,1,1)","v":8.5},null,6,5.5,202124,{"$f":"RANK(AF10,$AF$5:$AF$56,0)+COUNTIF($AF$5:AF10,AF10)-1","v":12},{"$f":"OFFSET(Map_Data!$D$1,MATCH(Model!AD10,Model!$AG$5:$AG$56,0),0,1,1)","v":"North Carolina"},265291,{"$f":"OFFSET(Map_Data!$N$1,MATCH(AH10,Map_Data!$D$2:$D$53,0),Model!$B$4,1,1)","v":225147},{"$f":"OFFSET(Map_Data!$H$1,MATCH(AH10,Map_Data!$D$2:$D$53,0),Model!$B$4,1,1)","v":436144000000},null,"US Migration",2.2063474575205588,2.2693760184119847,2.2791922272828531]
{"$rows_left_out":47}
{"sheet":"Map_Data","index":2,"n_rows":54,"n_cols":26,"rows_kept":54,"cut":false,"hidden":false,"merged":[]}
["Dataset ID #","Dataset Name","State ID #","State Name","State Code",2010,2011,2012,"GSP 2010","GSP 2011","GSP 2012","Influx 2010","Influx 2011","Influx 2012","Outflow 2010","Outflow 2011","Outflow 2012","Deg C","Internal 2010","Internal 2011","Internal 2012","ER % 2010","ER % 2011","ER % 2012"]
[1,"Migration in 2010",1,"Alabama","AL",{"$f":"TRANSPOSE(OFFSET('Raw_Data-1'!$J$3,Model!$B$5,1,1,52))","v":1289},{"$f":"TRANSPOSE(OFFSET('Raw_Data-1'!$J$3,52+Model!$B$5,1,1,52))","v":1567},{"$f":"TRANSPOSE(OFFSET('Raw_Data-1'!$J$3,104+Model!$B$5,1,1,52))","v":3705},172842000000,178533000000,183547000000,108723,117726,104600,99221,106806,109210,17.094907407407412,13.119015102836256,12.397440149976461,12.390280638095486,8.9,7.3,6.8,null,"HELP"]
[2,"Migration in 2011",2,"Alaska","AK",1556,1637,2207,47910000000,51237000000,51859000000,36326,35084,33415,94692,88850,84068,2.3055555555555549,13.638911254185787,14.085021391591123,12.564442460058848,7.8,7.4,6.6]
[3,"Migration in 2012",3,"Arizona","AZ",4715,6763,4929,247329000000,255989000000,266891000000,222725,222877,232457,176768,211816,206842,15.725,15.822277904227303,16.062443799502709,14.744206401483281,10,8.6999999999999993,8.1]
[4,"GSP 2010",4,"Arkansas","AR",434,1952,884,103170000000,106557000000,109557000000,79127,69845,76948,64264,77226,64967,15.78935185185186,14.298944986400326,13.962242210228196,12.807654805883242,8.1,7.6,7.5]
[5,"GSP 2011",5,"California","CA",8997,9032,8995,1845249000000,1908985000000,2003479000000,444749,468428,493641,573988,562343,566986,15.22314814814815,14.667015571220436,14.161173465272972,13.431595003803023,12.2,11.2,9.6999999999999993]
[6,"GSP 2012",6,"Colorado","CO",2859,2690,3180,254551000000,264733000000,274048000000,186366,202124,205060,140620,160623,161530,7.3032407407407423,14.542609643979079,15.118185943666196,14.674652962639717,9,8.3000000000000007,7.3]
[7,"Influx 2010",7,"Connecticut","CT",1307,1189,1355,221767000000,225409000000,229317000000,77333,71502,80311,89360,91295,87023,9.4717592592592545,9.6834188706142026,8.9296347050878531,9.4201954873810188,9.4,8.3000000000000007,8.1]
[8,"Influx 2011",8,"Delaware","DE",15,263,1079,62832000000,64377000000,65984000000,30759,33912,34757,30055,26631,25149,12.929629629629638,10.114608479094461,9.2685248448762643,9.4865736573657369,7.7,7.2,7]
[9,"Influx 2012",9,"District of Columbia","DC",972,587,985,103745000000,107201000000,109793000000,51244,48066,53830,56052,49732,59513,12.343055555555555,10.685600430333123,10.876084027677859,9.9211486972010743,10.1,9.6999999999999993,8.6999999999999993]
{"$rows_left_out":45}
{"sheet":"Sample_Palette","index":3,"n_rows":135,"n_cols":12,"rows_kept":135,"cut":false,"hidden":false,"merged":[]}
[]
[null,"Sample Color Palette"]
[null,"ColorName","NumOfColors","ColorNum","ColorLetter","R","G","B","Sample",null,null,"Apache-Style Software License for ColorBrewer software and ColorBrewer Color Schemes"]
[null,"GnBu",2,1,"C",224,243,219]
[null,null,null,2,"I",67,162,202,null,null,null,"Copyright (c) 2002 Cynthia Brewer, Mark Harrower, and The Pennsylvania State University."]
[null,null,3,1,"C",224,243,219]
[null,null,null,2,"F",168,221,181,null,null,null,"Licensed under the Apache License, Version 2.0 (the \"License\"); you may not use this file except in compliance with the License."]
[null,null,null,3,"I",67,162,202,null,null,null,"You may obtain a copy of the License at"]
[null,null,4,1,"B",240,249,232]
[null,null,null,2,"E",186,228,188,null,null,null,"       http://www.apache.org/licenses/LICENSE-2.0"]
{"$rows_left_out":126}
{"sheet":"Raw_Data-1","index":4,"n_rows":162,"n_cols":69,"rows_kept":162,"cut":false,"hidden":false,"merged":[[0,3,1,4],[0,5,1,6],[0,7,1,8]]}
[null,null,null,"Population 1 year and over",null,"Same residence 1 year ago",null,"Different residence, same state 1 year ago",null,1,2,3,4,5,6,7,8,9,10,11,12,13,14,15,16,17,18,19,20,21,22,23,24,25,26,27,28,29,30,31,32,33,34,35,36,37,38,39,40,41,42,43,44,45,46,47,48,49,50,51,52,53]
[null,null,null,null,null,null,null,null,null,"State of Residence Last year (Estimate)"]
["Year","#","Current residence in --","Estimate","MOE","Estimate","MOE","Estimate","MOE","TOTAL","Alabama","Alaska","Arizona","Arkansas","California","Colorado","Connecticut","Delaware","District of Columbia ","Florida","Georgia","Hawaii","Idaho","Illinois","Indiana","Iowa","Kansas","Kentucky","Louisiana","Maine","Maryland","Massachusetts","Michigan","Minnesota","Mississippi","Missouri","Montana","Nebraska","Nevada","New Hampshire","New Jersey","New Mexico","New York","North Carolina","North Dakota","Ohio","Oklahoma","Oregon","Pennsylvania","Rhode Island","South Carolina","South Dakota","Tennessee","Texas","Utah","Vermont","Virginia","Washington","West Virginia","Wisconsin","Wyoming","Puerto Rico","GSP $ ","Per capita income","External Migration \nto State % of pop","Internal Migration within State % of pop","Unemployment Rate %",null,"GDP Data Sources"]
[2010,1,"Alabama",4729509,3716,3987155,21708,620465,21448,108723,null,3013,676,1481,3827,1278,454,811,211,15062,21644,267,304,2503,3945,669,649,1967,1901,97,716,435,2334,386,7233,1373,229,169,265,0,356,650,3686,2371,169,2222,880,485,1477,0,2368,31,7409,6500,1336,0,2490,1171,41,1155,27,228,172842000000,{"$f":"BK4/D4","v":36545.442666458614},{"$f":"J4/D4","v":2.2988221398880942E-2},{"$f":"H4/D4","v":0.13119015102836257},8.9,null,"http://www.bea.gov/newsreleases/regional/gdp_state/gsp_newsrelease.htm"]
[2010,2,"Alaska",702974,1600,565031,7596,95878,7984,36326,477,null,1354,47,3906,1930,0,0,14,2315,1251,1705,895,388,9,262,106,1440,100,574,704,107,923,530,263,0,616,215,240,316,413,421,255,698,69,156,1455,1793,126,0,121,531,477,4123,1274,353,714,2421,0,158,81,19,47910000000,{"$f":"BK5/D5","v":68153.30296710832},{"$f":"J5/D5","v":5.1674741882345575E-2},{"$f":"H5/D5","v":0.13638911254185787},7.8,null,"https://www.google.com/publicdata/explore?ds=d5bncppjof8f9_&met_y=ny_gdp_mktp_cd&hl=en&dl=en&idim=country:PRI:CRI:DOM"]
[2010,3,"Arizona",6332786,4439,5069002,35057,1001991,32027,222725,416,3109,null,689,47164,7687,479,738,0,7712,4261,1966,2147,12250,2690,3008,1935,1705,2014,241,1284,1449,6354,5421,272,4567,1343,1750,10342,64,1782,4419,6618,4463,826,5225,2910,5430,5535,403,2310,1351,3061,14705,7164,664,3413,12645,595,5556,593,599,247329000000,39055.322570508462,3.517014470408443E-2,0.15822277904227303,10,null,"2012 data for GSP/GDP is calculated/forecast (except for PR)"]
[2010,4,"Arkansas",2888304,2453,2387806,18627,412997,17485,79127,1405,934,777,null,4457,2535,451,0,154,3578,3921,129,618,3221,722,85,3611,2540,4012,0,306,190,1506,222,2764,7320,85,394,67,0,77,0,289,1561,0,1137,8607,239,731,0,1496,243,2653,13707,361,0,494,264,0,821,443,87,103170000000,35719.924218503314,2.7395661952481457E-2,0.14298944986400325,8.1]
[2010,5,"California",36907897,10889,30790221,71574,5413287,66460,444749,3364,9579,33854,4172,null,15662,4631,643,3683,20362,8820,9528,5719,16482,6550,3163,3857,3394,2989,1796,10626,11969,10435,5095,2757,6921,3009,3062,27724,1614,10108,4632,20981,9593,392,8170,5708,20913,9948,526,5016,1604,4349,36582,10653,525,14232,30544,1446,6031,1336,1223,1845249000000,49996.048271187057,1.2050239546295471E-2,0.14667015571220435,12.2,null,"Unemployment data"]
[2010,6,"Colorado",4988190,3936,4042039,25546,725413,23003,186366,954,2225,12287,1034,26089,null,459,486,479,8849,6445,2355,839,6950,3296,2140,4308,1961,968,532,1532,2242,4587,2878,1277,1978,2042,4065,4131,791,1259,3921,4594,2940,802,2838,3464,4330,3928,192,1231,1847,1628,22253,4748,350,2739,7583,623,2499,4418,874,254551000000,51030.734595113659,3.7361447739560842E-2,0.14542609643979079,9,null,"http://data.bls.gov/map/MapToolServlet?survey=la"]
[2010,7,"Connecticut",3541146,2779,3100742,16358,342904,15404,77333,896,0,664,334,4479,547,null,149,331,9207,748,182,147,3391,1074,108,0,400,0,528,1531,8510,770,934,67,42,0,0,507,1049,3475,112,20727,1345,0,1296,145,640,1955,1728,1140,0,430,1887,0,458,1735,2084,442,1092,47,2027,221767000000,62625.771431056499,2.1838410503266455E-2,9.6834188706142021E-2,9.4,null,"http://en.wikipedia.org/wiki/Economy_of_Puerto_Rico"]
{"$rows_left_out":153}
{"sheet":"Raw_Data-2","index":5,"n_rows":55,"n_cols":16,"rows_kept":55,"cut":false,"hidden":false,"merged":[]}
[" Average Mean Temperature Index by month -  Climatology by state based on climate division data: 1971-2000"]
["http://www.esrl.noaa.gov/psd/data/usclimate/tmp.state.19712000.climo"]
["State","Jan","Feb","Mar","Apr","May","Jun","Jul","Aug","Sep","Oct","Nov","Dec  Ave","Average","Deg C","Notes"]
["Alabama",44.29,48.04,55.47,61.99,69.89,76.75,79.87,79.040000000000006,73.88,63.08,54.1,46.85,62.770833333333343,17.094907407407412]
["Alaska",15.2,19.100000000000001,25.1,36.1,47,54.8,58.45,56.45,48.3,34.65,22.05,16.600000000000001,36.15,2.3055555555555549,"http://gonw.about.com/library/climate/blanchorageclimate.htm"]
["Arizona",42.27,46.24,51.03,57.63,66.010000000000005,75.510000000000005,80.19,78.5,72.52,61.61,49.64,42.51,60.305,15.725]
["Arkansas",38.479999999999997,43.76,51.96,60.36,68.62,76.400000000000006,80.569999999999993,79.260000000000005,72.260000000000005,61.47,50.32,41.59,60.420833333333348,15.78935185185186]
["California",45.14,48.51,51.76,56.5,63.11,70.180000000000007,75.319999999999993,74.62,69.97,61.56,51.17,44.98,59.401666666666671,15.22314814814815]
["Colorado",23.71,28.34,35.57,43.06,52.5,62.15,67.599999999999994,65.75,57.72,46.64,33.51,25.2,45.145833333333336,7.3032407407407423]
["Connecticut",25.96,28.43,36.94,47.07,57.77,66.290000000000006,71.52,69.77,61.68,50.6,41.43,31.13,49.049166666666657,9.4717592592592545]
{"$rows_left_out":46}
{"sheet":"Help","index":6,"n_rows":124,"n_cols":3,"rows_kept":124,"cut":false,"hidden":false,"merged":[]}
[]
[]
[0,"General Notes"]
[null,"Map - Contains the map"]
[null,"Model - Contains the controls to customize the map and dashboard"]
[null,"Map_Data - Enter map data here"]
[null,"Sample_Palette - Contains the color schemes available to use with the map"]
[null,"Raw_Data-1/2 - contains raw data"]
[null,"See the 'Data' worksheet for help on entering data for visualization."]
[]
{"$rows_left_out":114}