{"text_format":"1","workbook":"xlsx","n_sheets":5,"sheets":["DASHBOARD","CHART","STATISTICS","DATA","LOV"],"not_rendered":{"charts":5,"images":0,"macros":1,"external_links":0,"defined_names":4,"comments":0,"pivot_tables":0},"unopened":[],"bounds":{"document_bytes":16777216,"sheet_cells":100000,"rows_first":2000,"rows_last":500,"rows_between":2000,"halvings":0,"cell_chars":16384,"cell_head_chars":4096},"cells_cut":0,"cells_raw":0,"read":"whole","date_system":"1900"}

{"sheet":"DASHBOARD","index":0,"n_rows":8,"n_cols":15,"rows_kept":8,"cut":false,"hidden":false,"merged":[[2,14,2,18],[0,1,0,20],[3,2,4,6],[3,8,4,12],[3,14,4,18],[2,2,2,6],[2,8,2,12]]}
[null,"STATE-TO-STATE POPULATION MIGRATION IN UNITED STATES"]
[]
[null,null,"% American population moving to a new State",null,null,null,null,null,"Fastest growth of a State's population",null,null,null,null,null,"State that American prefers the most"]
[null,null,{"$f":"AVERAGE(STATISTICS!$L$3:$N$3)","v":2.2516385677384659E-2},null,null,null,null,null,{"$f":"TEXT(MAX(STATISTICS!$G$4:$G$55),\"0.00%\")&\" - \"&INDEX(STATISTICS!$A$1:$N$55,MATCH(MAX(STATISTICS!$G$4:$G$55),STATISTICS!$G$1:$G$55,0),1)","v":"2.33% - District of Columbia "},null,null,null,null,null,{"$f":"INDEX(STATISTICS!$A$1:$N$55,MATCH(MAX(STATISTICS!$K$4:$K$55),STATISTICS!$K$1:$K$55,0),1)","v":"Florida"}]
[]
[]
[null,"Choose State:"]
[null,"Choose Period:"]

{"sheet":"CHART","index":1,"n_rows":64,"n_cols":15,"rows_kept":64,"cut":false,"hidden":false,"merged":[[4,1,4,2],[4,3,4,6],[4,7,4,10],[4,11,4,14]]}
["Chosen State:",{"$f":"INDEX(lov_state,$C$1,)","v":"Georgia"},12]
["Period:",{"$f":"INDEX(lov_year,$C$2,)","v":2012},2]
[]
[]
[null,"Population 1yr and over",null,"# Same residence 1yr ago\n(% of population)",null,null,null,"# Different residence, same State 1yr ago\n(% of population)",null,null,null,"# Different State 1yr ago\n(% of population)"]
[null,"Chosen","Unchosen","Chosen","Unchosen","Blank","%","Chosen","Unchosen","Blank","%","Chosen","Unchosen","Blank","%"]
[2010,{"$f":"IF(OR($C$2=1,$A7=$B$2),SUMPRODUCT(N(INDEX(data,,1)=$A7),N(INDEX(data,,2)=$B$1),INDEX(data,,3)),0)","v":0},{"$f":"SUMPRODUCT(N(INDEX(data,,1)=$A7),N(INDEX(data,,2)=$B$1),INDEX(data,,3))-B7","v":9587237},{"$f":"IF(OR($C$2=1,$A7=$B$2),SUMPRODUCT(N(INDEX(data,,1)=$A7),N(INDEX(data,,2)=$B$1),INDEX(data,,4)),0)","v":0},{"$f":"SUMPRODUCT(N(INDEX(data,,1)=$A7),N(INDEX(data,,2)=$B$1),INDEX(data,,4))-D7","v":8015409},{"$f":"MAX(0,SUM($B7:$C7)-SUM(D7:E7))","v":1571828},{"$f":"SUM(D7:E7)/SUM($B7:$C7)","v":0.83604994848880865},{"$f":"IF(OR($C$2=1,$A7=$B$2),SUMPRODUCT(N(INDEX(data,,1)=$A7),N(INDEX(data,,2)=$B$1),INDEX(data,,5)),0)","v":0},{"$f":"SUMPRODUCT(N(INDEX(data,,1)=$A7),N(INDEX(data,,2)=$B$1),INDEX(data,,5))-H7","v":1278548},{"$f":"MAX(0,SUM($B7:$C7)-SUM(H7:I7))","v":8308689},{"$f":"SUM(H7:I7)/SUM($B7:$C7)","v":0.13335938185318669},{"$f":"IF(OR($C$2=1,$A7=$B$2),SUMPRODUCT(N(INDEX(data,,1)=$A7),N(INDEX(data,,2)=$B$1),INDEX(data,,6)),0)","v":0},{"$f":"SUMPRODUCT(N(INDEX(data,,1)=$A7),N(INDEX(data,,2)=$B$1),INDEX(data,,6))-L7","v":249459},{"$f":"MAX(0,SUM($B7:$C7)-SUM(L7:M7))","v":9337778},{"$f":"SUM(L7:M7)/SUM($B7:$C7)","v":2.6019905422177421E-2}]
[2011,{"$f":"IF(OR($C$2=1,$A8=$B$2),SUMPRODUCT(N(INDEX(data,,1)=$A8),N(INDEX(data,,2)=$B$1),INDEX(data,,3)),0)","v":0},{"$f":"SUMPRODUCT(N(INDEX(data,,1)=$A8),N(INDEX(data,,2)=$B$1),INDEX(data,,3))-B8","v":9699859},{"$f":"IF(OR($C$2=1,$A8=$B$2),SUMPRODUCT(N(INDEX(data,,1)=$A8),N(INDEX(data,,2)=$B$1),INDEX(data,,4)),0)","v":0},{"$f":"SUMPRODUCT(N(INDEX(data,,1)=$A8),N(INDEX(data,,2)=$B$1),INDEX(data,,4))-D8","v":8095407},{"$f":"MAX(0,SUM($B8:$C8)-SUM(D8:E8))","v":1604452},{"$f":"SUM(D8:E8)/SUM($B8:$C8)","v":0.83459017290869897},{"$f":"IF(OR($C$2=1,$A8=$B$2),SUMPRODUCT(N(INDEX(data,,1)=$A8),N(INDEX(data,,2)=$B$1),INDEX(data,,5)),0)","v":0},{"$f":"SUMPRODUCT(N(INDEX(data,,1)=$A8),N(INDEX(data,,2)=$B$1),INDEX(data,,5))-H8","v":1289450},{"$f":"MAX(0,SUM($B8:$C8)-SUM(H8:I8))","v":8410409},{"$f":"SUM(H8:I8)/SUM($B8:$C8)","v":0.13293492204371218},{"$f":"IF(OR($C$2=1,$A8=$B$2),SUMPRODUCT(N(INDEX(data,,1)=$A8),N(INDEX(data,,2)=$B$1),INDEX(data,,6)),0)","v":0},{"$f":"SUMPRODUCT(N(INDEX(data,,1)=$A8),N(INDEX(data,,2)=$B$1),INDEX(data,,6))-L8","v":271077},{"$f":"MAX(0,SUM($B8:$C8)-SUM(L8:M8))","v":9428782},{"$f":"SUM(L8:M8)/SUM($B8:$C8)","v":2.7946488706691509E-2}]
[2012,{"$f":"IF(OR($C$2=1,$A9=$B$2),SUMPRODUCT(N(INDEX(data,,1)=$A9),N(INDEX(data,,2)=$B$1),INDEX(data,,3)),0)","v":9796547},{"$f":"SUMPRODUCT(N(INDEX(data,,1)=$A9),N(INDEX(data,,2)=$B$1),INDEX(data,,3))-B9","v":0},{"$f":"IF(OR($C$2=1,$A9=$B$2),SUMPRODUCT(N(INDEX(data,,1)=$A9),N(INDEX(data,,2)=$B$1),INDEX(data,,4)),0)","v":8231384},{"$f":"SUMPRODUCT(N(INDEX(data,,1)=$A9),N(INDEX(data,,2)=$B$1),INDEX(data,,4))-D9","v":0},1565163,0.84023319645177019,{"$f":"IF(OR($C$2=1,$A9=$B$2),SUMPRODUCT(N(INDEX(data,,1)=$A9),N(INDEX(data,,2)=$B$1),INDEX(data,,5)),0)","v":1236302},{"$f":"SUMPRODUCT(N(INDEX(data,,1)=$A9),N(INDEX(data,,2)=$B$1),INDEX(data,,5))-H9","v":0},{"$f":"MAX(0,SUM($B9:$C9)-SUM(H9:I9))","v":8560245},0.12619773069021156,{"$f":"IF(OR($C$2=1,$A9=$B$2),SUMPRODUCT(N(INDEX(data,,1)=$A9),N(INDEX(data,,2)=$B$1),INDEX(data,,6)),0)","v":277466},{"$f":"SUMPRODUCT(N(INDEX(data,,1)=$A9),N(INDEX(data,,2)=$B$1),INDEX(data,,6))-L9","v":0},{"$f":"MAX(0,SUM($B9:$C9)-SUM(L9:M9))","v":9519081},2.8322836607633281E-2]
[]
{"$rows_left_out":55}
{"sheet":"STATISTICS","index":2,"n_rows":55,"n_cols":19,"rows_kept":55,"cut":false,"hidden":false,"merged":[[0,14,0,17],[0,18,1,18],[0,1,0,3],[0,11,0,13],[0,4,0,6],[0,7,0,10]]}
[null,"Population 1yr and over",null,null,"Growth rate",null,null,"In-migration",null,null,null,"% of Population",null,null,"Out-migration",null,null,null,"Net"]
["State",2010,2011,2012,2011,2012,"Average",2010,2011,2012,"Average",2010,2011,2012,2010,2011,2012,"Average"]
["(All)",{"$f":"SUMPRODUCT(N(INDEX(data,,1)=B$2),N(INDEX(data,,2)=$A3),INDEX(data,,3))","v":305628607},{"$f":"SUMPRODUCT(N(INDEX(data,,1)=C$2),N(INDEX(data,,2)=$A3),INDEX(data,,3))","v":307900319},{"$f":"SUMPRODUCT(N(INDEX(data,,1)=D$2),N(INDEX(data,,2)=$A3),INDEX(data,,3))","v":310212755},{"$f":"IFERROR(C3/B3-1,0)","v":7.4329167753592884E-3},{"$f":"IFERROR(D3/C3-1,0)","v":7.5103397343345701E-3},{"$f":"AVERAGE(E3:F3)","v":7.4716282548469293E-3},{"$f":"SUMPRODUCT(N(INDEX(data,,1)=H$2),N(INDEX(data,,2)=$A3),INDEX(data,,6))","v":6743229},{"$f":"SUMPRODUCT(N(INDEX(data,,1)=I$2),N(INDEX(data,,2)=$A3),INDEX(data,,6))","v":6987416},{"$f":"SUMPRODUCT(N(INDEX(data,,1)=J$2),N(INDEX(data,,2)=$A3),INDEX(data,,6))","v":7070345},{"$f":"AVERAGE(H3:J3)","v":6933663.333333333},{"$f":"H3/B3","v":2.2063474575205588E-2},{"$f":"I3/C3","v":2.2693760184119848E-2},{"$f":"J3/D3","v":2.279192227282853E-2},{"$f":"SUMPRODUCT(N(INDEX(data,,1)=O$2),N(INDEX(data,,2)=\"(All)\"),INDEX(data,,MATCH($A3,INDEX(data,3,),0)))","v":6743229},{"$f":"SUMPRODUCT(N(INDEX(data,,1)=P$2),N(INDEX(data,,2)=\"(All)\"),INDEX(data,,MATCH($A3,INDEX(data,3,),0)))","v":6987416},{"$f":"SUMPRODUCT(N(INDEX(data,,1)=Q$2),N(INDEX(data,,2)=\"(All)\"),INDEX(data,,MATCH($A3,INDEX(data,3,),0)))","v":7070345},{"$f":"AVERAGE(O3:Q3)","v":6933663.333333333},{"$f":"K3-R3","v":0}]
["Alabama",{"$f":"SUMPRODUCT(N(INDEX(data,,1)=B$2),N(INDEX(data,,2)=$A4),INDEX(data,,3))","v":4729509},{"$f":"SUMPRODUCT(N(INDEX(data,,1)=C$2),N(INDEX(data,,2)=$A4),INDEX(data,,3))","v":4745278},{"$f":"SUMPRODUCT(N(INDEX(data,,1)=D$2),N(INDEX(data,,2)=$A4),INDEX(data,,3))","v":4764428},3.3341727439359925E-3,4.0355907493723198E-3,3.6848817466541561E-3,{"$f":"SUMPRODUCT(N(INDEX(data,,1)=H$2),N(INDEX(data,,2)=$A4),INDEX(data,,6))","v":108723},{"$f":"SUMPRODUCT(N(INDEX(data,,1)=I$2),N(INDEX(data,,2)=$A4),INDEX(data,,6))","v":117726},{"$f":"SUMPRODUCT(N(INDEX(data,,1)=J$2),N(INDEX(data,,2)=$A4),INDEX(data,,6))","v":104600},110349.66666666667,2.2988221398880942E-2,2.4809083893504238E-2,2.1954366820109362E-2,{"$f":"SUMPRODUCT(N(INDEX(data,,1)=O$2),N(INDEX(data,,2)=\"(All)\"),INDEX(data,,MATCH($A4,INDEX(data,3,),0)))","v":99221},{"$f":"SUMPRODUCT(N(INDEX(data,,1)=P$2),N(INDEX(data,,2)=\"(All)\"),INDEX(data,,MATCH($A4,INDEX(data,3,),0)))","v":106806},{"$f":"SUMPRODUCT(N(INDEX(data,,1)=Q$2),N(INDEX(data,,2)=\"(All)\"),INDEX(data,,MATCH($A4,INDEX(data,3,),0)))","v":109210},105079,{"$f":"K4-R4","v":5270.6666666666715}]
["Alaska",{"$f":"SUMPRODUCT(N(INDEX(data,,1)=B$2),N(INDEX(data,,2)=$A5),INDEX(data,,3))","v":702974},{"$f":"SUMPRODUCT(N(INDEX(data,,1)=C$2),N(INDEX(data,,2)=$A5),INDEX(data,,3))","v":711962},{"$f":"SUMPRODUCT(N(INDEX(data,,1)=D$2),N(INDEX(data,,2)=$A5),INDEX(data,,3))","v":721186},1.2785679128957783E-2,1.2955747638216719E-2,1.2870713383587251E-2,{"$f":"SUMPRODUCT(N(INDEX(data,,1)=H$2),N(INDEX(data,,2)=$A5),INDEX(data,,6))","v":36326},{"$f":"SUMPRODUCT(N(INDEX(data,,1)=I$2),N(INDEX(data,,2)=$A5),INDEX(data,,6))","v":35084},{"$f":"SUMPRODUCT(N(INDEX(data,,1)=J$2),N(INDEX(data,,2)=$A5),INDEX(data,,6))","v":33415},34941.666666666664,5.1674741882345575E-2,4.9277910899739034E-2,4.6333400814769006E-2,{"$f":"SUMPRODUCT(N(INDEX(data,,1)=O$2),N(INDEX(data,,2)=\"(All)\"),INDEX(data,,MATCH($A5,INDEX(data,3,),0)))","v":94692},{"$f":"SUMPRODUCT(N(INDEX(data,,1)=P$2),N(INDEX(data,,2)=\"(All)\"),INDEX(data,,MATCH($A5,INDEX(data,3,),0)))","v":88850},{"$f":"SUMPRODUCT(N(INDEX(data,,1)=Q$2),N(INDEX(data,,2)=\"(All)\"),INDEX(data,,MATCH($A5,INDEX(data,3,),0)))","v":84068},89203.333333333328,-54261.666666666664]
["Arizona",{"$f":"SUMPRODUCT(N(INDEX(data,,1)=B$2),N(INDEX(data,,2)=$A6),INDEX(data,,3))","v":6332786},{"$f":"SUMPRODUCT(N(INDEX(data,,1)=C$2),N(INDEX(data,,2)=$A6),INDEX(data,,3))","v":6402301},{"$f":"SUMPRODUCT(N(INDEX(data,,1)=D$2),N(INDEX(data,,2)=$A6),INDEX(data,,3))","v":6468907},1.0977001275583875E-2,1.0403447135647115E-2,1.0690224205615495E-2,{"$f":"SUMPRODUCT(N(INDEX(data,,1)=H$2),N(INDEX(data,,2)=$A6),INDEX(data,,6))","v":222725},{"$f":"SUMPRODUCT(N(INDEX(data,,1)=I$2),N(INDEX(data,,2)=$A6),INDEX(data,,6))","v":222877},{"$f":"SUMPRODUCT(N(INDEX(data,,1)=J$2),N(INDEX(data,,2)=$A6),INDEX(data,,6))","v":232457},226019.66666666666,3.517014470408443E-2,3.4812015242644795E-2,3.5934509492871053E-2,{"$f":"SUMPRODUCT(N(INDEX(data,,1)=O$2),N(INDEX(data,,2)=\"(All)\"),INDEX(data,,MATCH($A6,INDEX(data,3,),0)))","v":176768},{"$f":"SUMPRODUCT(N(INDEX(data,,1)=P$2),N(INDEX(data,,2)=\"(All)\"),INDEX(data,,MATCH($A6,INDEX(data,3,),0)))","v":211816},{"$f":"SUMPRODUCT(N(INDEX(data,,1)=Q$2),N(INDEX(data,,2)=\"(All)\"),INDEX(data,,MATCH($A6,INDEX(data,3,),0)))","v":206842},198475.33333333334,27544.333333333314]
["Arkansas",{"$f":"SUMPRODUCT(N(INDEX(data,,1)=B$2),N(INDEX(data,,2)=$A7),INDEX(data,,3))","v":2888304},{"$f":"SUMPRODUCT(N(INDEX(data,,1)=C$2),N(INDEX(data,,2)=$A7),INDEX(data,,3))","v":2906632},{"$f":"SUMPRODUCT(N(INDEX(data,,1)=D$2),N(INDEX(data,,2)=$A7),INDEX(data,,3))","v":2912680},6.3455924307136424E-3,2.080758761342949E-3,4.2131755960282957E-3,{"$f":"SUMPRODUCT(N(INDEX(data,,1)=H$2),N(INDEX(data,,2)=$A7),INDEX(data,,6))","v":79127},{"$f":"SUMPRODUCT(N(INDEX(data,,1)=I$2),N(INDEX(data,,2)=$A7),INDEX(data,,6))","v":69845},{"$f":"SUMPRODUCT(N(INDEX(data,,1)=J$2),N(INDEX(data,,2)=$A7),INDEX(data,,6))","v":76948},75306.666666666672,2.7395661952481457E-2,2.4029529709987368E-2,2.6418281445266902E-2,{"$f":"SUMPRODUCT(N(INDEX(data,,1)=O$2),N(INDEX(data,,2)=\"(All)\"),INDEX(data,,MATCH($A7,INDEX(data,3,),0)))","v":64264},{"$f":"SUMPRODUCT(N(INDEX(data,,1)=P$2),N(INDEX(data,,2)=\"(All)\"),INDEX(data,,MATCH($A7,INDEX(data,3,),0)))","v":77226},{"$f":"SUMPRODUCT(N(INDEX(data,,1)=Q$2),N(INDEX(data,,2)=\"(All)\"),INDEX(data,,MATCH($A7,INDEX(data,3,),0)))","v":64967},68819,6487.6666666666715]
["California",{"$f":"SUMPRODUCT(N(INDEX(data,,1)=B$2),N(INDEX(data,,2)=$A8),INDEX(data,,3))","v":36907897},{"$f":"SUMPRODUCT(N(INDEX(data,,1)=C$2),N(INDEX(data,,2)=$A8),INDEX(data,,3))","v":37222678},{"$f":"SUMPRODUCT(N(INDEX(data,,1)=D$2),N(INDEX(data,,2)=$A8),INDEX(data,,3))","v":37572738},8.5288251454695985E-3,9.4044818591505486E-3,8.9666535023100735E-3,{"$f":"SUMPRODUCT(N(INDEX(data,,1)=H$2),N(INDEX(data,,2)=$A8),INDEX(data,,6))","v":444749},{"$f":"SUMPRODUCT(N(INDEX(data,,1)=I$2),N(INDEX(data,,2)=$A8),INDEX(data,,6))","v":468428},{"$f":"SUMPRODUCT(N(INDEX(data,,1)=J$2),N(INDEX(data,,2)=$A8),INDEX(data,,6))","v":493641},468939.33333333331,1.2050239546295471E-2,1.2584478741696124E-2,1.3138275948907423E-2,{"$f":"SUMPRODUCT(N(INDEX(data,,1)=O$2),N(INDEX(data,,2)=\"(All)\"),INDEX(data,,MATCH($A8,INDEX(data,3,),0)))","v":573988},{"$f":"SUMPRODUCT(N(INDEX(data,,1)=P$2),N(INDEX(data,,2)=\"(All)\"),INDEX(data,,MATCH($A8,INDEX(data,3,),0)))","v":562343},{"$f":"SUMPRODUCT(N(INDEX(data,,1)=Q$2),N(INDEX(data,,2)=\"(All)\"),INDEX(data,,MATCH($A8,INDEX(data,3,),0)))","v":566986},567772.33333333337,-98833.000000000058]
["Colorado",{"$f":"SUMPRODUCT(N(INDEX(data,,1)=B$2),N(INDEX(data,,2)=$A9),INDEX(data,,3))","v":4988190},{"$f":"SUMPRODUCT(N(INDEX(data,,1)=C$2),N(INDEX(data,,2)=$A9),INDEX(data,,3))","v":5048443},{"$f":"SUMPRODUCT(N(INDEX(data,,1)=D$2),N(INDEX(data,,2)=$A9),INDEX(data,,3))","v":5123944},1.2079130907202806E-2,1.4955304041265771E-2,1.3517217474234289E-2,{"$f":"SUMPRODUCT(N(INDEX(data,,1)=H$2),N(INDEX(data,,2)=$A9),INDEX(data,,6))","v":186366},{"$f":"SUMPRODUCT(N(INDEX(data,,1)=I$2),N(INDEX(data,,2)=$A9),INDEX(data,,6))","v":202124},{"$f":"SUMPRODUCT(N(INDEX(data,,1)=J$2),N(INDEX(data,,2)=$A9),INDEX(data,,6))","v":205060},197850,3.7361447739560842E-2,4.0036898505143068E-2,4.0019953379662229E-2,{"$f":"SUMPRODUCT(N(INDEX(data,,1)=O$2),N(INDEX(data,,2)=\"(All)\"),INDEX(data,,MATCH($A9,INDEX(data,3,),0)))","v":140620},{"$f":"SUMPRODUCT(N(INDEX(data,,1)=P$2),N(INDEX(data,,2)=\"(All)\"),INDEX(data,,MATCH($A9,INDEX(data,3,),0)))","v":160623},{"$f":"SUMPRODUCT(N(INDEX(data,,1)=Q$2),N(INDEX(data,,2)=\"(All)\"),INDEX(data,,MATCH($A9,INDEX(data,3,),0)))","v":161530},154257.66666666666,43592.333333333343]
["Connecticut",{"$f":"SUMPRODUCT(N(INDEX(data,,1)=B$2),N(INDEX(data,,2)=$A10),INDEX(data,,3))","v":3541146},{"$f":"SUMPRODUCT(N(INDEX(data,,1)=C$2),N(INDEX(data,,2)=$A10),INDEX(data,,3))","v":3548667},{"$f":"SUMPRODUCT(N(INDEX(data,,1)=D$2),N(INDEX(data,,2)=$A10),INDEX(data,,3))","v":3555319},2.123888707215027E-3,1.8745066809593425E-3,1.9991976940871847E-3,{"$f":"SUMPRODUCT(N(INDEX(data,,1)=H$2),N(INDEX(data,,2)=$A10),INDEX(data,,6))","v":77333},{"$f":"SUMPRODUCT(N(INDEX(data,,1)=I$2),N(INDEX(data,,2)=$A10),INDEX(data,,6))","v":71502},{"$f":"SUMPRODUCT(N(INDEX(data,,1)=J$2),N(INDEX(data,,2)=$A10),INDEX(data,,6))","v":80311},76382,2.1838410503266455E-2,2.0148974248640403E-2,2.2588971622518262E-2,{"$f":"SUMPRODUCT(N(INDEX(data,,1)=O$2),N(INDEX(data,,2)=\"(All)\"),INDEX(data,,MATCH($A10,INDEX(data,3,),0)))","v":89360},{"$f":"SUMPRODUCT(N(INDEX(data,,1)=P$2),N(INDEX(data,,2)=\"(All)\"),INDEX(data,,MATCH($A10,INDEX(data,3,),0)))","v":91295},{"$f":"SUMPRODUCT(N(INDEX(data,,1)=Q$2),N(INDEX(data,,2)=\"(All)\"),INDEX(data,,MATCH($A10,INDEX(data,3,),0)))","v":87023},89226,-12844]
{"$rows_left_out":46}
{"sheet":"DATA","index":3,"n_rows":162,"n_cols":58,"rows_kept":162,"cut":false,"hidden":false,"merged":[[1,5,1,57],[0,0,2,0],[0,1,2,1],[0,2,1,2],[0,3,1,3],[0,4,1,4]]}
["Year","Current residence in --","Population 1 year and over","Same residence 1 year ago","Different residence, same state 1 year ago",1,2,3,4,5,6,7,8,9,10,11,12,13,14,15,16,17,18,19,20,21,22,23,24,25,26,27,28,29,30,31,32,33,34,35,36,37,38,39,40,41,42,43,44,45,46,47,48,49,50,51,52,53]
[null,null,null,null,null,"State of Residence Last year (Estimate)"]
[null,null,"Estimate","Estimate","Estimate","(All)","Alabama","Alaska","Arizona","Arkansas","California","Colorado","Connecticut","Delaware","District of Columbia ","Florida","Georgia","Hawaii","Idaho","Illinois","Indiana","Iowa","Kansas","Kentucky","Louisiana","Maine","Maryland","Massachusetts","Michigan","Minnesota","Mississippi","Missouri","Montana","Nebraska","Nevada","New Hampshire","New Jersey","New Mexico","New York","North Carolina","North Dakota","Ohio","Oklahoma","Oregon","Pennsylvania","Rhode Island","South Carolina","South Dakota","Tennessee","Texas","Utah","Vermont","Virginia","Washington","West Virginia","Wisconsin","Wyoming","Puerto Rico"]
[2012,"(All)",310212755,263612596,37696597,7070345,109210,84068,206842,64967,566986,161530,87023,25149,59513,428325,252262,61509,55191,277953,144597,73325,93134,103004,95956,38574,157664,158156,175733,115946,66947,142754,33832,48816,98882,38696,219202,63921,405864,238663,23959,199202,102572,108182,237156,30498,127418,22534,163843,402187,82165,20056,238540,180462,47425,97724,32228,74500]
[2012,"Alabama",4764428,4054260,590326,104600,"N/A",1004,962,660,3077,1386,284,42,162,11244,19920,627,493,2722,1347,345,865,2495,3104,67,1513,334,2298,752,4952,1555,101,151,1009,161,1702,459,2709,5133,228,1411,194,200,1837,0,2811,518,10539,7468,579,0,3170,1034,128,760,88,619]
[2012,"Alaska",721186,592551,90613,33415,1097,"N/A",1520,196,3494,556,0,0,356,1991,928,1376,538,58,260,13,221,161,120,66,508,297,563,192,56,819,371,1195,803,118,116,263,736,920,264,1316,335,3174,255,0,384,99,451,1488,330,79,1265,3725,0,206,136,25]
[2012,"Arizona",6468907,5242674,953789,232457,1331,3717,"N/A",1214,44889,13790,417,246,36,5553,2263,2491,2934,10744,2930,2702,2498,1328,724,616,3007,1961,9598,8570,293,2595,1118,2293,6712,510,2564,6946,7402,2721,877,7906,1626,8587,4280,614,1070,1472,5075,14788,5916,207,2763,13247,765,3765,2786,1791]
[2012,"Arkansas",2912680,2453347,373046,76948,374,855,1677,"N/A",3525,603,185,0,205,2682,1525,0,0,3576,1172,409,1033,1310,3953,17,169,254,1283,295,3689,9105,258,166,121,0,157,547,2262,3057,0,1135,9938,193,516,59,52,673,4195,11767,269,0,1159,251,84,695,1498,0]
[2012,"California",37572738,31777868,5046618,493641,2509,6995,38916,3472,"N/A",15150,6764,474,3199,21004,10790,11906,5331,21251,5891,2284,2790,3763,5180,1256,7902,14356,8921,8539,2556,6729,3060,3302,27968,1327,12057,5921,31261,11195,1827,10653,6671,22724,10466,1648,4110,826,5802,43005,12172,544,15625,34569,1413,5681,1886,2323]
[2012,"Colorado",5123944,4131357,751921,205060,3108,3457,10589,1043,22152,"N/A",1317,70,488,8615,5834,2536,2660,6374,4336,2776,5283,2500,5048,20,2844,5939,3343,2992,835,3771,2021,4472,3789,679,2464,6520,7250,4378,1918,4533,4582,2419,3950,137,2383,756,2535,17355,6398,503,3796,4853,837,3000,5602,1144]
{"$rows_left_out":153}
{"sheet":"LOV","index":4,"n_rows":54,"n_cols":3,"rows_kept":54,"cut":false,"hidden":false,"merged":[]}
["State",null,"Year"]
["(All)",null,"3 years"]
["Alabama",null,2012]
["Alaska",null,2011]
["Arizona",null,2010]
["Arkansas"]
["California"]
["Colorado"]
["Connecticut"]
["Delaware"]
{"$rows_left_out":44}