{"text_format":"1","workbook":"xlsx","n_sheets":6,"sheets":["Dashboard","DataPull","Raw Data","Images","Mockup","Sources"],"not_rendered":{"charts":3,"images":58,"macros":1,"external_links":0,"defined_names":6,"comments":0,"pivot_tables":0},"unopened":[],"bounds":{"document_bytes":16777216,"sheet_cells":100000,"rows_first":2000,"rows_last":500,"rows_between":2000,"halvings":0,"cell_chars":16384,"cell_head_chars":4096},"cells_cut":0,"cells_raw":0,"read":"whole","date_system":"1900"}

{"sheet":"Dashboard","index":0,"n_rows":29,"n_cols":18,"rows_kept":29,"cut":false,"hidden":false,"merged":[]}
[null,"American State Migration"]
[null," In Relation to Political Voting Outcomes"]
[null,"COUNTRY",{"$f":"DataPull!B29","v":"United States"}]
[null,"VOTED",{"$f":"DataPull!B43","v":"Democrat"}]
[]
[]
[]
[]
[]
[]
[]
[]
[null,null,null,{"$f":"DataPull!$B$2","v":"Texas"},null,null,null,null,null,null,null,null,null,null,null,null,null,{"$f":"Selected_Year","v":2010}]
[null,null,null,"VOTED",{"$f":"PoliticalInfluence","v":"Republican"}]
[null,null,null,null,null,{"$f":"DataPull!B18","v":24.899075},"State Population",null,null,{"$f":"DataPull!C19","v":0.82333002330407856},"Stayed Put",null,null,{"$f":"DataPull!C20","v":0.15022019894313343},"Left The State"]
[null,"OVERVIEW"]
[]
[]
[]
[]
[]
[]
[]
[]
[]
[]
[]
[]
[null,null,null,null,null,null,null,null,null,null,null,null,null,null,null,null,null,"Created By: Chris Newman"]

{"sheet":"DataPull","index":1,"n_rows":53,"n_cols":19,"rows_kept":53,"cut":false,"hidden":false,"merged":[]}
[null,null,null,null,null,null,null,null,null,null,null,null,null,null,44]
["STATE:",{"$f":"INDEX($O$3:$O$54,O1)","v":"Texas"},null,null,null,"Political Influence",{"$f":"VLOOKUP($A$13,'Raw Data'!$A$2:$BL$158,3,0)","v":"Republican"},null,null,null,"YEAR:",2010,null,null,"State"]
[null,null,null,null,null,null,null,null,null,null,null,null,null,null,"Alabama"]
[{"$f":"\"Top State Populations migrating to \" & B2","v":"Top State Populations migrating to Texas"},null,null,null,null,null,null,null,null,null,null,null,null,null,"Alaska"]
["Rank",10,9,8,7,6,5,4,3,2,1,null,null,null,"Arizona"]
["State",{"$f":"INDEX('Raw Data'!$N$2:$BL$2,MATCH(DataPull!B7,INDEX(StateMigData,MATCH($A7,'Raw Data'!$A:$A,0),0),0))","v":"Arkansas"},{"$f":"INDEX('Raw Data'!$N$2:$BL$2,MATCH(DataPull!C7,INDEX(StateMigData,MATCH($A7,'Raw Data'!$A:$A,0),0),0))","v":"Colorado"},{"$f":"INDEX('Raw Data'!$N$2:$BL$2,MATCH(DataPull!D7,INDEX(StateMigData,MATCH($A7,'Raw Data'!$A:$A,0),0),0))","v":"Arizona"},{"$f":"INDEX('Raw Data'!$N$2:$BL$2,MATCH(DataPull!E7,INDEX(StateMigData,MATCH($A7,'Raw Data'!$A:$A,0),0),0))","v":"New York"},{"$f":"INDEX('Raw Data'!$N$2:$BL$2,MATCH(DataPull!F7,INDEX(StateMigData,MATCH($A7,'Raw Data'!$A:$A,0),0),0))","v":"Georgia"},{"$f":"INDEX('Raw Data'!$N$2:$BL$2,MATCH(DataPull!G7,INDEX(StateMigData,MATCH($A7,'Raw Data'!$A:$A,0),0),0))","v":"Illinois"},{"$f":"INDEX('Raw Data'!$N$2:$BL$2,MATCH(DataPull!H7,INDEX(StateMigData,MATCH($A7,'Raw Data'!$A:$A,0),0),0))","v":"Oklahoma"},{"$f":"INDEX('Raw Data'!$N$2:$BL$2,MATCH(DataPull!I7,INDEX(StateMigData,MATCH($A7,'Raw Data'!$A:$A,0),0),0))","v":"Florida"},{"$f":"INDEX('Raw Data'!$N$2:$BL$2,MATCH(DataPull!J7,INDEX(StateMigData,MATCH($A7,'Raw Data'!$A:$A,0),0),0))","v":"Louisiana"},{"$f":"INDEX('Raw Data'!$N$2:$BL$2,MATCH(DataPull!K7,INDEX(StateMigData,MATCH($A7,'Raw Data'!$A:$A,0),0),0))","v":"California"},"Total",null,null,"Arkansas"]
[{"$f":"Selected_Year&State","v":"2010Texas"},{"$f":"LARGE(INDEX(StateMigData,MATCH($A7,'Raw Data'!$A:$A,0),0),B$5)","v":15251},{"$f":"LARGE(INDEX(StateMigData,MATCH($A7,'Raw Data'!$A:$A,0),0),C$5)","v":16361},{"$f":"LARGE(INDEX(StateMigData,MATCH($A7,'Raw Data'!$A:$A,0),0),D$5)","v":16521},{"$f":"LARGE(INDEX(StateMigData,MATCH($A7,'Raw Data'!$A:$A,0),0),E$5)","v":16624},{"$f":"LARGE(INDEX(StateMigData,MATCH($A7,'Raw Data'!$A:$A,0),0),F$5)","v":16671},{"$f":"LARGE(INDEX(StateMigData,MATCH($A7,'Raw Data'!$A:$A,0),0),G$5)","v":20169},{"$f":"LARGE(INDEX(StateMigData,MATCH($A7,'Raw Data'!$A:$A,0),0),H$5)","v":22969},{"$f":"LARGE(INDEX(StateMigData,MATCH($A7,'Raw Data'!$A:$A,0),0),I$5)","v":26668},{"$f":"LARGE(INDEX(StateMigData,MATCH($A7,'Raw Data'!$A:$A,0),0),J$5)","v":31149},{"$f":"LARGE(INDEX(StateMigData,MATCH($A7,'Raw Data'!$A:$A,0),0),K$5)","v":68959},{"$f":"VLOOKUP(A7,'Raw Data'!$A$2:$BL$158,13,0)","v":486558},null,null,"California"]
["Republican",{"$f":"IF(VLOOKUP($L$2&B$6,'Raw Data'!$A:$C,3,0) = $A8,B$7/1000,\"\")","v":15.250999999999999},{"$f":"IF(VLOOKUP($L$2&C$6,'Raw Data'!$A:$C,3,0) = $A8,C$7/1000,\"\")","v":""},{"$f":"IF(VLOOKUP($L$2&D$6,'Raw Data'!$A:$C,3,0) = $A8,D$7/1000,\"\")","v":16.521000000000001},{"$f":"IF(VLOOKUP($L$2&E$6,'Raw Data'!$A:$C,3,0) = $A8,E$7/1000,\"\")","v":""},{"$f":"IF(VLOOKUP($L$2&F$6,'Raw Data'!$A:$C,3,0) = $A8,F$7/1000,\"\")","v":16.670999999999999},{"$f":"IF(VLOOKUP($L$2&G$6,'Raw Data'!$A:$C,3,0) = $A8,G$7/1000,\"\")","v":""},{"$f":"IF(VLOOKUP($L$2&H$6,'Raw Data'!$A:$C,3,0) = $A8,H$7/1000,\"\")","v":22.969000000000001},{"$f":"IF(VLOOKUP($L$2&I$6,'Raw Data'!$A:$C,3,0) = $A8,I$7/1000,\"\")","v":""},{"$f":"IF(VLOOKUP($L$2&J$6,'Raw Data'!$A:$C,3,0) = $A8,J$7/1000,\"\")","v":31.149000000000001},{"$f":"IF(VLOOKUP($L$2&K$6,'Raw Data'!$A:$C,3,0) = $A8,K$7/1000,\"\")","v":""},null,null,null,"Colorado"]
["Democrat",{"$f":"IF(VLOOKUP($L$2&B$6,'Raw Data'!$A:$C,3,0) = $A9,B$7/1000,\"\")","v":""},{"$f":"IF(VLOOKUP($L$2&C$6,'Raw Data'!$A:$C,3,0) = $A9,C$7/1000,\"\")","v":16.361000000000001},{"$f":"IF(VLOOKUP($L$2&D$6,'Raw Data'!$A:$C,3,0) = $A9,D$7/1000,\"\")","v":""},{"$f":"IF(VLOOKUP($L$2&E$6,'Raw Data'!$A:$C,3,0) = $A9,E$7/1000,\"\")","v":16.623999999999999},{"$f":"IF(VLOOKUP($L$2&F$6,'Raw Data'!$A:$C,3,0) = $A9,F$7/1000,\"\")","v":""},{"$f":"IF(VLOOKUP($L$2&G$6,'Raw Data'!$A:$C,3,0) = $A9,G$7/1000,\"\")","v":20.169},{"$f":"IF(VLOOKUP($L$2&H$6,'Raw Data'!$A:$C,3,0) = $A9,H$7/1000,\"\")","v":""},{"$f":"IF(VLOOKUP($L$2&I$6,'Raw Data'!$A:$C,3,0) = $A9,I$7/1000,\"\")","v":26.667999999999999},{"$f":"IF(VLOOKUP($L$2&J$6,'Raw Data'!$A:$C,3,0) = $A9,J$7/1000,\"\")","v":""},{"$f":"IF(VLOOKUP($L$2&K$6,'Raw Data'!$A:$C,3,0) = $A9,K$7/1000,\"\")","v":68.959000000000003},null,null,null,"Connecticut"]
[null,null,null,null,null,null,null,null,null,null,null,null,null,null,"Delaware"]
[{"$f":"\"People from \" & B2 & \" moved here\"","v":"People from Texas moved here"},null,null,null,null,null,null,null,null,null,null,null,null,null,"District of Columbia"]
["State",{"$f":"INDEX('Raw Data'!$D$4:$D$158,MATCH(B13,OFFSET('Raw Data'!$A$4:$A$158,0,MATCH($B$2,'Raw Data'!$A$2:$BL$2,0)-1),0))","v":"Virginia"},{"$f":"INDEX('Raw Data'!$D$4:$D$158,MATCH(C13,OFFSET('Raw Data'!$A$4:$A$158,0,MATCH($B$2,'Raw Data'!$A$2:$BL$2,0)-1),0))","v":"Arkansas"},{"$f":"INDEX('Raw Data'!$D$4:$D$158,MATCH(D13,OFFSET('Raw Data'!$A$4:$A$158,0,MATCH($B$2,'Raw Data'!$A$2:$BL$2,0)-1),0))","v":"North Carolina"},{"$f":"INDEX('Raw Data'!$D$4:$D$158,MATCH(E13,OFFSET('Raw Data'!$A$4:$A$158,0,MATCH($B$2,'Raw Data'!$A$2:$BL$2,0)-1),0))","v":"Arizona"},{"$f":"INDEX('Raw Data'!$D$4:$D$158,MATCH(F13,OFFSET('Raw Data'!$A$4:$A$158,0,MATCH($B$2,'Raw Data'!$A$2:$BL$2,0)-1),0))","v":"New Mexico"},{"$f":"INDEX('Raw Data'!$D$4:$D$158,MATCH(G13,OFFSET('Raw Data'!$A$4:$A$158,0,MATCH($B$2,'Raw Data'!$A$2:$BL$2,0)-1),0))","v":"Colorado"},{"$f":"INDEX('Raw Data'!$D$4:$D$158,MATCH(H13,OFFSET('Raw Data'!$A$4:$A$158,0,MATCH($B$2,'Raw Data'!$A$2:$BL$2,0)-1),0))","v":"Florida"},{"$f":"INDEX('Raw Data'!$D$4:$D$158,MATCH(I13,OFFSET('Raw Data'!$A$4:$A$158,0,MATCH($B$2,'Raw Data'!$A$2:$BL$2,0)-1),0))","v":"Louisiana"},{"$f":"INDEX('Raw Data'!$D$4:$D$158,MATCH(J13,OFFSET('Raw Data'!$A$4:$A$158,0,MATCH($B$2,'Raw Data'!$A$2:$BL$2,0)-1),0))","v":"Oklahoma"},{"$f":"INDEX('Raw Data'!$D$4:$D$158,MATCH(K13,OFFSET('Raw Data'!$A$4:$A$158,0,MATCH($B$2,'Raw Data'!$A$2:$BL$2,0)-1),0))","v":"California"},"Total",null,null,"Florida"]
[{"$f":"Selected_Year&State","v":"2010Texas"},{"$f":"SUMPRODUCT(LARGE(--('Raw Data'!$B$4:$B$158=2010)*OFFSET('Raw Data'!$A$4:$A$158,0,MATCH($B$2,'Raw Data'!$A$2:$BL$2,0)-1),B5))","v":12938},{"$f":"SUMPRODUCT(LARGE(--('Raw Data'!$B$4:$B$158=2010)*OFFSET('Raw Data'!$A$4:$A$158,0,MATCH($B$2,'Raw Data'!$A$2:$BL$2,0)-1),C5))","v":13707},{"$f":"SUMPRODUCT(LARGE(--('Raw Data'!$B$4:$B$158=2010)*OFFSET('Raw Data'!$A$4:$A$158,0,MATCH($B$2,'Raw Data'!$A$2:$BL$2,0)-1),D5))","v":14329},{"$f":"SUMPRODUCT(LARGE(--('Raw Data'!$B$4:$B$158=2010)*OFFSET('Raw Data'!$A$4:$A$158,0,MATCH($B$2,'Raw Data'!$A$2:$BL$2,0)-1),E5))","v":14705},{"$f":"SUMPRODUCT(LARGE(--('Raw Data'!$B$4:$B$158=2010)*OFFSET('Raw Data'!$A$4:$A$158,0,MATCH($B$2,'Raw Data'!$A$2:$BL$2,0)-1),F5))","v":18511},{"$f":"SUMPRODUCT(LARGE(--('Raw Data'!$B$4:$B$158=2010)*OFFSET('Raw Data'!$A$4:$A$158,0,MATCH($B$2,'Raw Data'!$A$2:$BL$2,0)-1),G5))","v":22253},{"$f":"SUMPRODUCT(LARGE(--('Raw Data'!$B$4:$B$158=2010)*OFFSET('Raw Data'!$A$4:$A$158,0,MATCH($B$2,'Raw Data'!$A$2:$BL$2,0)-1),H5))","v":24039},{"$f":"SUMPRODUCT(LARGE(--('Raw Data'!$B$4:$B$158=2010)*OFFSET('Raw Data'!$A$4:$A$158,0,MATCH($B$2,'Raw Data'!$A$2:$BL$2,0)-1),I5))","v":26134},{"$f":"SUMPRODUCT(LARGE(--('Raw Data'!$B$4:$B$158=2010)*OFFSET('Raw Data'!$A$4:$A$158,0,MATCH($B$2,'Raw Data'!$A$2:$BL$2,0)-1),J5))","v":28238},{"$f":"SUMPRODUCT(LARGE(--('Raw Data'!$B$4:$B$158=2010)*OFFSET('Raw Data'!$A$4:$A$158,0,MATCH($B$2,'Raw Data'!$A$2:$BL$2,0)-1),K5))","v":36582},null,null,null,"Georgia"]
["Republican",{"$f":"IF(VLOOKUP($L$2&B$12,'Raw Data'!$A:$C,3,0) = $A14,B$13/1000,\"\")","v":""},{"$f":"IF(VLOOKUP($L$2&C$12,'Raw Data'!$A:$C,3,0) = $A14,C$13/1000,\"\")","v":13.707000000000001},{"$f":"IF(VLOOKUP($L$2&D$12,'Raw Data'!$A:$C,3,0) = $A14,D$13/1000,\"\")","v":""},{"$f":"IF(VLOOKUP($L$2&E$12,'Raw Data'!$A:$C,3,0) = $A14,E$13/1000,\"\")","v":14.705},{"$f":"IF(VLOOKUP($L$2&F$12,'Raw Data'!$A:$C,3,0) = $A14,F$13/1000,\"\")","v":""},{"$f":"IF(VLOOKUP($L$2&G$12,'Raw Data'!$A:$C,3,0) = $A14,G$13/1000,\"\")","v":""},{"$f":"IF(VLOOKUP($L$2&H$12,'Raw Data'!$A:$C,3,0) = $A14,H$13/1000,\"\")","v":""},{"$f":"IF(VLOOKUP($L$2&I$12,'Raw Data'!$A:$C,3,0) = $A14,I$13/1000,\"\")","v":26.134},{"$f":"IF(VLOOKUP($L$2&J$12,'Raw Data'!$A:$C,3,0) = $A14,J$13/1000,\"\")","v":28.238},{"$f":"IF(VLOOKUP($L$2&K$12,'Raw Data'!$A:$C,3,0) = $A14,K$13/1000,\"\")","v":""},null,null,null,"Hawaii"]
["Democrat",{"$f":"IF(VLOOKUP($L$2&B$12,'Raw Data'!$A:$C,3,0) = $A15,B$13/1000,\"\")","v":12.938000000000001},{"$f":"IF(VLOOKUP($L$2&C$12,'Raw Data'!$A:$C,3,0) = $A15,C$13/1000,\"\")","v":""},{"$f":"IF(VLOOKUP($L$2&D$12,'Raw Data'!$A:$C,3,0) = $A15,D$13/1000,\"\")","v":14.329000000000001},{"$f":"IF(VLOOKUP($L$2&E$12,'Raw Data'!$A:$C,3,0) = $A15,E$13/1000,\"\")","v":""},{"$f":"IF(VLOOKUP($L$2&F$12,'Raw Data'!$A:$C,3,0) = $A15,F$13/1000,\"\")","v":18.510999999999999},{"$f":"IF(VLOOKUP($L$2&G$12,'Raw Data'!$A:$C,3,0) = $A15,G$13/1000,\"\")","v":22.253},{"$f":"IF(VLOOKUP($L$2&H$12,'Raw Data'!$A:$C,3,0) = $A15,H$13/1000,\"\")","v":24.039000000000001},{"$f":"IF(VLOOKUP($L$2&I$12,'Raw Data'!$A:$C,3,0) = $A15,I$13/1000,\"\")","v":""},{"$f":"IF(VLOOKUP($L$2&J$12,'Raw Data'!$A:$C,3,0) = $A15,J$13/1000,\"\")","v":""},{"$f":"IF(VLOOKUP($L$2&K$12,'Raw Data'!$A:$C,3,0) = $A15,K$13/1000,\"\")","v":36.582000000000001},null,null,null,"Idaho"]
[null,null,null,null,null,null,null,null,null,null,null,null,null,null,"Illinois"]
[null,"Figure","%",null,null,null,null,null,null,null,null,null,null,null,"Indiana"]
["Population",{"$f":"VLOOKUP($A$13,'Raw Data'!$A$2:$BL$158,5,0)/1000000","v":24.899075},{"$f":"B18/$B$18","v":1},null,null,null,null,null,null,null,null,null,null,null,"Iowa"]
["Stayed Put",{"$f":"VLOOKUP($A$13,'Raw Data'!$A$2:$BL$158,7,0)/1000000","v":20.500156},{"$f":"B19/$B$18","v":0.82333002330407856},null,null,null,null,null,null,null,null,null,null,null,"Kansas"]
["Left State",{"$f":"VLOOKUP($A$13,'Raw Data'!$A$2:$BL$158,9,0)/1000000","v":3.7403439999999999},{"$f":"B20/$B$18","v":0.15022019894313343},null,null,null,null,null,null,null,null,null,null,null,"Kentucky"]
["Newborns",{"$f":"B18-SUM(B19:B20)","v":0.65857499999999902},{"$f":"B21/$B$18","v":2.6449777752787965E-2},null,null,null,null,null,null,null,null,null,null,null,"Louisiana"]
[null,null,null,null,null,null,null,null,null,null,null,null,null,null,"Maine"]
[null,null,null,null,null,null,null,null,null,null,null,null,null,null,"Maryland"]
["OVERVIEW TEXT",null,null,null,null,null,null,null,null,null,null,null,null,null,"Massachusetts","Picture Links:"]
["Paragraph 1",{"$f":"State & \"'s top 3 inflow states were \" & K6 & \", \" & J6 & \", & \" & I6 &\". During the entire year of \" & Selected_Year & \", \" & TEXT(L7,\"#,K\") & \" citizens migrated to the state.  This gave \" & State & \" total population of \" & TEXT(B18, \"0.0\") &\" million people in \" & Selected_Year & \". \"","v":"Texas's top 3 inflow states were California, Louisiana, & Florida. During the entire year of 2010, 487K citizens migrated to the state.  This gave Texas total population of 24.9 million people in 2010. "},{"$f":"\"\"","v":""},null,null,null,null,null,null,null,null,null,null,null,"Michigan"]
["Paragraph 2",{"$f":"State & \" had \" & TEXT(C20, \"0.0%\") &\" of the population leave the state during the year.  The top 3 states receiving \" & State & \" citizens were \" & K12 & \", \"& J12 &\", and \"& I12 &\".\"","v":"Texas had 15.0% of the population leave the state during the year.  The top 3 states receiving Texas citizens were California, Oklahoma, and Louisiana."},{"$f":"\"\"","v":""},null,null,null,null,null,null,null,null,null,null,null,"Minnesota",null,null,null,"Top Net Migration Gains"]
[null,null,null,null,null,null,null,null,null,null,null,null,null,null,"Mississippi",null,null,{"$f":"DataPull!C33","v":"Texas"},{"$f":"DataPull!D33","v":74917}]
[null,null,null,null,null,null,null,null,null,null,null,null,null,null,"Missouri",null,null,{"$f":"DataPull!C34","v":"North Carolina"},{"$f":"DataPull!D34","v":56231}]
["COUNTRY:","United States",null,null,null,null,null,null,null,null,null,null,null,null,"Montana",null,null,{"$f":"DataPull!C35","v":"Florida"},{"$f":"DataPull!D35","v":55036}]
[null,null,null,null,null,null,null,null,null,null,null,null,null,null,"Nebraska",null,null,{"$f":"DataPull!C36","v":"Arizona"},{"$f":"DataPull!D36","v":45957}]
[null,"Top Net Population Gains",null,null,null,null,"Top Net Population Losses",null,null,null,null,null,null,null,"Nevada",null,null,{"$f":"DataPull!C37","v":"Colorado"},{"$f":"DataPull!D37","v":45746}]
[null,"Rank","State","Amt",null,null,"Rank","State","Amt",null,null,null,null,null,"New Hampshire"]
[null,1,{"$f":"INDEX('Raw Data'!$D$3:$D$158,MATCH(DataPull!D33,'Raw Data'!$K$3:$K$158,0))","v":"Texas"},{"$f":"LARGE(--('Raw Data'!$B$3:$B$158=DataPull!$L$2)*--('Raw Data'!$K$3:$K$158>0)*'Raw Data'!$K$3:$K$158,B33)","v":74917},null,null,1,{"$f":"INDEX('Raw Data'!$D$3:$D$158,MATCH(DataPull!I33,'Raw Data'!$K$3:$K$158,0))","v":"California"},{"$f":"-LARGE(ABS(--('Raw Data'!$B$3:$B$158=DataPull!$L$2)*--('Raw Data'!$K$3:$K$158<0)*'Raw Data'!$K$3:$K$158),G33)","v":-129239},null,null,null,null,null,"New Jersey"]
[null,2,{"$f":"INDEX('Raw Data'!$D$3:$D$158,MATCH(DataPull!D34,'Raw Data'!$K$3:$K$158,0))","v":"North Carolina"},{"$f":"LARGE(--('Raw Data'!$B$3:$B$158=DataPull!$L$2)*--('Raw Data'!$K$3:$K$158>0)*'Raw Data'!$K$3:$K$158,B34)","v":56231},null,null,2,{"$f":"INDEX('Raw Data'!$D$3:$D$158,MATCH(DataPull!I34,'Raw Data'!$K$3:$K$158,0))","v":"New York"},{"$f":"-LARGE(ABS(--('Raw Data'!$B$3:$B$158=DataPull!$L$2)*--('Raw Data'!$K$3:$K$158<0)*'Raw Data'!$K$3:$K$158),G34)","v":-93712},null,null,null,null,null,"New Mexico",null,null,null,"Top Net Migration Losses"]
[null,3,{"$f":"INDEX('Raw Data'!$D$3:$D$158,MATCH(DataPull!D35,'Raw Data'!$K$3:$K$158,0))","v":"Florida"},{"$f":"LARGE(--('Raw Data'!$B$3:$B$158=DataPull!$L$2)*--('Raw Data'!$K$3:$K$158>0)*'Raw Data'!$K$3:$K$158,B35)","v":55036},null,null,3,{"$f":"INDEX('Raw Data'!$D$3:$D$158,MATCH(DataPull!I35,'Raw Data'!$K$3:$K$158,0))","v":"Illinois"},{"$f":"-LARGE(ABS(--('Raw Data'!$B$3:$B$158=DataPull!$L$2)*--('Raw Data'!$K$3:$K$158<0)*'Raw Data'!$K$3:$K$158),G35)","v":-73620},null,null,null,null,null,"New York",null,null,{"$f":"DataPull!H33","v":"California"},{"$f":"-DataPull!I33","v":129239}]
[null,4,{"$f":"INDEX('Raw Data'!$D$3:$D$158,MATCH(DataPull!D36,'Raw Data'!$K$3:$K$158,0))","v":"Arizona"},{"$f":"LARGE(--('Raw Data'!$B$3:$B$158=DataPull!$L$2)*--('Raw Data'!$K$3:$K$158>0)*'Raw Data'!$K$3:$K$158,B36)","v":45957},null,null,4,{"$f":"INDEX('Raw Data'!$D$3:$D$158,MATCH(DataPull!I36,'Raw Data'!$K$3:$K$158,0))","v":"New Jersey"},{"$f":"-LARGE(ABS(--('Raw Data'!$B$3:$B$158=DataPull!$L$2)*--('Raw Data'!$K$3:$K$158<0)*'Raw Data'!$K$3:$K$158),G36)","v":-66603},null,null,null,null,null,"North Carolina",null,null,{"$f":"DataPull!H34","v":"New York"},{"$f":"-DataPull!I34","v":93712}]
[null,5,{"$f":"INDEX('Raw Data'!$D$3:$D$158,MATCH(DataPull!D37,'Raw Data'!$K$3:$K$158,0))","v":"Colorado"},{"$f":"LARGE(--('Raw Data'!$B$3:$B$158=DataPull!$L$2)*--('Raw Data'!$K$3:$K$158>0)*'Raw Data'!$K$3:$K$158,B37)","v":45746},null,null,5,{"$f":"INDEX('Raw Data'!$D$3:$D$158,MATCH(DataPull!I37,'Raw Data'!$K$3:$K$158,0))","v":"Michigan"},{"$f":"-LARGE(ABS(--('Raw Data'!$B$3:$B$158=DataPull!$L$2)*--('Raw Data'!$K$3:$K$158<0)*'Raw Data'!$K$3:$K$158),G37)","v":-62058},null,null,null,null,null,"North Dakota",null,null,{"$f":"DataPull!H35","v":"Illinois"},{"$f":"-DataPull!I35","v":73620}]
[null,null,null,null,null,null,null,null,null,null,null,null,null,null,"Ohio",null,null,{"$f":"DataPull!H36","v":"New Jersey"},{"$f":"-DataPull!I36","v":66603}]
[null,null,null,null,null,null,null,null,null,null,null,null,null,null,"Oklahoma",null,null,{"$f":"DataPull!H37","v":"Michigan"},{"$f":"-DataPull!I37","v":62058}]
[" U.S. Proportion of Dems & Reps",null,null,null,null,null,null,null,null,null,null,null,null,null,"Oregon"]
["Republican",{"$f":"SUMPRODUCT(--('Raw Data'!$B$3:$B$158=DataPull!$L$2)*('Raw Data'!$C$3:$C$158=A41)*('Raw Data'!$D$3:$D$158<>'Raw Data'!$D$3))","v":22},null,null,null,null,null,null,null,null,null,null,null,null,"Pennsylvania"]
["Democrat",{"$f":"SUMPRODUCT(--('Raw Data'!$B$3:$B$158=DataPull!$L$2)*('Raw Data'!$C$3:$C$158=A42)*('Raw Data'!$D$3:$D$158<>'Raw Data'!$D$3))","v":29},null,null,null,null,null,null,null,null,null,null,null,null,"Rhode Island"]
["President","Democrat",null,null,null,null,null,null,null,null,null,null,null,null,"South Carolina"]
[null,null,null,null,null,null,null,null,null,null,null,null,null,null,"South Dakota"]
[null,null,null,null,null,null,null,null,null,null,null,null,null,null,"Tennessee"]
[null,null,null,null,null,null,null,null,null,null,null,null,null,null,"Texas"]
[null,null,null,null,null,null,null,null,null,null,null,null,null,null,"Utah"]
[null,null,null,null,null,null,null,null,null,null,null,null,null,null,"Vermont"]
[null,null,null,null,null,null,null,null,null,null,null,null,null,null,"Virginia"]
[null,null,null,null,null,null,null,null,null,null,null,null,null,null,"Washington"]
[null,null,null,null,null,null,null,null,null,null,null,null,null,null,"West Virginia"]
[null,null,null,null,null,null,null,null,null,null,null,null,null,null,"Wisconsin"]
[null,null,null,null,null,null,null,null,null,null,null,null,null,null,"Wyoming"]

{"sheet":"Raw Data","index":2,"n_rows":158,"n_cols":64,"rows_kept":158,"cut":false,"hidden":false,"merged":[]}
[null,null,null,null,"Population 1 year and over",null,"Same residence 1 year ago",null,"Different residence, same state 1 year ago",null,"State of Residence Last year (Estimate)"]
["ID","Year","Political Influence","Current residence in --","Estimate","MOE","Estimate","MOE","Estimate","MOE","Net Gain/Loss","Percent Gain/Loss","TOTAL","Alabama","Alaska","Arizona","Arkansas","California","Colorado","Connecticut","Delaware","District of Columbia","Florida","Georgia","Hawaii","Idaho","Illinois","Indiana","Iowa","Kansas","Kentucky","Louisiana","Maine","Maryland","Massachusetts","Michigan","Minnesota","Mississippi","Missouri","Montana","Nebraska","Nevada","New Hampshire","New Jersey","New Mexico","New York","North Carolina","North Dakota","Ohio","Oklahoma","Oregon","Pennsylvania","Rhode Island","South Carolina","South Dakota","Tennessee","Texas","Utah","Vermont","Virginia","Washington","West Virginia","Wisconsin","Wyoming"]
[{"$f":"B3&D3","v":"2010United States"},2010,"Democrat","United States",305628607,29823,258552348,236128,38582885,213239,null,null,6743229,99221,94692,176768,64264,573988,140620,89360,30055,56052,427853,244992,49218,53122,277579,130170,66922,90681,92999,88131,32209,159866,144152,178207,104765,68363,148055,35870,43531,109409,38399,193972,50438,363139,207025,24450,188013,90616,100185,209810,24948,117569,27915,143135,411641,75541,18380,232002,166162,49349,111240,28186]
[{"$f":"B4&D4","v":"2010Alabama"},2010,"Republican","Alabama",4729509,3716,3987155,21708,620465,21448,{"$f":"M4-INDEX($M$3:$BL$3,1,MATCH(D4,$M$2:$BL$2,0))","v":9502},{"$f":"K4/E4","v":2.0090880469833127E-3},108723,0,3013,676,1481,3827,1278,454,811,211,15062,21644,267,304,2503,3945,669,649,1967,1901,97,716,435,2334,386,7233,1373,229,169,265,0,356,650,3686,2371,169,2222,880,485,1477,0,2368,31,7409,6500,1336,0,2490,1171,41,1155,27]
["2010Alaska",2010,"Republican","Alaska",702974,1600,565031,7596,95878,7984,-58366,{"$f":"K5/E5","v":-8.3027252786020536E-2},36326,477,0,1354,47,3906,1930,0,0,14,2315,1251,1705,895,388,9,262,106,1440,100,574,704,107,923,530,263,0,616,215,240,316,413,421,255,698,69,156,1455,1793,126,0,121,531,477,4123,1274,353,714,2421,0,158,81]
["2010Arizona",2010,"Republican","Arizona",6332786,4439,5069002,35057,1001991,32027,45957,7.2569955782494462E-3,222725,416,3109,0,689,47164,7687,479,738,0,7712,4261,1966,2147,12250,2690,3008,1935,1705,2014,241,1284,1449,6354,5421,272,4567,1343,1750,10342,64,1782,4419,6618,4463,826,5225,2910,5430,5535,403,2310,1351,3061,14705,7164,664,3413,12645,595,5556,593]
["2010Arkansas",2010,"Republican","Arkansas",2888304,2453,2387806,18627,412997,17485,14863,5.1459264675740501E-3,79127,1405,934,777,0,4457,2535,451,0,154,3578,3921,129,618,3221,722,85,3611,2540,4012,0,306,190,1506,222,2764,7320,85,394,67,0,77,0,289,1561,0,1137,8607,239,731,0,1496,243,2653,13707,361,0,494,264,0,821,443]
["2010California",2010,"Democrat","California",36907897,10889,30790221,71574,5413287,66460,-129239,-3.5016625303793385E-3,444749,3364,9579,33854,4172,0,15662,4631,643,3683,20362,8820,9528,5719,16482,6550,3163,3857,3394,2989,1796,10626,11969,10435,5095,2757,6921,3009,3062,27724,1614,10108,4632,20981,9593,392,8170,5708,20913,9948,526,5016,1604,4349,36582,10653,525,14232,30544,1446,6031,1336]
["2010Colorado",2010,"Democrat","Colorado",4988190,3936,4042039,25546,725413,23003,45746,9.1708615750402452E-3,186366,954,2225,12287,1034,26089,0,459,486,479,8849,6445,2355,839,6950,3296,2140,4308,1961,968,532,1532,2242,4587,2878,1277,1978,2042,4065,4131,791,1259,3921,4594,2940,802,2838,3464,4330,3928,192,1231,1847,1628,22253,4748,350,2739,7583,623,2499,4418]
["2010Connecticut",2010,"Democrat","Connecticut",3541146,2779,3100742,16358,342904,15404,-12027,-3.3963581281314017E-3,77333,896,0,664,334,4479,547,0,149,331,9207,748,182,147,3391,1074,108,0,400,0,528,1531,8510,770,934,67,42,0,0,507,1049,3475,112,20727,1345,0,1296,145,640,1955,1728,1140,0,430,1887,0,458,1735,2084,442,1092,47]
["2010Delaware",2010,"Democrat","Delaware",889812,1573,764640,9145,90001,8498,704,7.9117836127181923E-4,30759,128,68,60,0,353,178,714,0,432,2362,585,0,0,612,0,0,28,163,0,294,4969,689,61,55,0,539,73,0,106,139,3678,59,4251,424,0,325,0,0,7318,149,195,0,146,178,0,0,1051,377,0,0,0]
["2010District of Columbia",2010,"Democrat","District of Columbia",596747,1124,474676,8281,63766,6163,-4808,-8.0570157872599281E-3,51244,360,591,662,155,4205,656,926,0,0,1100,1597,0,0,615,711,392,83,94,0,76,13503,1376,126,87,0,272,0,62,0,137,1924,61,3852,1897,98,598,0,601,2378,249,380,0,591,1180,0,199,7915,284,860,391,0]
["2010Florida",2010,"Democrat","Florida",18647600,7733,15554008,45602,2459530,38387,55036,2.9513717582959737E-3,482889,15830,5887,3907,3611,22130,6428,11183,3099,1110,0,35615,2021,884,17432,9030,2921,4136,6321,7232,5497,13241,13900,21359,5439,7929,7984,338,1544,7050,3645,22344,900,55011,19108,794,21047,3466,1655,19935,1982,10759,430,12882,24039,2833,1442,20080,3573,5634,8081,191]
["2010Georgia",2010,"Republican","Georgia",9587237,5924,8015409,37393,1278548,36794,4467,4.6593194681637682E-4,249459,13840,3645,2554,599,8909,3224,2619,837,1708,49901,0,1040,414,9736,2649,1096,1355,6525,3645,0,5382,3910,6857,1169,2380,3072,52,148,1155,162,4151,826,12472,15361,0,9323,2070,843,6294,43,15562,557,14445,11424,380,361,8393,4495,358,3416,102]
["2010Hawaii",2010,"Democrat","Hawaii",1346274,1690,1140572,10422,134315,9295,4363,3.2407964500540008E-3,53581,749,743,1398,0,12677,1073,307,0,0,4599,2013,0,42,715,192,68,387,95,88,89,990,1283,627,476,234,170,150,0,1925,496,443,11,1339,1510,69,625,57,1834,553,644,322,267,142,6694,467,0,2644,2705,483,1168,18]
["2010Idaho",2010,"Republican","Idaho",1550967,1954,1279856,12606,209272,10887,2516,1.6222137543867793E-3,55638,376,3264,3086,45,8932,1372,0,0,144,612,313,123,0,169,132,773,422,315,59,202,44,115,427,465,37,425,1509,0,2110,109,97,694,155,134,96,325,711,3202,172,0,0,296,1153,1746,8014,0,611,10876,133,233,1410]
["2010Illinois",2010,"Democrat","Illinois",12680126,5467,11009852,32636,1404525,28126,-73620,-5.8059359977968676E-3,203959,1397,1764,5921,1194,16205,3850,2264,56,1047,8051,6781,1224,313,0,21918,9141,1970,2921,1419,55,1985,2811,11865,4300,1093,16703,928,546,2541,206,2331,996,8479,5504,1112,5103,1459,1224,5190,838,1565,292,3999,12245,658,260,3831,1642,812,15364,586]
["2010Indiana",2010,"Democrat","Indiana",6414862,4257,5431015,24897,833086,22796,-2817,-4.3913649272579833E-4,127353,1502,177,2210,1548,8959,1362,544,0,181,5496,1623,267,772,27950,0,1885,1582,10643,749,30,1641,103,9361,916,270,3893,164,705,227,114,1876,188,2564,2828,0,13272,681,423,2668,174,584,216,3093,6335,444,45,3673,571,669,1762,413]
["2010Iowa",2010,"Democrat","Iowa",3013053,2381,2553210,15158,375650,12448,5635,1.870196110058469E-3,72557,330,519,1483,247,2847,2554,114,0,53,1364,973,866,315,17016,1710,0,1520,334,315,0,134,189,1439,7564,117,6031,836,4783,623,381,472,492,273,1123,601,632,679,1071,378,0,591,1992,1617,4131,146,45,303,538,0,2705,111]
["2010Kansas",2010,"Republican","Kansas",2820894,2731,2341401,17752,372161,15608,4378,1.5519902555714607E-3,95059,44,1050,2238,1596,6125,6022,85,238,0,2863,1916,128,398,2943,1544,1875,0,1048,890,0,1369,100,806,1562,167,23384,289,2678,1318,76,1743,873,2390,1083,225,1509,7568,514,563,39,137,352,1152,9217,238,75,1648,1175,0,1233,573]
["2010Kentucky",2010,"Republican","Kentucky",4296639,3389,3638259,20337,519887,18955,25444,5.9218379761483333E-3,118443,2161,3017,2598,558,3779,329,698,38,147,10119,6397,520,71,4659,11906,656,1109,0,437,0,1395,1036,4672,930,1442,3153,0,858,76,0,1147,122,2057,3758,0,15598,1153,181,2618,289,1286,163,11153,5758,905,525,3671,716,2297,1993,292]
["2010Louisiana",2010,"Republican","Louisiana",4483529,3720,3826390,25103,547291,22645,9758,{"$f":"K22/E22","v":2.1764105908537671E-3},97889,5740,1504,1960,2382,5751,1215,89,0,264,9394,5766,342,202,2131,948,625,706,1656,0,162,963,995,1301,569,7032,2852,40,119,1552,462,171,294,2161,1443,438,1100,1074,281,1350,0,1130,0,1853,26134,473,0,1278,1509,210,237,31]
["2010Maine",2010,"Democrat","Maine",1313902,1878,1136780,8034,146735,7677,-4451,-3.3876194723807406E-3,27758,402,424,254,67,1066,478,1361,174,55,3025,844,62,0,311,259,337,56,484,115,0,243,3521,122,91,0,201,275,204,345,4058,902,234,2339,1001,55,315,124,0,375,379,148,0,249,458,390,420,654,381,0,0,500]
["2010Maryland",2010,"Democrat","Maryland",5716785,3648,4917637,22981,588879,20180,4618,8.0779668992274508E-4,164484,1641,2672,1124,273,8206,2501,1603,8340,23202,6564,3454,422,357,3300,431,160,781,396,1376,53,0,1983,3572,820,403,1147,86,54,979,1369,9058,238,10736,5787,0,3277,607,723,13467,782,1710,49,2669,5883,655,350,24765,1542,4363,324,230]
["2010Massachusetts",2010,"Democrat","Massachusetts",6489250,3528,5583650,23686,706624,22760,-3990,-6.148630427245059E-4,140162,583,1891,1572,206,14971,1051,13270,131,1539,11118,1409,682,79,2842,1891,307,0,340,0,4666,3660,0,1624,2185,453,1957,388,46,792,9911,4709,161,20002,2798,0,2163,158,228,5316,6965,1659,0,918,7073,207,1526,4542,1627,0,546,0]
["2010Michigan",2010,"Democrat","Michigan",9762127,4595,8310098,29394,1291901,28130,-62058,-6.357016252708042E-3,116149,2403,1040,3197,636,6726,2031,277,167,471,11646,3913,313,66,10651,7816,758,640,2353,1342,645,620,1206,0,1275,656,2921,312,213,1874,437,1676,669,3135,2444,53,9783,2276,537,3134,653,1446,706,4453,7184,545,45,2073,1427,446,6291,568]
["2010Minnesota",2010,"Democrat","Minnesota",5244256,3049,4480630,17843,647946,16565,-14893,-2.8398689919027597E-3,89872,266,1169,4165,279,6233,2521,211,176,306,2575,1776,227,231,6641,1120,4948,1067,402,519,172,1259,1092,2631,0,196,1549,1020,734,540,183,513,151,1309,1673,7316,1035,284,738,730,123,1597,3237,1155,2619,1013,0,2371,1328,200,17929,343]
["2010Mississippi",2010,"Republican","Mississippi",2931228,3253,2510729,16977,340266,16300,3958,1.3502873198536587E-3,72321,8306,1192,187,4941,3000,1167,71,0,0,4814,4014,276,121,3030,1403,114,330,407,7390,0,649,107,2495,863,0,959,314,0,408,0,403,633,1026,2227,0,1312,663,0,750,145,1860,56,8158,5755,232,0,572,508,94,879,490]
["2010Missouri",2010,"Republican","Missouri",5920858,4730,4968921,23164,786726,21904,-2829,-4.7780237256154427E-4,145226,819,1051,2988,4381,9840,1903,243,314,478,8317,2492,380,830,21277,3351,4708,23427,2552,2238,171,1359,1395,2610,1701,1183,0,220,2636,1060,108,1320,150,2630,1825,848,2163,4647,314,1639,0,954,512,3311,12884,1319,498,3206,1107,177,1331,359]
["2010Montana",2010,"Republican","Montana",978507,1744,821709,7063,117752,6986,-240,-2.4527162299298828E-4,35630,212,650,1909,672,5756,2185,128,71,0,1373,46,0,1458,1094,251,169,60,321,85,76,51,59,648,1323,242,564,0,340,548,0,0,660,246,1072,1677,89,182,1620,419,0,110,295,111,2101,964,0,497,3250,0,357,1689]
["2010Nebraska",2010,"Republican","Nebraska",1802697,2153,1497138,11336,247005,9960,7759,4.3041065692126851E-3,51290,232,35,2322,674,4430,4182,361,177,0,1775,1202,257,127,1820,639,5536,2484,153,89,0,77,100,726,2254,823,2723,112,0,232,0,143,831,111,442,777,1232,702,506,345,0,65,2936,77,4445,537,0,772,1230,73,1046,1478]
["2010Nevada",2010,"Democrat","Nevada",2667364,3181,2030410,22983,517261,21311,-6732,-2.523840015835859E-3,102677,150,511,7818,530,35472,2935,648,0,0,3579,1187,4363,1686,1711,739,543,453,569,733,0,485,1275,2202,805,946,1747,770,1129,0,59,1528,1220,1204,957,37,1554,886,2629,1567,167,312,1203,706,5224,4500,197,1832,3290,56,419,144]
["2010New Hampshire",2010,"Democrat","New Hampshire",1303865,1720,1118359,9822,141213,9061,968,7.4240814808281528E-4,39367,152,0,544,0,1692,240,3134,0,298,1659,0,51,66,850,23,109,57,0,19,3242,49,13752,230,240,25,295,486,0,95,0,540,276,2462,471,0,28,0,508,674,988,51,0,372,1570,279,2566,745,261,0,268,0]
["2010New Jersey",2010,"Democrat","New Jersey",8709933,4515,7841470,25935,684482,23318,-66603,-7.6467867204030159E-3,127369,616,383,1625,258,8777,807,2503,1543,431,9841,4588,385,91,2656,402,332,442,91,249,95,4231,2626,1070,322,450,727,122,261,874,705,0,421,41374,3052,0,1584,32,613,22225,332,1134,0,852,3434,178,57,2670,964,358,586,0]
["2010New Mexico",2010,"Democrat","New Mexico",2039549,2727,1735950,14043,220663,12854,23167,1.1358883753221914E-2,73605,751,969,6117,77,6547,2852,25,391,56,3259,1977,122,755,526,465,0,751,739,65,94,1968,2076,1460,179,719,138,1003,530,4192,79,160,0,784,1793,79,1712,1182,1659,809,46,152,204,1269,18511,1601,309,290,3004,0,407,752]
["2010New York",2010,"Democrat","New York",19171916,7371,16976205,41292,1779540,36331,{"$f":"M36-INDEX($M$3:$BL$3,1,MATCH(D36,$M$2:$BL$2,0))","v":-93712},-4.8879830268398839E-3,269427,1310,5070,2649,362,25177,3135,15338,2603,1983,30553,7676,259,198,6533,2497,477,1189,804,1321,2270,5912,16855,4779,1649,872,1870,237,886,2077,2636,35333,829,0,13322,0,6510,2298,2284,20514,1913,7161,521,1730,9692,910,2900,8881,2503,444,2354,151]
["2010North Carolina",2010,"Democrat","North Carolina",9443000,5070,7982017,29580,1141001,25307,56231,5.9547813194959229E-3,263256,3044,1618,2847,550,16699,1842,3752,479,1691,28983,15943,1567,724,5657,4132,1077,2192,4419,2180,2259,9881,4052,5789,1839,1187,1932,230,516,698,2130,7195,1186,19406,0,243,8661,1453,1796,11155,97,23196,362,8685,14329,790,350,25662,2874,3025,2012,870]
["2010North Dakota",2010,"Republican","North Dakota",665654,1209,556222,6833,75720,5430,5650,8.487893109633533E-3,30100,109,1066,662,168,1411,873,30,0,175,492,799,53,69,39,45,289,114,97,374,0,121,52,298,12350,0,197,1236,328,382,0,144,380,188,637,0,134,108,313,392,0,0,1038,273,2513,462,0,25,696,0,749,219]
["2010Ohio",2010,"Democrat","Ohio",11405101,4931,9745227,23258,1453401,23324,-15380,-1.3485194037299625E-3,172633,1289,1556,4715,434,8997,2859,1307,15,972,16495,9502,436,564,7092,9438,1270,1016,9159,743,291,3828,3686,15130,2298,89,1171,460,1531,2240,175,2465,515,5988,5985,26,0,1228,342,12012,444,2479,207,4987,7465,485,182,6769,2567,7814,1771,144]
["2010Oklahoma",2010,"Republican","Oklahoma",3716264,3181,3065497,21363,528824,18463,15895,{"$f":"K40/E40","v":4.2771450036918797E-3},106511,1612,1397,2759,5873,9429,3184,68,109,0,5438,3159,773,611,2679,957,1108,5024,877,2208,298,382,465,1047,599,1733,4102,448,829,1079,69,890,2723,1118,1991,139,1385,0,398,1316,119,596,83,1872,28238,428,93,2286,2035,221,551,1713]
["2010Oregon",2010,"Democrat","Oregon",3794008,3282,3110896,20156,545841,17758,16515,4.3529164935867297E-3,116700,400,2027,5264,246,34190,2050,270,0,217,2273,688,2323,4129,1565,317,161,678,0,0,0,595,1471,1159,668,735,1786,3386,777,2805,317,544,981,2538,1040,592,1541,821,0,1689,0,989,741,787,3826,2879,456,1124,22793,358,1981,523]
["2010Pennsylvania",2010,"Democrat","Pennsylvania",12577555,4619,11053022,29699,1239199,26490,25770,2.048887880037098E-3,235580,369,2185,3668,807,12077,3657,4007,4608,1621,18212,4644,332,380,4490,2018,227,1426,1675,625,1621,18281,4455,4961,1491,563,1725,339,551,1810,729,42456,1250,30481,7611,521,14545,1254,918,0,377,1315,966,1611,7778,1048,215,10558,2495,4258,1300,1069]
["2010Rhode Island",2010,"Democrat","Rhode Island",1042240,1435,900283,9035,99603,7344,7111,6.8228047282775563E-3,32059,136,0,324,0,1697,59,4090,0,146,1336,382,274,0,1210,206,48,0,0,0,447,977,8639,77,47,0,47,0,0,297,333,1868,0,4583,1376,62,0,199,0,560,0,61,48,71,678,0,72,1399,160,150,0,0]
["2010South Carolina",2010,"Republican","South Carolina",4577399,3786,3870879,23788,537961,21768,34872,7.6183002617862244E-3,152441,1741,1670,1457,365,4691,1867,3998,249,38,16060,17486,813,233,4253,2174,703,514,2211,2059,603,5184,3765,3709,818,1175,1371,0,0,1173,486,4908,1390,7912,20749,118,3883,1458,1020,4689,154,0,95,3816,4965,455,478,9786,3070,1190,1057,382]
["2010South Dakota",2010,"Republican","South Dakota",805616,1372,680993,6027,96805,5853,-2138,-2.6538698337669558E-3,25777,325,25,745,61,1338,807,0,0,0,251,24,75,457,80,439,3520,571,82,129,0,0,407,144,4615,201,252,560,2260,38,0,0,38,758,262,2020,160,296,122,209,0,0,0,0,1334,0,0,224,1564,0,736,648]
["2010Tennessee",2010,"Republican","Tennessee",6282706,4009,5299496,24505,801355,21988,16643,2.6490177958351066E-3,159778,8897,343,2291,4736,8019,1858,765,248,394,14168,11065,243,333,3162,4764,1052,2506,11188,2602,84,1450,1733,5529,1504,9029,4342,290,187,2433,197,2230,621,4800,7102,0,4462,669,430,2562,805,4765,63,0,8701,2062,0,8650,1412,2201,2831,0]
["2010Texas",2010,"Republican","Texas",24899075,8102,20500156,52416,3740344,51566,74917,3.0088266331178971E-3,486558,8636,11613,16521,15251,68959,16361,924,704,460,26668,16671,3718,2033,20169,6985,3946,11598,5153,31149,1318,4724,7139,13775,6088,7773,12061,1027,4893,8324,1067,7058,11752,16624,12183,2452,8317,22969,4373,7161,975,5249,1936,13044,0,4123,52,13713,8847,2221,5927,1874]
["2010Utah",2010,"Republican","Utah",2724064,2775,2240636,18397,388410,17535,2239,8.2193369906140236E-4,77780,93,1798,8147,316,12187,3987,119,0,138,2097,966,932,7692,1831,517,483,299,235,46,148,426,246,261,914,127,1255,1929,118,4549,0,247,518,1462,1167,0,1527,886,2525,557,0,838,875,459,5305,0,297,3005,3792,0,338,2126]
["2010Vermont",2010,"Democrat","Vermont",619363,779,534975,5691,59032,4857,4149,6.6988179791172544E-3,22529,0,184,65,0,1001,326,1287,87,9,2063,496,49,0,370,0,91,0,176,0,824,300,3599,201,85,0,51,236,0,58,2760,751,0,4056,539,30,50,0,100,524,227,134,153,125,565,0,0,400,128,0,377,52]
["2010Virginia",2010,"Democrat","Virginia",7930773,4735,6752310,28251,870491,21599,27505,3.4681360820691754E-3,259507,2671,3296,3807,1233,17088,3229,2468,1265,10593,18165,11927,2347,1159,7576,2892,1135,2103,2051,2148,1494,24822,4104,5733,462,1858,4262,866,523,748,372,6825,1098,17525,23829,201,7708,781,2137,11796,1543,8339,98,5842,12938,1551,676,0,4373,6779,2648,423]
["2010Washington",2010,"Democrat","Washington",6661321,4568,5464985,26926,946923,24983,25622,3.8463842231893646E-3,191784,1322,5644,5971,658,39468,4883,642,202,243,5378,3107,4246,12661,3931,1912,1685,1694,886,1011,717,629,1448,2871,1323,737,3727,5094,323,5310,282,721,1012,4140,2143,515,2727,1986,26235,2893,220,3047,866,789,11338,4020,981,7266,0,62,2180,638]
["2010West Virginia",2010,"Republican","West Virginia",1833535,1890,1625125,9824,166168,9198,-9740,-5.3121429370042023E-3,39609,41,1326,0,0,760,608,84,556,480,1842,485,0,88,356,366,0,161,851,60,0,4249,191,657,0,44,160,39,0,25,107,906,0,611,2552,268,7925,229,0,4908,238,647,0,1160,968,112,208,4999,192,0,150,0]
["2010Wisconsin",2010,"Democrat","Wisconsin",5623196,3124,4824045,20412,691592,17462,-18175,-3.2321476967902239E-3,93065,552,798,1854,518,4506,1890,359,351,98,4492,1656,550,902,20299,2563,2300,752,287,331,448,1088,992,6317,16741,810,1716,154,853,1049,69,632,123,1291,1817,497,1674,89,1444,2211,0,1142,235,856,3039,476,75,771,1013,256,0,129]
["2010Wyoming",2010,"Republican","Wyoming",556954,1133,444614,8794,82255,8679,-140,-2.513672583373133E-4,28046,172,0,1511,0,2784,4390,0,0,0,396,745,25,942,415,132,462,532,519,107,0,51,252,570,218,0,421,2528,1711,416,0,0,707,146,34,233,56,62,14,95,0,220,258,495,1990,3226,75,580,556,0,0,0]
["2011United States",2011,"Democrat","United States",307900319,29996,261087925,263315,37998701,233440,null,null,6987416,106806,88850,211816,77226,562343,160623,91295,26631,49732,437202,248892,61940,57831,269008,143228,74516,94180,99256,86593,33729,165041,145869,186505,103253,68597,138404,31204,52809,115943,43277,216369,61431,377800,225147,26563,206049,81009,109795,215127,31065,121426,29383,154243,404839,73211,18172,229227,190644,45956,105370,31991]
["2011Alabama",2011,"Republican","Alabama",4745278,4078,4024442,22751,588293,20366,{"$f":"M56-INDEX($M$55:$BL$55,1,MATCH(D56,$M$2:$BL$2,0))","v":10920},2.3012350382843744E-3,117726,0,1771,1677,1642,3389,348,2921,232,399,20063,19346,1259,137,6991,1434,30,842,2686,2413,626,1606,112,2797,327,3945,1086,317,770,257,64,1996,119,1108,2697,284,2596,973,169,1075,0,2036,90,8710,7973,300,66,4935,2621,65,417,9]
["2011Alaska",2011,"Republican","Alaska",711962,1401,571857,8892,100280,8388,-53766,-7.5518075402900717E-2,35084,93,0,2467,190,3098,1583,138,11,140,1188,556,1366,475,985,181,319,750,237,1077,0,216,141,771,593,554,921,248,5,532,520,128,226,940,470,0,319,616,2161,378,0,186,301,388,2492,662,68,1488,4548,89,23,246]
["2011Arizona",2011,"Republican","Arizona",6402301,5660,5107496,39045,1028366,36556,11061,1.7276601022038795E-3,222877,833,5001,0,1066,49635,10189,1875,0,389,3732,2206,2199,2190,10035,5855,4526,1708,2134,844,0,1918,743,9396,3297,1226,3872,2431,1393,8756,228,3379,4610,3880,2548,1159,4682,3219,4613,3436,72,1774,1657,1680,12688,10577,0,2233,13940,70,6473,2510]
["2011Arkansas",2011,"Republican","Arkansas",2906632,2928,2421746,18606,405831,18050,-7381,-2.5393651483916779E-3,69845,691,560,439,0,4077,746,519,79,0,3067,1446,13,179,3684,1362,851,2008,213,2120,30,133,781,1881,232,1731,7314,713,332,641,52,341,775,674,1664,214,174,3761,632,567,0,235,0,6462,14767,0,0,1245,1477,24,687,252]
["2011California",2011,"Democrat","California",37222678,9999,31213310,71183,5271168,68394,-93915,-2.5230586579504033E-3,468428,2087,7358,35650,2648,0,21245,3073,1302,3240,22094,13303,9864,4796,20834,4673,3324,2810,1201,3600,1658,7793,10244,12069,5687,2092,7677,2599,1955,36159,1222,8053,5904,25629,8708,1392,10474,5113,18165,8550,1103,5758,1004,8761,37087,8944,745,15753,36481,832,5668,2047]
["2011Colorado",2011,"Democrat","Colorado",5048443,4037,4048042,22888,763233,18937,41501,8.2205543372481371E-3,202124,2340,3191,12338,1615,23234,0,1567,501,298,8075,3250,1852,1578,6027,2116,3510,3718,1361,908,1358,3303,2157,3225,3055,879,4552,4079,4582,4061,489,2863,8797,3998,4756,2249,5527,3824,5543,3348,435,718,1340,3193,22390,3856,914,6281,5524,412,3995,2942]
["2011Connecticut",2011,"Democrat","Connecticut",3548667,2644,3139496,16755,316883,15392,-19793,-5.5775873024997841E-3,71502,101,180,1387,84,3699,1502,0,62,607,4771,2000,587,133,1843,168,67,16,0,315,259,1267,8691,692,76,69,365,206,62,160,1221,3809,265,20015,1029,0,1383,217,117,3668,1488,997,0,123,1214,398,608,2555,2255,46,660,65]
["2011Delaware",2011,"Democrat","Delaware",897187,1369,775414,8584,83156,6851,7281,8.1153650242368654E-3,33912,81,329,541,0,699,169,66,0,154,810,639,201,441,34,210,0,7,305,0,0,4238,806,43,201,0,713,0,12,0,0,6297,0,3141,388,0,664,27,0,8571,131,153,0,221,883,475,0,1064,482,198,55,463]
["2011District of Columbia",2011,"Democrat","District of Columbia",611608,1403,489659,6701,66519,6073,-1666,-2.7239669853893343E-3,48066,13,135,43,81,3797,452,981,128,0,1254,937,372,68,1397,128,241,6,297,0,0,14129,2048,1108,409,83,112,38,79,238,145,1035,0,2313,1716,285,306,0,51,1589,50,357,104,421,1083,75,445,7975,476,120,946,0]
["2011Florida",2011,"Democrat","Florida",18863948,8536,15742168,59355,2454255,53419,61395,3.2546209308889104E-3,498597,12635,7405,8451,3025,22420,9383,11704,1264,891,0,38658,3639,312,19152,11472,1846,2661,5441,6094,4689,15410,13701,19640,4663,5175,7114,559,3857,3527,4324,25206,1376,59288,23983,514,18191,2600,3315,20821,5002,11953,716,10451,25532,2343,2019,16614,6339,4964,7412,846]
["2011Georgia",2011,"Republican","Georgia",9699859,5580,8095407,40769,1289450,37444,22185,2.287146648214165E-3,271077,18799,1079,4292,2112,14949,2325,709,619,364,42666,0,1006,126,6080,2442,950,4513,3686,6541,408,3708,4436,6992,1808,5380,2514,246,4144,774,132,8371,791,14454,19138,201,6863,1632,727,5791,337,16914,536,16898,15760,793,361,9438,3701,1340,2727,504]
[{"$f":"B67&D67","v":"2011Hawaii"},2011,"Democrat","Hawaii",1357806,1803,1160948,10743,122727,8676,-4398,-3.2390488773801265E-3,57542,1268,844,2900,242,10173,950,731,784,222,3160,2519,0,112,1884,402,478,125,18,179,106,341,92,1303,933,371,308,85,91,1548,107,564,354,4246,2307,32,970,685,2030,870,58,1681,0,636,3007,1040,0,2523,3790,312,147,14]
["2011Idaho",2011,"Republican","Idaho",1559637,2674,1284530,13188,208434,13285,2505,1.6061429678829113E-3,60336,263,4510,3543,224,9021,1813,0,0,0,1733,275,254,0,390,296,318,479,120,51,0,0,396,615,566,62,384,1602,439,3581,129,84,141,419,263,1201,260,288,7170,343,0,55,842,296,1303,6059,0,905,8991,0,165,487]
["2011Illinois",2011,"Democrat","Illinois",12718402,5792,11076528,31383,1353853,28856,-52804,{"$f":"K69/E69","v":-4.1517794452479171E-3},216204,2823,4119,7657,3185,13930,3271,1819,277,1440,17548,6042,1269,393,0,23491,8420,2533,5569,1315,693,2565,3507,10274,4496,1521,13889,304,827,2454,590,3009,1573,6412,4057,105,8384,1002,792,3012,278,1582,1318,3223,11011,951,49,5233,3075,352,14507,58]
["2011Indiana",2011,"Democrat","Indiana",6437155,3841,5478683,24180,809158,21392,-15354,-2.3852152076499632E-3,127874,1562,371,3975,2016,7649,1930,1227,79,0,8595,2543,1057,1368,23071,0,916,1321,10177,2241,275,480,952,7896,1168,469,1824,34,622,511,90,651,504,2518,3038,70,11109,844,505,3998,49,3306,235,3879,6326,123,530,1486,1028,216,2923,117]
["2011Iowa",2011,"Democrat","Iowa",3027718,2514,2573313,16682,370554,15638,-4111,-1.3577882748657571E-3,70405,207,967,1411,433,3297,2891,424,0,0,707,1938,299,161,13725,349,0,1776,387,228,26,487,466,1687,5634,408,3649,370,6490,2009,0,185,421,2361,1760,604,993,532,811,388,65,172,2842,623,2334,1482,38,720,856,115,2537,140]
["2011Kansas",2011,"Republican","Kansas",2833584,2851,2372033,15236,362782,14847,-10540,-3.7196709185257962E-3,83640,434,108,2028,998,4743,5030,412,74,128,1581,1146,287,264,2760,863,1715,0,1167,519,481,3180,28,1947,679,1517,22033,270,1648,657,27,1189,769,780,1223,379,1616,5022,285,1494,180,1102,104,1066,6575,196,0,1986,772,0,893,1285]
["2011Kentucky",2011,"Republican","Kentucky",4316297,3382,3686232,19523,505741,18525,10775,2.4963527764655675E-3,110031,925,0,1818,1058,2130,221,176,0,201,7400,2725,63,36,4273,11071,536,253,0,1399,71,2076,1019,3178,475,1248,2793,216,471,1358,52,1289,553,2174,3916,117,19617,1256,459,1490,640,1387,0,16852,4661,140,151,5154,1121,1174,581,57]
["2011Louisiana",2011,"Republican","Louisiana",4518629,3250,3865118,18789,538691,17818,12545,2.776284576582853E-3,99138,3065,288,2010,2774,3957,1202,358,0,195,5193,4425,688,230,1189,1549,468,312,1520,0,120,1221,439,1163,698,10255,1375,278,176,994,15,453,1028,1360,2134,277,2641,4235,1531,455,268,1573,37,2495,30292,179,87,2055,1075,110,339,357]
["2011Maine",2011,"Democrat","Maine",1315833,1456,1120364,10400,157102,9401,89,6.7637762542815082E-5,33818,634,37,325,38,829,290,2481,238,239,4304,507,177,0,675,164,275,523,158,138,0,52,4439,702,296,0,325,10,0,150,4302,694,144,2589,1439,19,483,25,471,915,234,587,42,394,1637,182,612,570,88,43,321,21]
["2011Maryland",2011,"Democrat","Maryland",5759087,4326,5008452,20478,553895,18323,-11062,-1.9207905697552407E-3,153979,228,671,945,423,8595,1796,1608,6652,18492,7825,7113,1170,389,2392,1318,110,689,848,860,1526,0,3470,2077,810,1109,1469,73,0,1105,232,9627,797,9222,6686,0,3396,845,276,14158,197,2882,0,1942,3619,223,40,22089,1525,2027,353,80]
["2011Massachusetts",2011,"Democrat","Massachusetts",6515057,3680,5658768,20357,656441,18778,-6039,-9.269297260177463E-4,139830,1201,225,1017,167,11556,1388,9445,399,676,11396,3264,733,412,2991,640,138,969,180,977,4006,2762,0,2629,862,356,1261,596,637,163,12010,8332,199,19431,3964,61,1757,90,178,6538,10182,1621,44,371,5203,548,2246,2984,1673,911,441,0]
["2011Michigan",2011,"Democrat","Michigan",9766574,4376,8340767,29076,1242917,25401,-47347,-4.8478616964352083E-3,139158,3527,3456,3840,2054,7793,3425,1656,0,256,17712,4254,630,882,9897,7668,1709,1148,2578,955,599,1035,2861,0,2671,715,2509,84,439,1215,73,1849,508,6087,3405,159,11224,917,647,2864,385,2185,571,3106,9935,642,0,2327,1430,417,4018,841]
["2011Minnesota",2011,"Democrat","Minnesota",5277329,3380,4505462,20788,646176,19647,-2224,-4.2142530814357035E-4,101029,123,893,2314,951,6638,2662,74,86,367,2820,840,901,402,8209,786,6175,606,755,573,321,424,970,5164,0,549,1345,1457,1936,2682,21,631,540,2416,845,7574,1961,546,1800,870,0,447,5305,874,3062,919,177,1034,1413,92,19255,224]
["2011Mississippi",2011,"Republican","Mississippi",2943021,3088,2534036,16620,332934,15960,-86,-2.9221673919418175E-5,68511,8922,117,556,2315,4723,484,54,0,415,6152,3136,369,55,2068,611,650,66,1626,7139,0,265,1445,1610,614,0,1581,0,118,84,65,269,1075,364,483,0,991,566,74,2568,41,398,6,7683,5243,332,0,1453,286,303,1136,0]
["2011Missouri",2011,"Republican","Missouri",5937896,4110,4963040,26160,801046,25054,11035,1.858402370132451E-3,149439,1395,2043,2356,6168,8386,3144,1516,0,215,4513,2964,871,560,20161,4404,4811,20884,1993,1728,291,716,463,2830,2026,1641,0,845,4860,1544,769,1114,1016,2904,3669,977,3240,6073,777,1810,359,267,361,2676,10293,1697,88,2684,2518,196,1503,1120]
["2011Montana",2011,"Republican","Montana",987076,1359,828254,8593,122210,8386,2349,2.3797559661059534E-3,33553,449,1118,1971,49,3033,2856,58,365,0,291,231,32,1543,765,646,417,845,0,0,71,57,10,353,969,0,158,0,384,688,0,889,264,422,1173,360,321,96,1959,840,0,77,227,266,1329,1232,53,278,3835,14,146,2413]
["2011Nebraska",2011,"Republican","Nebraska",1817126,2304,1505191,11978,253269,10841,-739,-4.0668616265465354E-4,52070,169,721,1646,161,5124,3245,381,0,29,1105,434,275,506,1415,615,9575,3040,352,222,122,318,0,683,1455,424,1848,64,0,240,0,119,242,544,829,292,268,1255,1556,252,0,243,2999,226,5343,734,0,615,835,24,560,965]
["2011Nevada",2011,"Democrat","Nevada",2688336,3578,2084668,23272,480317,23514,-5598,-2.0823289945899621E-3,110345,280,597,10142,310,40114,2714,189,184,983,2923,1731,4093,3929,1668,855,114,602,628,78,49,931,256,1663,1055,203,335,1137,32,0,0,2118,2136,1516,1333,0,1354,258,1691,570,86,165,588,96,7249,3365,0,1740,4680,0,2672,933]
["2011New Hampshire",2011,"Democrat","New Hampshire",1305678,2046,1141236,9064,122129,8186,-6277,-4.8074640148643077E-3,37000,193,0,246,22,547,403,1617,20,68,1970,535,0,0,478,470,47,0,0,0,3080,222,15526,155,104,160,153,230,33,186,0,294,186,1471,1297,47,248,0,198,1015,608,588,86,126,605,158,2138,880,428,0,0,162]
["2011New Jersey",2011,"Democrat","New Jersey",8719952,4595,7825661,21158,693380,21063,-76175,-8.7357132241094905E-3,140194,189,1198,3784,57,5986,2203,1924,2100,781,12907,4268,264,256,3690,718,332,317,102,871,624,5335,4675,1889,1261,510,583,49,312,899,499,0,355,40815,2482,61,1121,773,360,19733,463,1586,0,1412,3801,256,0,4458,2454,1252,214,15]
["2011New Mexico",2011,"Democrat","New Mexico",2055293,2718,1753413,15690,228218,13801,699,3.4009749461512298E-4,62130,410,416,7444,682,7066,5525,0,0,212,2806,676,81,355,466,2030,0,1333,87,184,510,2277,252,908,438,556,1183,544,353,2099,114,245,0,1445,522,264,1742,234,916,492,0,145,240,899,13633,303,71,425,924,0,340,283]
["2011New York",2011,"Democrat","New York",19248685,7023,17055260,37016,1756105,32216,{"$f":"M88-INDEX($M$55:$BL$55,1,MATCH(D88,$M$2:$BL$2,0))","v":-95591},-4.9661054768156887E-3,282209,1812,6124,2821,1041,25761,3724,15123,1124,3702,29344,10584,1002,434,6914,2198,928,838,2414,1495,2915,5037,14646,3936,1824,401,1417,391,579,1785,2972,41450,461,0,9336,374,5191,1425,2189,26596,1393,6947,112,2660,9151,773,3882,10800,2986,631,1878,688]
["2011North Carolina",2011,"Democrat","North Carolina",9539412,5364,8070238,36924,1160510,33476,40144,4.208225831948552E-3,265291,5420,3991,4286,327,15373,3919,1975,954,1135,28044,16192,1806,675,5971,3228,654,4995,1637,2936,824,10485,9053,7530,1294,1273,2638,563,1056,1048,2078,10374,1737,18321,0,189,10187,1390,1175,9450,444,20427,565,6057,6621,961,212,27302,3295,2780,2291,153]
["2011North Dakota",2011,"Republican","North Dakota",675161,1047,559906,6503,79837,6140,5947,8.808269434994024E-3,32510,97,393,1313,249,1356,1229,0,84,0,459,364,138,1209,571,130,208,75,0,422,50,10,369,328,12244,80,330,1227,218,845,0,183,99,264,900,0,286,59,264,652,0,1,1293,113,1862,429,0,166,404,0,1398,139]
["2011Ohio",2011,"Democrat","Ohio",11418944,4418,9764366,32087,1425709,29701,-14271,-1.2497653022906497E-3,191778,1567,1637,6763,1952,9032,2690,1189,263,587,16492,4290,1044,312,7027,11588,1146,657,12744,1872,0,4982,2101,14330,1788,691,2003,101,1176,1851,1992,3936,255,8784,4572,204,0,2333,1326,14292,369,3826,34,6468,11987,691,68,5425,1979,7548,2534,1280]
["2011Oklahoma",2011,"Republican","Oklahoma",3742698,2585,3089041,15209,528498,15584,27869,7.4462326375251226E-3,108878,591,1137,3770,6894,8233,3273,97,66,191,6056,3514,140,21,2179,2113,580,4626,1398,1934,271,432,160,1038,497,199,5781,803,1979,705,0,391,403,1858,1322,928,1608,0,917,1116,152,2015,600,1700,31595,587,0,1013,1246,44,942,1763]
["2011Oregon",2011,"Democrat","Oregon",3828714,3857,3128121,20096,549332,19087,18111,4.7303089235706816E-3,127906,758,1935,7911,988,34214,2110,949,251,349,3384,1946,2491,6236,1350,1371,659,1263,71,0,269,453,1423,1652,1413,7,1172,1079,324,7222,427,1322,537,2056,1099,313,949,2034,0,1407,0,370,417,673,4498,3443,176,1179,21862,66,914,914]
["2011Pennsylvania",2011,"Democrat","Pennsylvania",12610486,5092,11099077,27780,1224564,25195,19164,1.5196876631083053E-3,234291,1332,759,2278,582,10672,2491,4150,5177,1401,19299,4627,495,236,3902,4086,1176,2323,4013,615,608,17751,6284,4406,853,1238,1761,338,582,1057,1326,36133,325,29436,11254,195,13075,283,1594,0,799,3438,142,3742,7006,1246,446,8419,3688,4631,2426,195]
["2011Rhode Island",2011,"Democrat","Rhode Island",1040022,1440,903786,8645,101689,7813,-4296,-4.130681850960845E-3,26769,0,0,214,0,1949,301,2613,0,0,2230,476,0,107,373,41,82,374,211,121,228,472,7715,178,27,0,109,0,0,0,941,1224,93,2776,259,0,60,0,57,1125,0,223,0,210,207,181,621,485,262,199,2,23]
["2011South Carolina",2011,"Republican","South Carolina",4624180,3871,3899705,25459,546666,21151,36218,7.8323075658819508E-3,157644,2999,2421,1971,1333,6592,1000,1752,841,589,15476,16355,712,55,2371,3249,1379,1885,2454,878,652,3807,730,4483,471,2163,1522,915,204,1017,372,4241,598,11317,23102,271,6327,1008,833,3523,453,0,62,3324,8623,181,91,7879,2510,1680,341,632]
["2011South Dakota",2011,"Republican","South Dakota",814175,1297,688436,7824,94655,6542,-1877,-2.3054011729665E-3,27506,0,554,1422,659,1286,1021,0,0,0,101,69,0,186,267,285,4772,144,211,0,0,254,113,239,5342,129,354,232,1695,110,0,441,513,6,166,2060,84,40,15,57,7,529,0,0,1156,560,0,79,557,0,481,1310]
["2011Tennessee",2011,"Republican","Tennessee",6333466,4450,5342978,29750,794556,26578,16726,2.6408920486823487E-3,170969,9326,531,1346,7393,7130,1372,150,155,307,15491,17507,179,0,8593,5645,387,1805,13884,1901,9,1135,1690,5983,445,9172,3795,43,631,883,132,1396,381,4921,9353,50,5944,3166,726,3360,14,5531,181,0,7009,200,38,6098,2852,1385,1213,131]
["2011Texas",2011,"Republican","Texas",25327104,10987,20984855,65490,3648260,63784,109887,4.3387116031900052E-3,514726,8747,6670,20073,16461,58992,19126,2927,884,2276,35777,17401,6106,4379,15064,10265,3236,12766,6616,25513,1357,9443,5035,15654,7691,6048,13473,537,3837,7793,459,7578,15225,26155,14956,809,12315,19302,3743,9107,1297,4075,1486,10788,0,5234,349,13231,15325,663,5982,2500]
["2011Utah",2011,"Republican","Utah",2769627,2949,2295961,19215,373984,17246,12006,4.3348797509556343E-3,85217,486,2151,6585,422,18237,3986,562,0,132,1643,1052,1701,7538,1447,545,290,1146,611,494,0,342,959,1099,939,143,511,1241,195,4315,34,506,1707,1937,1653,2,2584,150,2037,1496,0,309,128,549,4507,0,122,2413,4825,270,158,1058]
["2011Vermont",2011,"Democrat","Vermont",621354,940,537304,5021,60719,4634,2291,3.6871091197610379E-3,20463,0,580,310,0,819,529,2105,107,27,366,101,143,0,386,258,0,7,627,41,322,361,2378,335,206,0,69,0,0,15,2244,962,56,3723,250,0,383,0,124,389,401,21,0,327,185,182,0,740,156,53,137,38]
["2011Virginia",2011,"Democrat","Virginia",7996552,5256,6789620,30962,889751,30111,27903,3.4893789223155178E-3,257130,4930,3202,4679,645,19371,4908,5376,961,6854,17773,8715,2917,434,4000,2703,1503,892,3630,2496,2855,22051,5386,7323,834,1682,2277,617,256,1717,1344,7327,1014,12455,22753,462,9570,853,3499,12009,1897,6612,908,7482,11655,1426,173,0,4615,9041,858,190]
["2011Washington",2011,"Democrat","Washington",6748474,4248,5565069,27197,919925,27221,17863,2.6469687813867253E-3,208507,1821,5266,12397,756,38421,3938,1026,0,358,6094,8705,5940,10895,2062,2303,1000,2820,1271,1016,1313,1899,1580,3720,1543,1110,3307,2125,673,4925,824,2006,1569,4512,3870,189,2686,765,29168,2296,463,1519,227,2342,15491,4789,119,4233,0,157,1491,1507]
["2011West Virginia",2011,"Republican","West Virginia",1836614,1681,1609110,9854,172262,8430,4112,2.2389026763380872E-3,50068,221,598,50,225,1442,124,594,89,300,2949,1296,147,120,1331,210,0,0,515,326,45,7515,236,459,0,0,309,60,78,293,160,1431,0,2017,3865,0,8545,97,132,4205,284,1857,0,546,1574,114,23,5561,83,0,42,0]
["2011Wisconsin",2011,"Democrat","Wisconsin",5647213,2653,4846550,18735,675623,19411,4069,7.2053241129739574E-4,109439,708,432,4045,335,6637,2592,993,219,123,4338,1745,1108,566,25521,4017,3306,418,1040,850,12,147,733,5623,17927,983,2090,143,483,663,480,378,714,2213,2120,1383,1358,118,1057,1294,368,377,590,744,1984,890,342,2573,1555,1090,0,14]
["2011Wyoming",2011,"Republican","Wyoming",561389,1021,462808,7194,66648,5771,-1340,-2.3869366873950147E-3,30651,51,761,369,174,2539,6905,11,0,0,1525,46,0,2140,450,6,342,286,83,114,0,0,152,849,357,70,241,1105,1784,427,0,7,76,113,395,237,22,462,960,284,13,219,1043,69,1398,2140,4,451,1803,0,168,0]
["2012United States",2012,"Democrat","United States",310212755,25814,263612596,229733,37696597,211307,null,null,7070345,109210,84068,206842,64967,566986,161530,87023,25149,59513,428325,252262,61509,55191,277953,144597,73325,93134,103004,95956,38574,157664,158156,175733,115946,66947,142754,33832,48816,98882,38696,219202,63921,405864,238663,23959,199202,102572,108182,237156,30498,127418,22534,163843,402187,82165,20056,238540,180462,47425,97724,32228]
["2012Alabama",2012,"Republican","Alabama",4764428,3589,4054260,21464,590326,19701,{"$f":"M108-INDEX($M$107:$BL$107,1,MATCH(D108,$M$2:$BL$2,0))","v":-4610},-9.6758729484420797E-4,104600,0,1004,962,660,3077,1386,284,42,162,11244,19920,627,493,2722,1347,345,865,2495,3104,67,1513,334,2298,752,4952,1555,101,151,1009,161,1702,459,2709,5133,228,1411,194,200,1837,0,2811,518,10539,7468,579,0,3170,1034,128,760,88]
["2012Alaska",2012,"Republican","Alaska",721186,1290,592551,8741,90613,7239,-50653,-7.023569509114154E-2,33415,1097,0,1520,196,3494,556,0,0,356,1991,928,1376,538,58,260,13,221,161,120,66,508,297,563,192,56,819,371,1195,803,118,116,263,736,920,264,1316,335,3174,255,0,384,99,451,1488,330,79,1265,3725,0,206,136]
["2012Arizona",2012,"Republican","Arizona",6468907,3874,5242674,32185,953789,28803,25615,3.9597106590031359E-3,232457,1331,3717,0,1214,44889,13790,417,246,36,5553,2263,2491,2934,10744,2930,2702,2498,1328,724,616,3007,1961,9598,8570,293,2595,1118,2293,6712,510,2564,6946,7402,2721,877,7906,1626,8587,4280,614,1070,1472,5075,14788,5916,207,2763,13247,765,3765,2786]
["2012Arkansas",2012,"Republican","Arkansas",2912680,2753,2453347,16841,373046,14543,11981,4.113393850337147E-3,76948,374,855,1677,0,3525,603,185,0,205,2682,1525,0,0,3576,1172,409,1033,1310,3953,17,169,254,1283,295,3689,9105,258,166,121,0,157,547,2262,3057,0,1135,9938,193,516,59,52,673,4195,11767,269,0,1159,251,84,695,1498]
["2012California",2012,"Democrat","California",37572738,10274,31777868,67939,5046618,65422,-73345,-1.9520802556364139E-3,493641,2509,6995,38916,3472,0,15150,6764,474,3199,21004,10790,11906,5331,21251,5891,2284,2790,3763,5180,1256,7902,14356,8921,8539,2556,6729,3060,3302,27968,1327,12057,5921,31261,11195,1827,10653,6671,22724,10466,1648,4110,826,5802,43005,12172,544,15625,34569,1413,5681,1886]
["2012Colorado",2012,"Democrat","Colorado",5123944,2939,4131357,21752,751921,19587,43530,8.4954090052506426E-3,205060,3108,3457,10589,1043,22152,0,1317,70,488,8615,5834,2536,2660,6374,4336,2776,5283,2500,5048,20,2844,5939,3343,2992,835,3771,2021,4472,3789,679,2464,6520,7250,4378,1918,4533,4582,2419,3950,137,2383,756,2535,17355,6398,503,3796,4853,837,3000,5602]
["2012Connecticut",2012,"Democrat","Connecticut",3555319,2447,3114940,16188,334918,14546,-6712,-1.8878756027236937E-3,80311,46,439,3167,200,3161,367,0,22,288,6578,1702,408,97,912,53,0,0,124,909,1224,1752,8743,753,605,276,358,50,45,172,1009,5665,444,23310,3379,0,287,415,35,2214,1558,940,0,260,3279,45,709,1729,1593,174,711,104]
["2012Delaware",2012,"Democrat","Delaware",906576,1624,782216,9177,86003,7626,9608,1.0598118635392952E-2,34757,119,692,188,0,2221,0,1489,0,11,715,179,0,32,567,62,30,113,0,178,0,5649,157,227,351,58,80,0,91,572,99,5846,85,3566,1349,0,191,0,0,6828,135,298,0,344,133,166,0,1746,29,161,0,0]
["2012District of Columbia",2012,"Democrat","District of Columbia",624847,948,500267,6225,61992,5668,-5683,-9.0950264624780151E-3,53830,79,1247,902,35,4999,677,618,78,0,1705,1079,38,46,795,469,133,164,112,283,194,14120,1524,944,393,44,337,0,172,42,197,1451,116,3085,985,0,651,0,157,1494,635,150,0,577,1473,116,267,9537,481,293,721,215]
["2012Florida",2012,"Democrat","Florida",19114620,6877,16032617,49245,2380288,44658,108823,5.6931814495919881E-3,537148,18599,10704,6473,3321,20386,8766,8975,1099,780,0,42754,3177,1268,22565,13803,3864,5661,6912,5550,7348,10442,15159,23400,5460,5490,10666,1758,945,1241,2362,27606,2853,53009,23133,239,22927,3142,2919,25659,3050,11366,1070,16275,28564,2499,2747,25697,4943,3533,6216,773]
["2012Georgia",2012,"Republican","Georgia",9796547,5863,8231384,34188,1236302,31155,25204,2.5727432328962441E-3,277466,13864,2654,6657,1041,14174,4710,1829,226,1352,42870,0,1409,936,7143,5972,1687,1497,6172,4100,222,3619,4153,9949,2237,3280,3377,251,1283,3783,15,4920,915,13957,16009,207,7501,3299,453,9076,440,18611,257,17606,16198,20,84,10702,1965,1237,3441,106]
["2012Hawaii",2012,"Democrat","Hawaii",1374852,1662,1164145,10466,134827,9196,-6364,-4.6288618702231225E-3,55145,608,1417,1865,24,9756,1216,191,278,230,2780,1448,0,404,318,292,84,1135,485,207,91,2491,1266,321,192,44,944,131,75,760,85,410,284,2382,2241,0,884,1095,1763,1087,106,644,459,1314,3300,2183,0,1393,5920,197,295,50]
["2012Idaho",2012,"Republican","Idaho",1573036,2184,1296975,12998,210151,11483,4092,2.6013390666202174E-3,59283,575,1198,2424,291,10280,1186,44,120,116,2014,583,206,0,532,283,90,63,83,54,0,107,338,683,637,87,214,3800,35,2535,0,214,675,938,817,0,1018,93,4963,169,0,205,118,1957,1352,6617,0,269,10398,0,225,677]
["2012Illinois",2012,"Democrat","Illinois",12725119,5939,11009321,31714,1441191,27618,-69198,-5.4379059244946942E-3,208755,883,2250,7139,1587,14940,3036,955,234,1066,12687,8745,869,1384,0,16907,8529,2009,2923,1229,526,1865,3296,12583,6537,2744,13264,228,1302,1478,283,2366,1359,7561,3761,196,6872,1491,954,4588,462,1583,394,4648,16780,1154,156,4311,2704,1221,14414,302]
["2012Indiana",2012,"Republican","Indiana",6457067,4184,5493090,26865,805228,22224,-10460,-1.6199305350246482E-3,134137,1625,479,2763,564,6033,1225,823,639,1045,11472,2258,856,186,28436,0,1678,1624,11177,736,0,1050,837,11017,1543,1948,4526,134,591,1011,0,1537,219,2316,2665,113,11235,1198,387,2419,0,1414,111,3547,4490,105,0,1932,258,507,1727,1681]
["2012Iowa",2012,"Democrat","Iowa",3035469,2721,2585979,14093,362938,11238,2435,8.0218246340186638E-4,75760,503,951,1590,451,3268,3252,112,0,151,4335,596,521,290,11969,1716,0,918,819,763,78,419,585,946,7505,751,4168,452,7698,681,56,1018,114,1230,734,833,1127,1465,348,451,0,943,1158,1148,3553,886,0,268,919,22,3607,392]
["2012Kansas",2012,"Republican","Kansas",2848708,2507,2361899,16878,381695,15902,-4850,-1.702526197841267E-3,88284,853,333,3094,2158,5411,3746,210,0,456,3118,1896,149,456,1702,1679,1527,0,617,438,211,282,187,1125,682,452,21022,300,4126,851,0,267,1029,571,813,261,1310,8408,848,918,18,556,154,1542,8468,97,70,1705,3265,139,486,278]
["2012Kentucky",2012,"Republican","Kentucky",4328626,2851,3676472,15304,521511,14825,9783,2.2600705166027279E-3,112787,4137,304,1103,518,3415,712,246,706,254,9232,4173,647,50,4445,12203,238,602,0,666,46,1120,419,7302,605,646,2381,0,723,301,84,496,554,5239,3643,122,17041,577,298,2226,0,1347,0,10064,3345,464,45,3319,1988,3346,1395,0]
["2012Louisiana",2012,"Republican","Louisiana",4545914,4612,3912023,21791,528406,20131,-4741,-1.0429145821940317E-3,91215,2329,403,2021,3645,5139,1433,164,0,596,6534,4478,378,265,1229,1359,544,420,1649,0,251,642,549,1080,330,6791,1591,428,745,931,11,975,150,2786,2284,64,1115,2159,195,1239,737,1914,0,2348,24488,277,45,1857,1581,238,682,146]
["2012Maine",2012,"Democrat","Maine",1315586,1384,1132344,9895,151438,9223,-11051,-8.4000589851214585E-3,27523,129,38,230,0,1610,314,1468,234,32,2926,511,0,143,195,0,7,277,482,15,0,325,3887,116,430,79,69,0,82,35,3655,405,272,2519,1112,0,628,79,215,976,1024,173,0,985,496,200,349,573,118,51,0,59]
["2012Maryland",2012,"Democrat","Maryland",5816472,3717,5068457,21604,549973,20595,-2681,-4.6093233148891628E-4,154983,1261,1947,760,136,8614,1071,881,4100,21213,9610,4610,610,429,3621,1210,569,1726,715,606,332,0,3977,2167,1422,581,256,0,132,330,1124,6260,638,11736,7507,116,2522,463,378,15485,82,2297,0,1800,5612,1061,589,20579,1431,1957,460,0]
["2012Massachusetts",2012,"Democrat","Massachusetts",6580641,3587,5752166,19793,626380,17354,-15579,-2.367398555854969E-3,142577,636,890,1972,394,12770,980,10525,506,379,12890,2789,1108,188,2886,677,151,565,52,1556,3907,2381,0,1337,966,155,453,49,182,787,13331,8046,521,19467,2514,81,1829,297,1528,8236,6863,2477,194,823,3694,1027,2534,4098,1653,385,584,264]
[{"$f":"B130&D130","v":"2012Michigan"},2012,"Democrat","Michigan",9778980,4263,8330990,24803,1268105,23226,-41752,-4.2695659465506628E-3,133981,2341,1152,7168,906,8085,2363,798,114,274,13146,4270,291,242,10047,10976,993,805,3409,1284,261,2201,1720,0,1127,922,2206,218,113,1354,446,1617,1318,5731,3912,265,11318,705,811,2739,68,1822,66,3259,8638,819,60,3057,2146,353,4768,1277]
["2012Minnesota",2012,"Democrat","Minnesota",5315228,2787,4536303,18312,653012,17074,-14904,-2.804018943307794E-3,101042,1299,523,3065,375,8086,3565,696,0,310,2372,2235,1277,575,5896,2026,7220,924,57,791,187,1841,814,2212,0,202,1709,1257,992,932,0,1038,322,1849,1745,6672,2635,1212,781,1106,299,1705,3442,1738,4001,429,77,1037,1685,0,17618,213]
["2012Mississippi",2012,"Republican","Mississippi",2947696,2744,2529377,17940,339807,16126,6553,2.2230922048949416E-3,73500,5141,0,710,2680,4371,799,106,0,97,4676,2669,184,586,2703,1200,160,400,446,8588,163,379,67,1768,568,0,2634,166,138,526,60,2127,86,1492,1709,98,896,562,465,613,185,596,79,11643,7230,454,0,1929,433,0,611,307]
["2012Missouri",2012,"Republican","Missouri",5951913,3866,4965459,21306,801093,19635,20176,{"$f":"K133/E133","v":3.3898344952286771E-3},162930,1333,2186,2297,9434,10717,3798,410,234,144,8374,3451,2114,596,22001,4184,5956,20218,2291,1178,996,1246,810,2964,2798,1110,0,511,1999,836,35,960,451,2834,3988,636,3557,5298,1186,1535,361,2856,527,3122,9278,3287,318,2609,2312,148,2636,810]
["2012Montana",2012,"Republican","Montana",995544,947,829489,8669,126463,7466,3858,3.8752681950772641E-3,37690,31,726,1548,63,5428,2135,0,0,0,1875,292,556,3385,542,163,415,224,367,0,225,33,97,822,481,32,447,0,108,968,115,156,259,482,1082,977,402,1018,2950,457,0,230,191,45,1393,260,87,156,4783,0,750,934]
["2012Nebraska",2012,"Republican","Nebraska",1829420,2101,1540361,9074,237937,9736,-5550,-3.0337484011325995E-3,43266,245,626,2406,363,3438,2023,0,0,0,1368,786,165,315,1193,290,6815,3103,131,411,68,129,195,258,1489,176,2223,108,0,233,0,524,158,318,874,497,563,587,106,702,0,456,2507,232,3130,229,79,1076,1327,111,316,917]
["2012Nevada",2012,"Democrat","Nevada",2725280,3005,2105070,21984,481496,19389,25403,9.3212440556566661E-3,124285,761,2161,8748,353,49978,6402,143,373,468,3381,745,2053,1503,2822,362,714,1202,952,421,209,934,318,1235,1157,783,694,1086,714,0,175,912,1138,3521,767,702,1407,1520,3101,1601,336,480,0,1699,5484,4605,121,1135,2997,100,1046,766]
["2012New Hampshire",2012,"Democrat","New Hampshire",1309203,1504,1127376,9730,125118,9101,11788,9.0039512588956788E-3,50484,0,437,440,0,1514,572,1345,0,101,2746,470,43,20,673,297,53,102,284,7,6118,33,18990,426,0,0,289,0,110,0,0,591,223,2905,1609,0,324,186,208,890,1248,323,0,77,2150,557,2960,660,113,80,239,71]
["2012New Jersey",2012,"Democrat","New Jersey",8772744,4541,7929570,23298,655465,21808,-88979,-1.0142664598442631E-2,130223,779,359,1328,57,4330,380,3466,1921,840,10649,3002,22,113,2052,1039,357,426,631,339,430,3474,4907,324,570,106,384,67,35,908,126,0,45,40495,3236,55,1452,1540,760,23597,429,2372,581,1400,2509,425,35,5024,1847,297,680,23]
["2012New Mexico",2012,"Democrat","New Mexico",2060595,2119,1769341,11461,226243,12069,-9228,-4.4783181556783359E-3,54693,787,320,6391,410,4536,4780,280,100,25,4707,192,168,355,790,660,384,672,159,790,57,505,303,602,284,451,1216,139,194,604,268,252,0,1111,335,41,1178,1076,932,822,0,325,509,338,11955,1382,81,1560,1251,0,321,95]
["2012New York",2012,"Democrat","New York",19352153,6112,17202134,34343,1723117,30910,{"$f":"M140-INDEX($M$107:$BL$107,1,MATCH(D140,$M$2:$BL$2,0))","v":-135811},-7.0178754787645591E-3,270053,1364,4002,4146,247,24623,3596,14595,477,3936,27392,7592,1598,607,8017,3040,955,1437,1753,1083,1345,7321,15073,5191,1059,773,3310,421,78,600,2760,42574,646,0,10544,77,4625,1327,1055,22895,3222,5952,0,1279,11231,622,2764,7939,2614,921,979,396]
["2012North Carolina",2012,"Republican","North Carolina",9640490,5097,8167830,27074,1149080,24801,34486,3.5772040632789412E-3,273149,4329,1458,3493,861,13883,4790,4914,2180,1801,26365,16823,1566,334,6378,4532,775,1595,1531,919,1259,9005,3710,6161,1523,2377,2623,244,628,1627,754,11468,1138,19891,0,206,9337,1263,1333,12179,290,25532,351,9230,12638,1189,445,26759,5915,2677,2266,604]
["2012North Dakota",2012,"Republican","North Dakota",689838,1379,563978,6361,84294,5380,14254,2.0662822285812031E-2,38213,83,70,1571,0,999,546,65,0,70,950,98,160,540,799,55,458,161,22,18,98,232,187,757,15257,72,1490,1776,950,854,0,140,161,331,231,0,6,280,724,114,244,14,1754,746,1414,43,758,403,1604,0,543,365]
["2012Ohio",2012,"Democrat","Ohio",11414635,5725,9735390,29715,1440815,28423,-2811,-2.4626280209573062E-4,196391,3705,2207,4929,884,8995,3180,1355,1079,985,16366,8052,1198,412,9510,13534,1039,1166,13227,2214,1189,5026,2189,16336,1122,1017,3026,276,1052,907,189,4703,1361,8732,5498,453,0,858,432,14147,435,2445,47,3542,11760,197,364,3193,2862,7820,974,202]
["2012Oklahoma",2012,"Republican","Oklahoma",3762311,2764,3107367,14635,531347,12812,6400,1.701082127447731E-3,108972,1030,1279,2974,5777,8950,4717,0,380,151,5011,2581,189,905,1100,1490,1088,7065,1354,2562,167,750,1233,1347,906,1850,5210,798,300,1101,549,1523,1244,1981,1961,308,1148,0,1261,494,0,569,108,2471,25508,2588,197,1749,1574,368,1061,45]
["2012Oregon",2012,"Democrat","Oregon",3857465,2984,3158450,19251,560673,17729,10743,2.7849896240147352E-3,118925,373,2513,7954,165,31862,4472,381,0,696,1660,1032,2501,5093,1676,1380,834,556,202,227,446,457,760,570,1792,186,403,2192,570,5935,39,385,920,2379,1482,42,1411,725,0,904,177,461,119,802,3347,4793,367,676,21224,593,426,765]
["2012Pennsylvania",2012,"Democrat","Pennsylvania",12630082,4558,11107110,28998,1252378,26347,-21656,-1.7146365320510192E-3,215500,1926,1658,3529,573,7772,2574,3311,4814,2921,14631,4337,245,359,3749,1599,125,967,1233,694,988,17529,5900,2642,1169,55,1171,135,214,1600,1138,33791,1001,32898,6380,166,14319,378,234,0,771,3023,159,1273,6768,1276,1012,11960,1787,6762,1550,434]
["2012Rhode Island",2012,"Democrat","Rhode Island",1040527,1533,899551,9890,101165,8498,2948,2.8331797252738274E-3,33446,20,0,93,0,2146,332,4170,0,313,2752,168,120,0,385,0,0,27,286,24,279,482,11253,230,131,0,210,0,188,25,611,1219,36,3603,478,0,63,0,139,735,0,481,0,120,823,0,53,1008,287,0,135,21]
["2012South Carolina",2012,"Republican","South Carolina",4668886,3434,3929626,20572,564350,20053,29287,6.2728025486165221E-3,156705,1665,1244,2222,839,5979,1915,1590,697,435,11552,18570,638,198,2125,3802,643,1064,1924,2709,2077,3565,2313,2966,757,1407,1884,93,158,1025,917,6517,1052,10746,24764,656,4388,555,255,6497,538,0,816,3550,5351,566,298,9377,1629,1345,832,0]
["2012South Dakota",2012,"Republican","South Dakota",821669,1036,676014,7752,115606,7423,3517,4.2803123885652248E-3,26051,0,855,435,227,1494,1744,2,0,0,970,122,8,78,74,210,2441,403,0,0,0,60,61,892,3568,34,474,248,2175,135,0,0,175,371,240,1725,64,21,667,515,0,158,0,507,1715,388,5,340,1026,131,314,979]
["2012Tennessee",2012,"Republican","Tennessee",6378278,4412,5396833,24470,783077,21860,13255,2.0781471111795376E-3,177098,12116,1281,2250,3306,8396,2473,936,176,180,15641,16012,1058,787,7094,5591,617,2630,13202,2452,1040,1743,1525,4507,1178,10568,2694,308,432,735,271,783,751,6279,5904,7,6200,2495,1080,3329,26,4300,0,0,8716,784,133,8008,1876,3248,1622,358]
["2012Texas",2012,"Republican","Texas",25711791,10124,21354247,60947,3656070,53747,105565,4.1057038772600481E-3,507752,9993,6759,18908,13781,62702,16616,2769,181,1189,31259,20362,5040,2387,19672,8264,4934,12699,6040,29348,1293,4969,4813,9501,2803,6402,12319,1813,4794,8266,761,6797,16762,20274,22660,989,8728,26284,3827,10449,1763,4470,1264,10368,0,4610,113,17734,11630,1729,4192,2472]
["2012Utah",2012,"Republican","Utah",2805440,2571,2324019,16852,373980,16586,5705,2.0335491045967834E-3,87870,126,2819,7966,361,15286,5350,142,0,0,2428,1142,1436,5129,1588,475,2791,398,217,345,380,613,1503,1670,385,284,1553,1057,489,5391,507,437,686,2129,842,175,1875,1338,4089,944,351,60,47,863,3605,0,39,1369,3529,0,1445,2216]
["2012Vermont",2012,"Democrat","Vermont",620224,821,532237,5326,61242,5294,4375,7.0539031059746156E-3,24431,16,93,127,0,1112,382,1626,0,116,966,56,6,0,230,68,30,0,1243,73,883,862,3318,284,315,0,23,147,0,17,2893,833,74,4780,328,0,214,11,26,935,341,124,39,193,493,81,0,728,98,0,151,96]
["2012Virginia",2012,"Democrat","Virginia",8085389,4754,6857430,25550,915242,24032,12113,1.4981344744204638E-3,250653,2515,1906,2420,445,14780,5352,2725,2279,10964,19574,9535,3823,652,7089,2663,221,1144,3908,1638,1144,23925,3767,2982,2294,1344,1914,658,357,973,535,9073,947,15893,25575,852,5622,2810,1541,14190,1605,7936,35,6189,12944,2092,423,0,4160,3839,1258,143]
["2012Washington",2012,"Democrat","Washington",6815763,3864,5648199,25225,904695,24285,35032,5.1398500798810051E-3,215494,1507,4328,8362,1413,45597,5195,2901,100,773,9370,6363,5239,10604,4298,1089,1159,2544,1368,1646,532,1191,2911,3470,2703,615,2802,2919,682,5671,309,2300,872,5562,4088,217,3192,1223,25525,3397,97,2727,94,3206,14196,5298,223,3839,0,215,1168,394]
["2012West Virginia",2012,"Republican","West Virginia",1837518,2090,1613322,11785,174112,11396,-300,-1.6326370680450476E-4,47125,477,306,79,0,1231,104,143,674,294,1919,1108,166,181,220,328,68,39,2249,90,35,5352,164,778,20,0,59,0,0,229,129,1213,81,1721,4683,175,6757,520,118,5208,0,1098,36,1061,622,0,54,6317,297,0,470,252]
["2012Wisconsin",2012,"Democrat","Wisconsin",5660677,3351,4849945,15530,693737,15440,1468,2.5933293844534848E-4,99192,323,236,3257,253,5347,1600,657,296,15,4937,970,333,360,22285,2480,4161,1160,635,598,233,1306,489,3917,18965,238,1263,784,324,1163,3,606,526,2033,2939,284,2610,289,945,1563,144,1053,329,1051,2765,900,62,1267,1208,0,0,30]
["2012Wyoming",2012,"Republican","Wyoming",569734,1083,459226,7512,77324,6960,-1079,-1.8938662603952021E-3,31149,260,590,2014,244,2035,5599,0,0,0,733,166,0,745,905,179,259,539,4,88,0,294,548,965,290,136,244,1901,1216,355,0,121,604,231,459,338,819,964,893,230,0,122,1175,4,1427,1710,0,138,1323,0,282,0]

{"sheet":"Images","index":3,"n_rows":1,"n_cols":15,"rows_kept":1,"cut":false,"hidden":false,"merged":[]}
["BLUE STATES",null,null,null,null,null,null,null,null,null,null,null,"HELP ICON",null,"RED STATES"]

{"sheet":"Mockup","index":4,"n_rows":32,"n_cols":12,"rows_kept":32,"cut":false,"hidden":false,"merged":[]}
[]
[]
[]
[]
[]
[]
[]
[]
[]
[]
[]
[]
[]
[]
[]
[]
[]
[]
[]
[]
[]
[]
[]
[]
[]
[]
[]
[]
[]
[]
[]
[null,null,null,null,null,null,null,null,null,null,null,"Get This Add-In"]

{"sheet":"Sources","index":5,"n_rows":6,"n_cols":2,"rows_kept":6,"cut":false,"hidden":false,"merged":[]}
["Item","Source"]
["Migration Data","http://www.census.gov/hhes/migration/data/acs/state-to-state.html"]
["State Images","http://ericheikkinen.com/50-states-icon-pack/"]
["2012 State Votes","http://elections.nytimes.com/2012/results/president"]
["2008 State Votes","http://elections.nytimes.com/2008/results/president/map.html?ref=newyorktimes-poll-watch"]
["Mock Up Tab","DataPig Technologies - Dashboard Tool"]