{"text_format":"1","workbook":"xlsx","n_sheets":6,"sheets":["Dashboard","DataPull","Raw Data","Images","Mockup","Sources"],"not_rendered":{"charts":3,"images":58,"macros":1,"external_links":0,"defined_names":6,"comments":0,"pivot_tables":0},"unopened":[],"bounds":{"document_bytes":16777216,"sheet_cells":100000,"rows_first":2000,"rows_last":500,"rows_between":2000,"halvings":0,"cell_chars":16384,"cell_head_chars":4096},"cells_cut":0,"cells_raw":0,"read":"whole","date_system":"1900"}

{"sheet":"Dashboard","index":0,"n_rows":29,"n_cols":18,"rows_kept":29,"cut":false,"hidden":false,"merged":[]}
[null,"American State Migration"]
[null," In Relation to Political Voting Outcomes"]
[null,"COUNTRY",{"$f":"DataPull!B29","v":"United States"}]
[null,"VOTED",{"$f":"DataPull!B43","v":"Democrat"}]
[]
[]
[]
[]
[]
[]
[]
[]
[null,null,null,{"$f":"DataPull!$B$2","v":"Texas"},null,null,null,null,null,null,null,null,null,null,null,null,null,{"$f":"Selected_Year","v":2010}]
[null,null,null,"VOTED",{"$f":"PoliticalInfluence","v":"Republican"}]
[null,null,null,null,null,{"$f":"DataPull!B18","v":24.899075},"State Population",null,null,{"$f":"DataPull!C19","v":0.82333002330407856},"Stayed Put",null,null,{"$f":"DataPull!C20","v":0.15022019894313343},"Left The State"]
[null,"OVERVIEW"]
[]
[]
[]
[]
[]
[]
[]
[]
[]
[]
[]
[]
[null,null,null,null,null,null,null,null,null,null,null,null,null,null,null,null,null,"Created By: Chris Newman"]

{"sheet":"DataPull","index":1,"n_rows":53,"n_cols":19,"rows_kept":53,"cut":false,"hidden":false,"merged":[]}
[null,null,null,null,null,null,null,null,null,null,null,null,null,null,44]
["STATE:",{"$f":"INDEX($O$3:$O$54,O1)","v":"Texas"},null,null,null,"Political Influence",{"$f":"VLOOKUP($A$13,'Raw Data'!$A$2:$BL$158,3,0)","v":"Republican"},null,null,null,"YEAR:",2010,null,null,"State"]
[null,null,null,null,null,null,null,null,null,null,null,null,null,null,"Alabama"]
[{"$f":"\"Top State Populations migrating to \" & B2","v":"Top State Populations migrating to Texas"},null,null,null,null,null,null,null,null,null,null,null,null,null,"Alaska"]
["Rank",10,9,8,7,6,5,4,3,2,1,null,null,null,"Arizona"]
["State",{"$f":"INDEX('Raw Data'!$N$2:$BL$2,MATCH(DataPull!B7,INDEX(StateMigData,MATCH($A7,'Raw Data'!$A:$A,0),0),0))","v":"Arkansas"},{"$f":"INDEX('Raw Data'!$N$2:$BL$2,MATCH(DataPull!C7,INDEX(StateMigData,MATCH($A7,'Raw Data'!$A:$A,0),0),0))","v":"Colorado"},{"$f":"INDEX('Raw Data'!$N$2:$BL$2,MATCH(DataPull!D7,INDEX(StateMigData,MATCH($A7,'Raw Data'!$A:$A,0),0),0))","v":"Arizona"},{"$f":"INDEX('Raw Data'!$N$2:$BL$2,MATCH(DataPull!E7,INDEX(StateMigData,MATCH($A7,'Raw Data'!$A:$A,0),0),0))","v":"New York"},{"$f":"INDEX('Raw Data'!$N$2:$BL$2,MATCH(DataPull!F7,INDEX(StateMigData,MATCH($A7,'Raw Data'!$A:$A,0),0),0))","v":"Georgia"},{"$f":"INDEX('Raw Data'!$N$2:$BL$2,MATCH(DataPull!G7,INDEX(StateMigData,MATCH($A7,'Raw Data'!$A:$A,0),0),0))","v":"Illinois"},{"$f":"INDEX('Raw Data'!$N$2:$BL$2,MATCH(DataPull!H7,INDEX(StateMigData,MATCH($A7,'Raw Data'!$A:$A,0),0),0))","v":"Oklahoma"},{"$f":"INDEX('Raw Data'!$N$2:$BL$2,MATCH(DataPull!I7,INDEX(StateMigData,MATCH($A7,'Raw Data'!$A:$A,0),0),0))","v":"Florida"},{"$f":"INDEX('Raw Data'!$N$2:$BL$2,MATCH(DataPull!J7,INDEX(StateMigData,MATCH($A7,'Raw Data'!$A:$A,0),0),0))","v":"Louisiana"},{"$f":"INDEX('Raw Data'!$N$2:$BL$2,MATCH(DataPull!K7,INDEX(StateMigData,MATCH($A7,'Raw Data'!$A:$A,0),0),0))","v":"California"},"Total",null,null,"Arkansas"]
[{"$f":"Selected_Year&State","v":"2010Texas"},{"$f":"LARGE(INDEX(StateMigData,MATCH($A7,'Raw Data'!$A:$A,0),0),B$5)","v":15251},{"$f":"LARGE(INDEX(StateMigData,MATCH($A7,'Raw Data'!$A:$A,0),0),C$5)","v":16361},{"$f":"LARGE(INDEX(StateMigData,MATCH($A7,'Raw Data'!$A:$A,0),0),D$5)","v":16521},{"$f":"LARGE(INDEX(StateMigData,MATCH($A7,'Raw Data'!$A:$A,0),0),E$5)","v":16624},{"$f":"LARGE(INDEX(StateMigData,MATCH($A7,'Raw Data'!$A:$A,0),0),F$5)","v":16671},{"$f":"LARGE(INDEX(StateMigData,MATCH($A7,'Raw Data'!$A:$A,0),0),G$5)","v":20169},{"$f":"LARGE(INDEX(StateMigData,MATCH($A7,'Raw Data'!$A:$A,0),0),H$5)","v":22969},{"$f":"LARGE(INDEX(StateMigData,MATCH($A7,'Raw Data'!$A:$A,0),0),I$5)","v":26668},{"$f":"LARGE(INDEX(StateMigData,MATCH($A7,'Raw Data'!$A:$A,0),0),J$5)","v":31149},{"$f":"LARGE(INDEX(StateMigData,MATCH($A7,'Raw Data'!$A:$A,0),0),K$5)","v":68959},{"$f":"VLOOKUP(A7,'Raw Data'!$A$2:$BL$158,13,0)","v":486558},null,null,"California"]
["Republican",{"$f":"IF(VLOOKUP($L$2&B$6,'Raw Data'!$A:$C,3,0) = $A8,B$7/1000,\"\")","v":15.250999999999999},{"$f":"IF(VLOOKUP($L$2&C$6,'Raw Data'!$A:$C,3,0) = $A8,C$7/1000,\"\")","v":""},{"$f":"IF(VLOOKUP($L$2&D$6,'Raw Data'!$A:$C,3,0) = $A8,D$7/1000,\"\")","v":16.521000000000001},{"$f":"IF(VLOOKUP($L$2&E$6,'Raw Data'!$A:$C,3,0) = $A8,E$7/1000,\"\")","v":""},{"$f":"IF(VLOOKUP($L$2&F$6,'Raw Data'!$A:$C,3,0) = $A8,F$7/1000,\"\")","v":16.670999999999999},{"$f":"IF(VLOOKUP($L$2&G$6,'Raw Data'!$A:$C,3,0) = $A8,G$7/1000,\"\")","v":""},{"$f":"IF(VLOOKUP($L$2&H$6,'Raw Data'!$A:$C,3,0) = $A8,H$7/1000,\"\")","v":22.969000000000001},{"$f":"IF(VLOOKUP($L$2&I$6,'Raw Data'!$A:$C,3,0) = $A8,I$7/1000,\"\")","v":""},{"$f":"IF(VLOOKUP($L$2&J$6,'Raw Data'!$A:$C,3,0) = $A8,J$7/1000,\"\")","v":31.149000000000001},{"$f":"IF(VLOOKUP($L$2&K$6,'Raw Data'!$A:$C,3,0) = $A8,K$7/1000,\"\")","v":""},null,null,null,"Colorado"]
["Democrat",{"$f":"IF(VLOOKUP($L$2&B$6,'Raw Data'!$A:$C,3,0) = $A9,B$7/1000,\"\")","v":""},{"$f":"IF(VLOOKUP($L$2&C$6,'Raw Data'!$A:$C,3,0) = $A9,C$7/1000,\"\")","v":16.361000000000001},{"$f":"IF(VLOOKUP($L$2&D$6,'Raw Data'!$A:$C,3,0) = $A9,D$7/1000,\"\")","v":""},{"$f":"IF(VLOOKUP($L$2&E$6,'Raw Data'!$A:$C,3,0) = $A9,E$7/1000,\"\")","v":16.623999999999999},{"$f":"IF(VLOOKUP($L$2&F$6,'Raw Data'!$A:$C,3,0) = $A9,F$7/1000,\"\")","v":""},{"$f":"IF(VLOOKUP($L$2&G$6,'Raw Data'!$A:$C,3,0) = $A9,G$7/1000,\"\")","v":20.169},{"$f":"IF(VLOOKUP($L$2&H$6,'Raw Data'!$A:$C,3,0) = $A9,H$7/1000,\"\")","v":""},{"$f":"IF(VLOOKUP($L$2&I$6,'Raw Data'!$A:$C,3,0) = $A9,I$7/1000,\"\")","v":26.667999999999999},{"$f":"IF(VLOOKUP($L$2&J$6,'Raw Data'!$A:$C,3,0) = $A9,J$7/1000,\"\")","v":""},{"$f":"IF(VLOOKUP($L$2&K$6,'Raw Data'!$A:$C,3,0) = $A9,K$7/1000,\"\")","v":68.959000000000003},null,null,null,"Connecticut"]
[null,null,null,null,null,null,null,null,null,null,null,null,null,null,"Delaware"]
[{"$f":"\"People from \" & B2 & \" moved here\"","v":"People from Texas moved here"},null,null,null,null,null,null,null,null,null,null,null,null,null,"District of Columbia"]
["State",{"$f":"INDEX('Raw Data'!$D$4:$D$158,MATCH(B13,OFFSET('Raw Data'!$A$4:$A$158,0,MATCH($B$2,'Raw Data'!$A$2:$BL$2,0)-1),0))","v":"Virginia"},{"$f":"INDEX('Raw Data'!$D$4:$D$158,MATCH(C13,OFFSET('Raw Data'!$A$4:$A$158,0,MATCH($B$2,'Raw Data'!$A$2:$BL$2,0)-1),0))","v":"Arkansas"},{"$f":"INDEX('Raw Data'!$D$4:$D$158,MATCH(D13,OFFSET('Raw Data'!$A$4:$A$158,0,MATCH($B$2,'Raw Data'!$A$2:$BL$2,0)-1),0))","v":"North Carolina"},{"$f":"INDEX('Raw Data'!$D$4:$D$158,MATCH(E13,OFFSET('Raw Data'!$A$4:$A$158,0,MATCH($B$2,'Raw Data'!$A$2:$BL$2,0)-1),0))","v":"Arizona"},{"$f":"INDEX('Raw Data'!$D$4:$D$158,MATCH(F13,OFFSET('Raw Data'!$A$4:$A$158,0,MATCH($B$2,'Raw Data'!$A$2:$BL$2,0)-1),0))","v":"New Mexico"},{"$f":"INDEX('Raw Data'!$D$4:$D$158,MATCH(G13,OFFSET('Raw Data'!$A$4:$A$158,0,MATCH($B$2,'Raw Data'!$A$2:$BL$2,0)-1),0))","v":"Colorado"},{"$f":"INDEX('Raw Data'!$D$4:$D$158,MATCH(H13,OFFSET('Raw Data'!$A$4:$A$158,0,MATCH($B$2,'Raw Data'!$A$2:$BL$2,0)-1),0))","v":"Florida"},{"$f":"INDEX('Raw Data'!$D$4:$D$158,MATCH(I13,OFFSET('Raw Data'!$A$4:$A$158,0,MATCH($B$2,'Raw Data'!$A$2:$BL$2,0)-1),0))","v":"Louisiana"},{"$f":"INDEX('Raw Data'!$D$4:$D$158,MATCH(J13,OFFSET('Raw Data'!$A$4:$A$158,0,MATCH($B$2,'Raw Data'!$A$2:$BL$2,0)-1),0))","v":"Oklahoma"},{"$f":"INDEX('Raw Data'!$D$4:$D$158,MATCH(K13,OFFSET('Raw Data'!$A$4:$A$158,0,MATCH($B$2,'Raw Data'!$A$2:$BL$2,0)-1),0))","v":"California"},"Total",null,null,"Florida"]
[{"$f":"Selected_Year&State","v":"2010Texas"},{"$f":"SUMPRODUCT(LARGE(--('Raw Data'!$B$4:$B$158=2010)*OFFSET('Raw Data'!$A$4:$A$158,0,MATCH($B$2,'Raw Data'!$A$2:$BL$2,0)-1),B5))","v":12938},{"$f":"SUMPRODUCT(LARGE(--('Raw Data'!$B$4:$B$158=2010)*OFFSET('Raw Data'!$A$4:$A$158,0,MATCH($B$2,'Raw Data'!$A$2:$BL$2,0)-1),C5))","v":13707},{"$f":"SUMPRODUCT(LARGE(--('Raw Data'!$B$4:$B$158=2010)*OFFSET('Raw Data'!$A$4:$A$158,0,MATCH($B$2,'Raw Data'!$A$2:$BL$2,0)-1),D5))","v":14329},{"$f":"SUMPRODUCT(LARGE(--('Raw Data'!$B$4:$B$158=2010)*OFFSET('Raw Data'!$A$4:$A$158,0,MATCH($B$2,'Raw Data'!$A$2:$BL$2,0)-1),E5))","v":14705},{"$f":"SUMPRODUCT(LARGE(--('Raw Data'!$B$4:$B$158=2010)*OFFSET('Raw Data'!$A$4:$A$158,0,MATCH($B$2,'Raw Data'!$A$2:$BL$2,0)-1),F5))","v":18511},{"$f":"SUMPRODUCT(LARGE(--('Raw Data'!$B$4:$B$158=2010)*OFFSET('Raw Data'!$A$4:$A$158,0,MATCH($B$2,'Raw Data'!$A$2:$BL$2,0)-1),G5))","v":22253},{"$f":"SUMPRODUCT(LARGE(--('Raw Data'!$B$4:$B$158=2010)*OFFSET('Raw Data'!$A$4:$A$158,0,MATCH($B$2,'Raw Data'!$A$2:$BL$2,0)-1),H5))","v":24039},{"$f":"SUMPRODUCT(LARGE(--('Raw Data'!$B$4:$B$158=2010)*OFFSET('Raw Data'!$A$4:$A$158,0,MATCH($B$2,'Raw Data'!$A$2:$BL$2,0)-1),I5))","v":26134},{"$f":"SUMPRODUCT(LARGE(--('Raw Data'!$B$4:$B$158=2010)*OFFSET('Raw Data'!$A$4:$A$158,0,MATCH($B$2,'Raw Data'!$A$2:$BL$2,0)-1),J5))","v":28238},{"$f":"SUMPRODUCT(LARGE(--('Raw Data'!$B$4:$B$158=2010)*OFFSET('Raw Data'!$A$4:$A$158,0,MATCH($B$2,'Raw Data'!$A$2:$BL$2,0)-1),K5))","v":36582},null,null,null,"Georgia"]
["Republican",{"$f":"IF(VLOOKUP($L$2&B$12,'Raw Data'!$A:$C,3,0) = $A14,B$13/1000,\"\")","v":""},{"$f":"IF(VLOOKUP($L$2&C$12,'Raw Data'!$A:$C,3,0) = $A14,C$13/1000,\"\")","v":13.707000000000001},{"$f":"IF(VLOOKUP($L$2&D$12,'Raw Data'!$A:$C,3,0) = $A14,D$13/1000,\"\")","v":""},{"$f":"IF(VLOOKUP($L$2&E$12,'Raw Data'!$A:$C,3,0) = $A14,E$13/1000,\"\")","v":14.705},{"$f":"IF(VLOOKUP($L$2&F$12,'Raw Data'!$A:$C,3,0) = $A14,F$13/1000,\"\")","v":""},{"$f":"IF(VLOOKUP($L$2&G$12,'Raw Data'!$A:$C,3,0) = $A14,G$13/1000,\"\")","v":""},{"$f":"IF(VLOOKUP($L$2&H$12,'Raw Data'!$A:$C,3,0) = $A14,H$13/1000,\"\")","v":""},{"$f":"IF(VLOOKUP($L$2&I$12,'Raw Data'!$A:$C,3,0) = $A14,I$13/1000,\"\")","v":26.134},{"$f":"IF(VLOOKUP($L$2&J$12,'Raw Data'!$A:$C,3,0) = $A14,J$13/1000,\"\")","v":28.238},{"$f":"IF(VLOOKUP($L$2&K$12,'Raw Data'!$A:$C,3,0) = $A14,K$13/1000,\"\")","v":""},null,null,null,"Hawaii"]
["Democrat",{"$f":"IF(VLOOKUP($L$2&B$12,'Raw Data'!$A:$C,3,0) = $A15,B$13/1000,\"\")","v":12.938000000000001},{"$f":"IF(VLOOKUP($L$2&C$12,'Raw Data'!$A:$C,3,0) = $A15,C$13/1000,\"\")","v":""},{"$f":"IF(VLOOKUP($L$2&D$12,'Raw Data'!$A:$C,3,0) = $A15,D$13/1000,\"\")","v":14.329000000000001},{"$f":"IF(VLOOKUP($L$2&E$12,'Raw Data'!$A:$C,3,0) = $A15,E$13/1000,\"\")","v":""},{"$f":"IF(VLOOKUP($L$2&F$12,'Raw Data'!$A:$C,3,0) = $A15,F$13/1000,\"\")","v":18.510999999999999},{"$f":"IF(VLOOKUP($L$2&G$12,'Raw Data'!$A:$C,3,0) = $A15,G$13/1000,\"\")","v":22.253},{"$f":"IF(VLOOKUP($L$2&H$12,'Raw Data'!$A:$C,3,0) = $A15,H$13/1000,\"\")","v":24.039000000000001},{"$f":"IF(VLOOKUP($L$2&I$12,'Raw Data'!$A:$C,3,0) = $A15,I$13/1000,\"\")","v":""},{"$f":"IF(VLOOKUP($L$2&J$12,'Raw Data'!$A:$C,3,0) = $A15,J$13/1000,\"\")","v":""},{"$f":"IF(VLOOKUP($L$2&K$12,'Raw Data'!$A:$C,3,0) = $A15,K$13/1000,\"\")","v":36.582000000000001},null,null,null,"Idaho"]
[null,null,null,null,null,null,null,null,null,null,null,null,null,null,"Illinois"]
[null,"Figure","%",null,null,null,null,null,null,null,null,null,null,null,"Indiana"]
["Population",{"$f":"VLOOKUP($A$13,'Raw Data'!$A$2:$BL$158,5,0)/1000000","v":24.899075},{"$f":"B18/$B$18","v":1},null,null,null,null,null,null,null,null,null,null,null,"Iowa"]
["Stayed Put",{"$f":"VLOOKUP($A$13,'Raw Data'!$A$2:$BL$158,7,0)/1000000","v":20.500156},{"$f":"B19/$B$18","v":0.82333002330407856},null,null,null,null,null,null,null,null,null,null,null,"Kansas"]
["Left State",{"$f":"VLOOKUP($A$13,'Raw Data'!$A$2:$BL$158,9,0)/1000000","v":3.7403439999999999},{"$f":"B20/$B$18","v":0.15022019894313343},null,null,null,null,null,null,null,null,null,null,null,"Kentucky"]
["Newborns",{"$f":"B18-SUM(B19:B20)","v":0.65857499999999902},{"$f":"B21/$B$18","v":2.6449777752787965E-2},null,null,null,null,null,null,null,null,null,null,null,"Louisiana"]
[null,null,null,null,null,null,null,null,null,null,null,null,null,null,"Maine"]
[null,null,null,null,null,null,null,null,null,null,null,null,null,null,"Maryland"]
["OVERVIEW TEXT",null,null,null,null,null,null,null,null,null,null,null,null,null,"Massachusetts","Picture Links:"]
["Paragraph 1",{"$f":"State & \"'s top 3 inflow states were \" & K6 & \", \" & J6 & \", & \" & I6 &\". During the entire year of \" & Selected_Year & \", \" & TEXT(L7,\"#,K\") & \" citizens migrated to the state.  This gave \" & State & \" total population of \" & TEXT(B18, \"0.0\") &\" million people in \" & Selected_Year & \". \"","v":"Texas's top 3 inflow states were California, Louisiana, & Florida. During the entire year of 2010, 487K citizens migrated to the state.  This gave Texas total population of 24.9 million people in 2010. "},{"$f":"\"\"","v":""},null,null,null,null,null,null,null,null,null,null,null,"Michigan"]
["Paragraph 2",{"$f":"State & \" had \" & TEXT(C20, \"0.0%\") &\" of the population leave the state during the year.  The top 3 states receiving \" & State & \" citizens were \" & K12 & \", \"& J12 &\", and \"& I12 &\".\"","v":"Texas had 15.0% of the population leave the state during the year.  The top 3 states receiving Texas citizens were California, Oklahoma, and Louisiana."},{"$f":"\"\"","v":""},null,null,null,null,null,null,null,null,null,null,null,"Minnesota",null,null,null,"Top Net Migration Gains"]
[null,null,null,null,null,null,null,null,null,null,null,null,null,null,"Mississippi",null,null,{"$f":"DataPull!C33","v":"Texas"},{"$f":"DataPull!D33","v":74917}]
[null,null,null,null,null,null,null,null,null,null,null,null,null,null,"Missouri",null,null,{"$f":"DataPull!C34","v":"North Carolina"},{"$f":"DataPull!D34","v":56231}]
["COUNTRY:","United States",null,null,null,null,null,null,null,null,null,null,null,null,"Montana",null,null,{"$f":"DataPull!C35","v":"Florida"},{"$f":"DataPull!D35","v":55036}]
[null,null,null,null,null,null,null,null,null,null,null,null,null,null,"Nebraska",null,null,{"$f":"DataPull!C36","v":"Arizona"},{"$f":"DataPull!D36","v":45957}]
{"$rows_left_out":24}
{"sheet":"Raw Data","index":2,"n_rows":158,"n_cols":64,"rows_kept":158,"cut":false,"hidden":false,"merged":[]}
[null,null,null,null,"Population 1 year and over",null,"Same residence 1 year ago",null,"Different residence, same state 1 year ago",null,"State of Residence Last year (Estimate)"]
["ID","Year","Political Influence","Current residence in --","Estimate","MOE","Estimate","MOE","Estimate","MOE","Net Gain/Loss","Percent Gain/Loss","TOTAL","Alabama","Alaska","Arizona","Arkansas","California","Colorado","Connecticut","Delaware","District of Columbia","Florida","Georgia","Hawaii","Idaho","Illinois","Indiana","Iowa","Kansas","Kentucky","Louisiana","Maine","Maryland","Massachusetts","Michigan","Minnesota","Mississippi","Missouri","Montana","Nebraska","Nevada","New Hampshire","New Jersey","New Mexico","New York","North Carolina","North Dakota","Ohio","Oklahoma","Oregon","Pennsylvania","Rhode Island","South Carolina","South Dakota","Tennessee","Texas","Utah","Vermont","Virginia","Washington","West Virginia","Wisconsin","Wyoming"]
[{"$f":"B3&D3","v":"2010United States"},2010,"Democrat","United States",305628607,29823,258552348,236128,38582885,213239,null,null,6743229,99221,94692,176768,64264,573988,140620,89360,30055,56052,427853,244992,49218,53122,277579,130170,66922,90681,92999,88131,32209,159866,144152,178207,104765,68363,148055,35870,43531,109409,38399,193972,50438,363139,207025,24450,188013,90616,100185,209810,24948,117569,27915,143135,411641,75541,18380,232002,166162,49349,111240,28186]
[{"$f":"B4&D4","v":"2010Alabama"},2010,"Republican","Alabama",4729509,3716,3987155,21708,620465,21448,{"$f":"M4-INDEX($M$3:$BL$3,1,MATCH(D4,$M$2:$BL$2,0))","v":9502},{"$f":"K4/E4","v":2.0090880469833127E-3},108723,0,3013,676,1481,3827,1278,454,811,211,15062,21644,267,304,2503,3945,669,649,1967,1901,97,716,435,2334,386,7233,1373,229,169,265,0,356,650,3686,2371,169,2222,880,485,1477,0,2368,31,7409,6500,1336,0,2490,1171,41,1155,27]
["2010Alaska",2010,"Republican","Alaska",702974,1600,565031,7596,95878,7984,-58366,{"$f":"K5/E5","v":-8.3027252786020536E-2},36326,477,0,1354,47,3906,1930,0,0,14,2315,1251,1705,895,388,9,262,106,1440,100,574,704,107,923,530,263,0,616,215,240,316,413,421,255,698,69,156,1455,1793,126,0,121,531,477,4123,1274,353,714,2421,0,158,81]
["2010Arizona",2010,"Republican","Arizona",6332786,4439,5069002,35057,1001991,32027,45957,7.2569955782494462E-3,222725,416,3109,0,689,47164,7687,479,738,0,7712,4261,1966,2147,12250,2690,3008,1935,1705,2014,241,1284,1449,6354,5421,272,4567,1343,1750,10342,64,1782,4419,6618,4463,826,5225,2910,5430,5535,403,2310,1351,3061,14705,7164,664,3413,12645,595,5556,593]
["2010Arkansas",2010,"Republican","Arkansas",2888304,2453,2387806,18627,412997,17485,14863,5.1459264675740501E-3,79127,1405,934,777,0,4457,2535,451,0,154,3578,3921,129,618,3221,722,85,3611,2540,4012,0,306,190,1506,222,2764,7320,85,394,67,0,77,0,289,1561,0,1137,8607,239,731,0,1496,243,2653,13707,361,0,494,264,0,821,443]
["2010California",2010,"Democrat","California",36907897,10889,30790221,71574,5413287,66460,-129239,-3.5016625303793385E-3,444749,3364,9579,33854,4172,0,15662,4631,643,3683,20362,8820,9528,5719,16482,6550,3163,3857,3394,2989,1796,10626,11969,10435,5095,2757,6921,3009,3062,27724,1614,10108,4632,20981,9593,392,8170,5708,20913,9948,526,5016,1604,4349,36582,10653,525,14232,30544,1446,6031,1336]
["2010Colorado",2010,"Democrat","Colorado",4988190,3936,4042039,25546,725413,23003,45746,9.1708615750402452E-3,186366,954,2225,12287,1034,26089,0,459,486,479,8849,6445,2355,839,6950,3296,2140,4308,1961,968,532,1532,2242,4587,2878,1277,1978,2042,4065,4131,791,1259,3921,4594,2940,802,2838,3464,4330,3928,192,1231,1847,1628,22253,4748,350,2739,7583,623,2499,4418]
["2010Connecticut",2010,"Democrat","Connecticut",3541146,2779,3100742,16358,342904,15404,-12027,-3.3963581281314017E-3,77333,896,0,664,334,4479,547,0,149,331,9207,748,182,147,3391,1074,108,0,400,0,528,1531,8510,770,934,67,42,0,0,507,1049,3475,112,20727,1345,0,1296,145,640,1955,1728,1140,0,430,1887,0,458,1735,2084,442,1092,47]
["2010Delaware",2010,"Democrat","Delaware",889812,1573,764640,9145,90001,8498,704,7.9117836127181923E-4,30759,128,68,60,0,353,178,714,0,432,2362,585,0,0,612,0,0,28,163,0,294,4969,689,61,55,0,539,73,0,106,139,3678,59,4251,424,0,325,0,0,7318,149,195,0,146,178,0,0,1051,377,0,0,0]
["2010District of Columbia",2010,"Democrat","District of Columbia",596747,1124,474676,8281,63766,6163,-4808,-8.0570157872599281E-3,51244,360,591,662,155,4205,656,926,0,0,1100,1597,0,0,615,711,392,83,94,0,76,13503,1376,126,87,0,272,0,62,0,137,1924,61,3852,1897,98,598,0,601,2378,249,380,0,591,1180,0,199,7915,284,860,391,0]
["2010Florida",2010,"Democrat","Florida",18647600,7733,15554008,45602,2459530,38387,55036,2.9513717582959737E-3,482889,15830,5887,3907,3611,22130,6428,11183,3099,1110,0,35615,2021,884,17432,9030,2921,4136,6321,7232,5497,13241,13900,21359,5439,7929,7984,338,1544,7050,3645,22344,900,55011,19108,794,21047,3466,1655,19935,1982,10759,430,12882,24039,2833,1442,20080,3573,5634,8081,191]
["2010Georgia",2010,"Republican","Georgia",9587237,5924,8015409,37393,1278548,36794,4467,4.6593194681637682E-4,249459,13840,3645,2554,599,8909,3224,2619,837,1708,49901,0,1040,414,9736,2649,1096,1355,6525,3645,0,5382,3910,6857,1169,2380,3072,52,148,1155,162,4151,826,12472,15361,0,9323,2070,843,6294,43,15562,557,14445,11424,380,361,8393,4495,358,3416,102]
["2010Hawaii",2010,"Democrat","Hawaii",1346274,1690,1140572,10422,134315,9295,4363,3.2407964500540008E-3,53581,749,743,1398,0,12677,1073,307,0,0,4599,2013,0,42,715,192,68,387,95,88,89,990,1283,627,476,234,170,150,0,1925,496,443,11,1339,1510,69,625,57,1834,553,644,322,267,142,6694,467,0,2644,2705,483,1168,18]
["2010Idaho",2010,"Republican","Idaho",1550967,1954,1279856,12606,209272,10887,2516,1.6222137543867793E-3,55638,376,3264,3086,45,8932,1372,0,0,144,612,313,123,0,169,132,773,422,315,59,202,44,115,427,465,37,425,1509,0,2110,109,97,694,155,134,96,325,711,3202,172,0,0,296,1153,1746,8014,0,611,10876,133,233,1410]
["2010Illinois",2010,"Democrat","Illinois",12680126,5467,11009852,32636,1404525,28126,-73620,-5.8059359977968676E-3,203959,1397,1764,5921,1194,16205,3850,2264,56,1047,8051,6781,1224,313,0,21918,9141,1970,2921,1419,55,1985,2811,11865,4300,1093,16703,928,546,2541,206,2331,996,8479,5504,1112,5103,1459,1224,5190,838,1565,292,3999,12245,658,260,3831,1642,812,15364,586]
["2010Indiana",2010,"Democrat","Indiana",6414862,4257,5431015,24897,833086,22796,-2817,-4.3913649272579833E-4,127353,1502,177,2210,1548,8959,1362,544,0,181,5496,1623,267,772,27950,0,1885,1582,10643,749,30,1641,103,9361,916,270,3893,164,705,227,114,1876,188,2564,2828,0,13272,681,423,2668,174,584,216,3093,6335,444,45,3673,571,669,1762,413]
["2010Iowa",2010,"Democrat","Iowa",3013053,2381,2553210,15158,375650,12448,5635,1.870196110058469E-3,72557,330,519,1483,247,2847,2554,114,0,53,1364,973,866,315,17016,1710,0,1520,334,315,0,134,189,1439,7564,117,6031,836,4783,623,381,472,492,273,1123,601,632,679,1071,378,0,591,1992,1617,4131,146,45,303,538,0,2705,111]
["2010Kansas",2010,"Republican","Kansas",2820894,2731,2341401,17752,372161,15608,4378,1.5519902555714607E-3,95059,44,1050,2238,1596,6125,6022,85,238,0,2863,1916,128,398,2943,1544,1875,0,1048,890,0,1369,100,806,1562,167,23384,289,2678,1318,76,1743,873,2390,1083,225,1509,7568,514,563,39,137,352,1152,9217,238,75,1648,1175,0,1233,573]
["2010Kentucky",2010,"Republican","Kentucky",4296639,3389,3638259,20337,519887,18955,25444,5.9218379761483333E-3,118443,2161,3017,2598,558,3779,329,698,38,147,10119,6397,520,71,4659,11906,656,1109,0,437,0,1395,1036,4672,930,1442,3153,0,858,76,0,1147,122,2057,3758,0,15598,1153,181,2618,289,1286,163,11153,5758,905,525,3671,716,2297,1993,292]
["2010Louisiana",2010,"Republican","Louisiana",4483529,3720,3826390,25103,547291,22645,9758,{"$f":"K22/E22","v":2.1764105908537671E-3},97889,5740,1504,1960,2382,5751,1215,89,0,264,9394,5766,342,202,2131,948,625,706,1656,0,162,963,995,1301,569,7032,2852,40,119,1552,462,171,294,2161,1443,438,1100,1074,281,1350,0,1130,0,1853,26134,473,0,1278,1509,210,237,31]
["2010Maine",2010,"Democrat","Maine",1313902,1878,1136780,8034,146735,7677,-4451,-3.3876194723807406E-3,27758,402,424,254,67,1066,478,1361,174,55,3025,844,62,0,311,259,337,56,484,115,0,243,3521,122,91,0,201,275,204,345,4058,902,234,2339,1001,55,315,124,0,375,379,148,0,249,458,390,420,654,381,0,0,500]
["2010Maryland",2010,"Democrat","Maryland",5716785,3648,4917637,22981,588879,20180,4618,8.0779668992274508E-4,164484,1641,2672,1124,273,8206,2501,1603,8340,23202,6564,3454,422,357,3300,431,160,781,396,1376,53,0,1983,3572,820,403,1147,86,54,979,1369,9058,238,10736,5787,0,3277,607,723,13467,782,1710,49,2669,5883,655,350,24765,1542,4363,324,230]
["2010Massachusetts",2010,"Democrat","Massachusetts",6489250,3528,5583650,23686,706624,22760,-3990,-6.148630427245059E-4,140162,583,1891,1572,206,14971,1051,13270,131,1539,11118,1409,682,79,2842,1891,307,0,340,0,4666,3660,0,1624,2185,453,1957,388,46,792,9911,4709,161,20002,2798,0,2163,158,228,5316,6965,1659,0,918,7073,207,1526,4542,1627,0,546,0]
["2010Michigan",2010,"Democrat","Michigan",9762127,4595,8310098,29394,1291901,28130,-62058,-6.357016252708042E-3,116149,2403,1040,3197,636,6726,2031,277,167,471,11646,3913,313,66,10651,7816,758,640,2353,1342,645,620,1206,0,1275,656,2921,312,213,1874,437,1676,669,3135,2444,53,9783,2276,537,3134,653,1446,706,4453,7184,545,45,2073,1427,446,6291,568]
["2010Minnesota",2010,"Democrat","Minnesota",5244256,3049,4480630,17843,647946,16565,-14893,-2.8398689919027597E-3,89872,266,1169,4165,279,6233,2521,211,176,306,2575,1776,227,231,6641,1120,4948,1067,402,519,172,1259,1092,2631,0,196,1549,1020,734,540,183,513,151,1309,1673,7316,1035,284,738,730,123,1597,3237,1155,2619,1013,0,2371,1328,200,17929,343]
["2010Mississippi",2010,"Republican","Mississippi",2931228,3253,2510729,16977,340266,16300,3958,1.3502873198536587E-3,72321,8306,1192,187,4941,3000,1167,71,0,0,4814,4014,276,121,3030,1403,114,330,407,7390,0,649,107,2495,863,0,959,314,0,408,0,403,633,1026,2227,0,1312,663,0,750,145,1860,56,8158,5755,232,0,572,508,94,879,490]
["2010Missouri",2010,"Republican","Missouri",5920858,4730,4968921,23164,786726,21904,-2829,-4.7780237256154427E-4,145226,819,1051,2988,4381,9840,1903,243,314,478,8317,2492,380,830,21277,3351,4708,23427,2552,2238,171,1359,1395,2610,1701,1183,0,220,2636,1060,108,1320,150,2630,1825,848,2163,4647,314,1639,0,954,512,3311,12884,1319,498,3206,1107,177,1331,359]
["2010Montana",2010,"Republican","Montana",978507,1744,821709,7063,117752,6986,-240,-2.4527162299298828E-4,35630,212,650,1909,672,5756,2185,128,71,0,1373,46,0,1458,1094,251,169,60,321,85,76,51,59,648,1323,242,564,0,340,548,0,0,660,246,1072,1677,89,182,1620,419,0,110,295,111,2101,964,0,497,3250,0,357,1689]
{"$rows_left_out":129}
{"sheet":"Images","index":3,"n_rows":1,"n_cols":15,"rows_kept":1,"cut":false,"hidden":false,"merged":[]}
["BLUE STATES",null,null,null,null,null,null,null,null,null,null,null,"HELP ICON",null,"RED STATES"]

{"sheet":"Mockup","index":4,"n_rows":32,"n_cols":12,"rows_kept":32,"cut":false,"hidden":false,"merged":[]}
[]
[]
[]
[]
[]
[]
[]
[]
[]
[]
[]
[]
[]
[]
[]
[]
[]
[]
[]
[]
[]
[]
[]
[]
[]
[]
[]
[]
[]
[]
{"$rows_left_out":3}
{"sheet":"Sources","index":5,"n_rows":6,"n_cols":2,"rows_kept":6,"cut":false,"hidden":false,"merged":[]}
["Item","Source"]
["Migration Data","http://www.census.gov/hhes/migration/data/acs/state-to-state.html"]
["State Images","http://ericheikkinen.com/50-states-icon-pack/"]
["2012 State Votes","http://elections.nytimes.com/2012/results/president"]
["2008 State Votes","http://elections.nytimes.com/2008/results/president/map.html?ref=newyorktimes-poll-watch"]
["Mock Up Tab","DataPig Technologies - Dashboard Tool"]